{"text_format":"3","workbook":"xlsx","n_sheets":3,"sheets":["A4","A3","Daten"],"not_rendered":{"defined_names":1},"read":"whole","date_system":"1900"}

{"sheet":"A4","index":0,"n_rows":52,"n_cols":11,"rows_kept":52}
[]
["Gemeinde"]
["[Gemeinde]",{"$nulls":7},"Mutationstabelle Nr:  ",null,"[999]"]
[{"$nulls":4},"Die alten Grundstücksnummern"]
[]
[{"$nulls":3},"Grundstücksnummer: "]
[]
[{"$nulls":3},"Eigentümer: "]
[]
[]
[{"$nulls":3},"Grundbuchblatt: "]
[" sind übertragen auf die neuen Nummern",null,null,"Total der \nneuen Nummern","\nm²",null,"\nm²",null,"\nm²",null,"\nm²"]
[]
["Gbl.","Grund-stücks- Nr.","Eigentümer","m²   "]
{"$rows_empty":25}
[null,null,"Differenz infolge Rundung"]
[]
[null,"Total der alten Nummern"]
[]
[]
[]
["[Ort], [Datum]",{"$nulls":3},"Der Nachführungsgeometer:",null,"[Nachführungsstelle]"]
[{"$nulls":6},"[Nachführungsstelle Adresszeile]"]
[{"$nulls":6},"[Nachführungsstelle Adresszeile]"]
["Die Eigentümerangaben sind unverbindlich - zuständig ist das Grundbuchamt",{"$nulls":5},"[Nachführungsstelle Adresszeile]"]
[]
[{"$f":"CHOOSE(Daten!A4,Daten!B1,Daten!B2,Daten!B3)","v":"Weiteres Exemplar"}]
[{"$f":"CHOOSE(Daten!A4,Daten!C1,Daten!C2,Daten!C3)","v":"Urkunde bei Grundbuchamt und AV-Nachführungsstelle"}]

{"sheet":"A3","index":1,"n_rows":52,"n_cols":29,"rows_kept":52}
[]
["Gemeinde"]
["[Gemeinde]",{"$nulls":7},"Mutationstabelle Nr:  ",null,"[999]"]
[{"$nulls":4},"Die alten Grundstücksnummern"]
[]
[{"$nulls":3},"Grundstücksnummer: "]
[]
[{"$nulls":3},"Eigentümer: "]
[]
[]
[{"$nulls":3},"Grundbuchblatt: "]
[" sind übertragen auf die neuen Nummern",null,null,"Total der \nneuen Nummern","\nm²",null,"\nm²",null,"\nm²",null,"\nm²",null,"\nm²",null,"\nm²",null,"\nm²",null,"\nm²",null,"\nm²",null,"\nm²",null,"\nm²",null,"\nm²",null,"\nm²"]
[]
["Gbl.","Grund-stücks-Nr.","Eigentümer","m²   "]
{"$rows_empty":25}
[null,null,"Differenz infolge Rundung"]
[]
[null,"Total der alten Nummern"]
[]
[]
[]
["[Ort], [Datum]",{"$nulls":3},"Der Nachführungsgeometer:",null,"[Nachführungsstelle]"]
[{"$nulls":6},"[Nachführungsstelle Adresszeile]"]
[{"$nulls":6},"[Nachführungsstelle Adresszeile]"]
["Die Eigentümerangaben sind unverbindlich - zuständig ist das Grundbuchamt",{"$nulls":5},"[Nachführungsstelle Adresszeile]"]
[]
[{"$f":"CHOOSE(Daten!A4,Daten!B1,Daten!B2,Daten!B3)","v":"Weiteres Exemplar"}]
[{"$f":"CHOOSE(Daten!A4,Daten!C1,Daten!C2,Daten!C3)","v":"Urkunde bei Grundbuchamt und AV-Nachführungsstelle"}]

{"sheet":"Daten","index":2,"n_rows":4,"n_cols":3,"rows_kept":4}
["Ohne Urkundenvermerk","Weiteres Exemplar","Urkunde bei Grundbuchamt und AV-Nachführungsstelle"]
["Urkundenvermerk, GBA","Urkunde im Sinne von Art. 25 VAV","Exemplar 1 von 2 (Grundbuchamt)"]
["Urkundenvermerk, NF-Stelle","Urkunde im Sinne von Art. 25 VAV","Exemplar 2 von 2 (AV-Nachführungsstelle)"]
[1]