{"text_format":"1","workbook":"xlsx","n_sheets":21,"sheets":["Hinweise","Intern","Logbuch","Undo","tmpMonat","Basisblatt","Januar","Februar","März","April","Mai","Juni","Juli","August","September","Oktober","November","Dezember","Jahresabrechnung","Kalender","Verweise"],"not_rendered":{"charts":0,"images":1,"macros":1,"external_links":0,"defined_names":145,"comments":0,"pivot_tables":0},"unopened":[],"bounds":{"document_bytes":16777216,"sheet_cells":100000,"rows_first":2000,"rows_last":500,"rows_between":2000,"halvings":0,"cell_chars":16384,"cell_head_chars":4096},"cells_cut":0,"cells_raw":0,"read":"whole","date_system":"1900"}

{"sheet":"Hinweise","index":0,"n_rows":52,"n_cols":40,"rows_kept":52,"cut":false,"hidden":false,"merged":[[22,3,22,4],[23,3,23,4],[24,3,24,4],[25,3,25,4],[21,3,21,4],[7,1,8,1],[16,1,20,1],[6,3,6,11],[13,6,14,9],[12,8,12,9],[12,3,12,4],[13,3,14,3],[13,4,14,4],[17,3,17,4],[18,3,18,4],[19,3,19,4],[20,3,20,4]]}
[null,{"$f":"\"Einige wichtige Hinweise zum \nAusfüllen der Zeiterfassung \" & SL_Jahr","v":"Einige wichtige Hinweise zum \nAusfüllen der Zeiterfassung 2024"},null,{"$f":"IF(VSATestModus=TRUE(),\"VSA-Modus!\",\"\")","v":""}]
[]
[]
[]
[null,"Erste Schritte:",null,"Neu ab dieser Tool-Version 1.0 (Makro unterstütztes Tool)"]
[]
[null,"1. Wenn Sie das Zeiterfassungstool zum ersten Mal benutzen, gehen Sie direkt zum Basisblatt und vervollständigen Sie dort Ihre Daten. Anschliessend weiter zu 2. Wenn Sie bereits im Vorjahr mit einer Zeiterfassung ab Version 5 gearbeitet haben, können Sie die Werte aus dem Vorjahr übertragen (vgl. 1.1).Tragen sie die E-Mail-Adresse ihrer vorgesetzten Stelle (VG) ein, damit sie komfortabler ein vorgetextetes Email für das Senden der Zwischendateien erstellen können.\n",null,{"$f":"\"Sie werden diverse Neuigkeiten gegenüber der Version 5 bemerken, Buttons in verschiedenen Farben zu verschiedenen Aktionen, Blattregisterfarben etc. Auch dass nur relevante Monate eingeblendet sind.\" &IF(VSA_HELPLINK=\"\",\"\",\n\"Damit sie das ganze neue System, Zwischendateien, Visieren, Senden an VG etc. besser verstehen, sollten sie das Handbuch mit dem folgenden Link einsehen:\")","v":"Sie werden diverse Neuigkeiten gegenüber der Version 5 bemerken, Buttons in verschiedenen Farben zu verschiedenen Aktionen, Blattregisterfarben etc. Auch dass nur relevante Monate eingeblendet sind.Damit sie das ganze neue System, Zwischendateien, Visieren, Senden an VG etc. besser verstehen, sollten sie das Handbuch mit dem folgenden Link einsehen:"}]
[null,"1.1 Übertrag der Daten aus dem Vorjahr. Im Basisblatt befindet sich der grüne Button 'Daten übertragen'. Wählen sie im Dialog \"Ja\". Sie werden geführt die Vorjahresdatei finden, damit die Daten von dieser Datei übernommen werden.",null,"http://www.vsa.zh.ch"]
[null,null,null,"Weitere Hinweise und Anregungen können Sie per E-Mail senden an: ",null,null,null,null,null,null,"Besten Dank."]
[null,"2. Beginnt Ihr Arbeitsverhältnis als Schulleiterin oder als Schulleiter erst ab dem 1. August, schreiben Sie im Basisblatt unter dem Titel 'Beschäftigungsgrad...' in die zweite Datenzeile das Datum des ersten Anstellungstags und ihr Beschäftigungsgrad als Schulleiterin oder als Schulleiter. Das Endedatum in der Zeile darüber wird automatisch auf einen Tag zuvor gesetzt. Den BG in der ersten Zeile in diesem Fall auf 0 setzen!",null,"lehrpersonal@vsa.zh.ch"]
[null,"2.1 Nach dem Eintrag des BG wie vorher beschrieben werden die Wochentage abgebildet. Sie gebenunterhalb des Titels 'Regelarbeitszeit' ihre geplante Tagesarbeitszeit von Montag bis Freitag ein (pro Tag max. 8.40 h). Bitte beachten Sie, dass die Summe der hier eingegebenen Zeit der 'Empf. Arb.zeit' (rechts) entspricht. Eine Farbe im Kasten \"Kontrolle Woche\" weist daraufhin, dass die Stunden noch angepasst werden müssen."]
[null,"3. Lokale Feiertage können nicht mehr manuell im Blatt 'Kalender' eingetragen werden. Damit sie die entsprechenden Feiertage richtig zugeordnet bekommen, müssen sie lediglich das Feld \"Bezirk\" (im Basisblatt oben links) korrekt auswählen. Für die Stadt Zürich wird je ein halber Tag für Sechseläuten und Knabenschiessen gewährt. Alle ausserhalb Zürich erhalten einen ganzen Feiertag am Fasnachtsmontag."]
[null,"3.1. Regelmässige, im Stundenplan eingetragene Unterrichtslektionen, werden nicht in diesem Tool erfasst.",null,"Hilfstabelle zur Umrechnung\nUhrzeitformat > Dezimal",null,null,"\"Rote Hand\"",null,"I"]
[null,"3.2 Für die Erfassung weiterer bewilligter Tätigkeiten stehen zwei freie Zeilen zur Verfügung. Diese können im Basisblatt (rechts) unter dem Titel 'Beschriftungen für Freie Zeilen 1+2' eingetragen werden.",null,"0:05\n0:10\n0:15\n0:20\n0:25\n0:30\n0:35\n0:40\n0:45\n0:50\n0:55","0.08 \n0.17\n0.25\n0.33\n0.42\n0.50\n0.58\n0.67\n0.75\n0.83\n0.92",null,"Dieses Symbol erscheint am unteren Rand des Monatsblatts wenn die Summe aus Ihrer Arbeitsleistung (oben) und den Abwesenheitszeiten (unten) grösser ist als die Normalarbeitszeit.\nDie Total Arbeitszeit (IST) wird höchstens bis zur Normalarbeitszeit berechnet."]
[null,"4. Die Zeitangaben werden in den unteren Zeilen ab 'Ferien' weiterhin dezimal eingegeben. Nebenan sehen sie eine Hilfe zur Umrechnung.\nBeispiele: 6.25 (= 6:15 = 61/4 Std.)          5.75 (= 5:45 = 5 3/4 Std.)\nAm einfachsten ist die Eingabe der Abwesenheitsstunden auf Viertelstunden genau.  Siehe rote Zeiten in der Hilfstabelle rechts."]
[]
[null,"5. Ab Januar 2020 wurden die Arbeitszeiten nicht mehr einem Bereich zugeordnet. An Stelle dessen werden 4 \"Ein/Aus-Blocks\" angeboten. In diese werden Uhrzeiten eingetragen. Damit keine unstimmigen Werte in der Präsenzzeit entstehen, wird die Summe ihrer Anwesenheit erst dann ersichtlich wenn kein Eingabefehler vorhanden ist. Nebenan finden sie ein paar Beispiele."]
[null,null,null,"Ein   >>>",null,"08:00:00","08:00:00","07:00:00","08:00:00","08:00:00","08:00:00"]
[null,null,null,"<<<   Aus",null,"10:45:00","15:00:00","11:00:00",null,"10:00:00","10:00:00"]
[null,null,null,"Ein   >>>",null,"10:30:00",null,"11:15:00",null,null,"10:30:00"]
[null,null,null,"<<<   Aus",null,"17:00:00",null,"17:24:00",null,null,"17:00:00"]
[null,"Die Ein-Zeit ist früher als die vorangegangene Aus-Zeit. (auch andere Fehler)",null,"Ein   >>>",null,"17:10:00",null,"18:00:00",null,"10:30:00"]
[null,"Es wurde über 6 Std. ohne zusammenhängende 30 Minuten-Pause gearbeitet.",null,"<<<   Aus",null,"18:45:00",null,"18:15:00",null,"17:00:00"]
[null,"Dies ist kein eigentlicher Fehler. Es wird lediglich die fehlende Ein/Aus-Zeit markiert.",null,"Ein   >>>"]
[null,"Die Zeiten müssen lückenlos von oben nach unten eingetragen werden",null,"<<<   Aus"]
[null,"Hier sind alle Eingaben korrekt: Keine Farben, die Präsenzzeit wird angezeigt.",null,{"$f":"B_PrZeit","v":"Präsenzzeit"},null,{"$f":"24*(F19-F18+F21-F20+F23-F22+F25-F24)*E109","v":0},{"$f":"24*(G19-G18+G21-G20+G23-G22+G25-G24)*F109","v":0},{"$f":"24*(H19-H18+H21-H20+H23-H22+H25-H24)*G109","v":0},{"$f":"24*(I19-I18+I21-I20+I23-I22+I25-I24)*H109","v":0},{"$f":"24*(J19-J18+J21-J20+J23-J22+J25-J24)*I109","v":0},{"$f":"24*(K19-K18+K21-K20+K23-K22+K25-K24)","v":8.5000000000000018}]
[null,null,null,null,null,null,null,null,null,"(die Präsenzzeit erscheint erst bei fehlerfreien Eingaben)"]
[null,"6. Alle Tabellenblätter sind für dieses Tool von Nöten. Versuchen sie nie, ein solches zu löschen, da das ganze Tool dadurch zerstört wird. Eine Datenübernahme aus einem zerstörten Tool wäre nicht mehr möglich!"]
[null,"6.1. 'Kopieren und Einfügen' funktioniert infolge Formelschutz nicht überall."]
[null,"7. Eine Eingabe in 'in der Zukunft' ist theoretisch möglich. Der Arbeitszeitzähler wird jedoch nur bis zum heutigen Datum (oder dem von Hand eingestellten Datum) nachgeführt."]
[null,"8. Es empfiehlt sich, regelmässig ein Backup vorzunehmen."]
[]
[]
[]
[]
[]
[]
[]
[]
[]
[]
[]
[]
[]
[]
[]
[]
[]
[]
[]
[]
[null,null,null,null,null,null,null,null,null,null,null,null,null,null,null,null,null,null,null,null,null,null,null,null,null,null,null,null,null,null,null,null,null,null,null,null,null,null,null,0]

{"sheet":"Intern","index":1,"n_rows":57,"n_cols":20,"rows_kept":57,"cut":false,"hidden":true,"merged":[[29,12,33,16],[27,12,27,16]]}
[]
[1,2,3,4,5,6,7,8,9,10,null,null,null,"Versionen",null,null,"Sprachcodes",null,"Erfasst"]
["Bereich: \"BlattKontrolle\"",null,null,null,null,null,"(Eingaben)","(Vorherige)","(7 und 8)",{"$f":"IFERROR(MATCH(1,D5:D17,0),0)=0","v":true},"Formelfehler",null,"OS","Office","Ver","Installiert","Oberfläche","Hilfe","Timestamp"]
["Index","sh","Hinweise","Status","temp",null,"Abschliessbar 1","Abschliessbar 2","Ist Abschliessbar","Entsperrbar",{"$f":"IFERROR(INDIRECT($C4&\"!\"&K$19),1)","v":0},null,null,null,null,null,null,null,"leer",1]
[1,0,"Basisblatt",{"$f":"INDIRECT($C5&\"!\"&D$19)","v":3},{"$f":"IF(D5<0,99,D5)","v":3},{"$f":"INDIRECT($C5&\"!\"&F$19)","v":"Eingaben vornehmen"},{"$f":"INDIRECT($C5&\"!\"&G$19)","v":false},true,{"$f":"AND(G5,H5)","v":false},{"$f":"OR($J$3,D5=1,D5=2)","v":true},{"$f":"IFERROR(INDIRECT($C5&\"!\"&K$19),1)","v":0},"1. Kontrolle",null,null,null,null,null,null,null,{"$f":"NOT(M5=\"\")*2","v":0}]
[2,1,"Januar",{"$f":"INDIRECT($C6&\"!\"&D$19)","v":-1},{"$f":"IF(D6<0,99,D6)","v":99},{"$f":"INDIRECT($C6&\"!\"&F$19)","v":"Nicht Relevant"},{"$f":"INDIRECT($C6&\"!\"&G$19)","v":false},{"$f":"MIN($E$5:E5,5)=5","v":false},false,{"$f":"OR($J$3,D6=1,D6=2)","v":true},{"$f":"IFERROR(INDIRECT($C6&\"!\"&K$19),1)","v":0},"2. Kontrolle",null,null,null,null,null,null,null,{"$f":"NOT(M6=\"\")*3","v":0}]
[3,2,"Februar",{"$f":"INDIRECT($C7&\"!\"&D$19)","v":-1},99,{"$f":"INDIRECT($C7&\"!\"&F$19)","v":"Nicht Relevant"},{"$f":"INDIRECT($C7&\"!\"&G$19)","v":false},{"$f":"MIN($E$5:E6,5)=5","v":false},false,{"$f":"OR($J$3,D7=1,D7=2)","v":true},{"$f":"IFERROR(INDIRECT($C7&\"!\"&K$19),1)","v":0},"3. Kontrolle",null,null,null,null,null,null,null,{"$f":"NOT(M7=\"\")*4","v":0}]
[4,3,"März",{"$f":"INDIRECT($C8&\"!\"&D$19)","v":-1},99,{"$f":"INDIRECT($C8&\"!\"&F$19)","v":"Nicht Relevant"},{"$f":"INDIRECT($C8&\"!\"&G$19)","v":false},{"$f":"MIN($E$5:E7,5)=5","v":false},false,true,{"$f":"IFERROR(INDIRECT($C8&\"!\"&K$19),1)","v":0}]
[5,4,"April",{"$f":"INDIRECT($C9&\"!\"&D$19)","v":-1},99,{"$f":"INDIRECT($C9&\"!\"&F$19)","v":"Nicht Relevant"},{"$f":"INDIRECT($C9&\"!\"&G$19)","v":false},{"$f":"MIN($E$5:E8,5)=5","v":false},false,true,{"$f":"IFERROR(INDIRECT($C9&\"!\"&K$19),1)","v":0},"Aktuell",{"$f":"INDEX(M4:M7,$T$9)&\"\"","v":""},{"$f":"INDEX(N4:N7,$T$9)","v":0},{"$f":"INDEX(O4:O7,$T$9)","v":0},{"$f":"INDEX(P4:P7,$T$9)","v":0},{"$f":"INDEX(Q4:Q7,$T$9)","v":0},{"$f":"INDEX(R4:R7,$T$9)","v":0},{"$f":"INDEX(S4:S7,$T$9)","v":"leer"},{"$f":"MAX(T4:T7)","v":1}]
[6,5,"Mai",{"$f":"INDIRECT($C10&\"!\"&D$19)","v":-1},99,{"$f":"INDIRECT($C10&\"!\"&F$19)","v":"Nicht Relevant"},{"$f":"INDIRECT($C10&\"!\"&G$19)","v":false},{"$f":"MIN($E$5:E9,5)=5","v":false},false,true,{"$f":"IFERROR(INDIRECT($C10&\"!\"&K$19),1)","v":0}]
[7,6,"Juni",{"$f":"INDIRECT($C11&\"!\"&D$19)","v":-1},99,{"$f":"INDIRECT($C11&\"!\"&F$19)","v":"Nicht Relevant"},{"$f":"INDIRECT($C11&\"!\"&G$19)","v":false},{"$f":"MIN($E$5:E10,5)=5","v":false},false,true,{"$f":"IFERROR(INDIRECT($C11&\"!\"&K$19),1)","v":0},null,"Win",365,16,null,"Soll (optimal)"]
[8,7,"Juli",{"$f":"INDIRECT($C12&\"!\"&D$19)","v":-1},99,{"$f":"INDIRECT($C12&\"!\"&F$19)","v":"Nicht Relevant"},{"$f":"INDIRECT($C12&\"!\"&G$19)","v":false},{"$f":"MIN($E$5:E11,5)=5","v":false},false,true,{"$f":"IFERROR(INDIRECT($C12&\"!\"&K$19),1)","v":0},null,"Mac",2019,15,2055,1031,1031]
[9,8,"August",{"$f":"INDIRECT($C13&\"!\"&D$19)","v":-1},99,{"$f":"INDIRECT($C13&\"!\"&F$19)","v":"Nicht Relevant"},{"$f":"INDIRECT($C13&\"!\"&G$19)","v":false},{"$f":"MIN($E$5:E12,5)=5","v":false},false,true,{"$f":"IFERROR(INDIRECT($C13&\"!\"&K$19),1)","v":0},null,null,2016,null,"DE-CH","DE_DE","DE_DE"]
[10,9,"September",{"$f":"INDIRECT($C14&\"!\"&D$19)","v":-1},99,{"$f":"INDIRECT($C14&\"!\"&F$19)","v":"Nicht Relevant"},{"$f":"INDIRECT($C14&\"!\"&G$19)","v":false},{"$f":"MIN($E$5:E13,5)=5","v":false},false,{"$f":"OR($J$3,D14=1,D14=2)","v":true},{"$f":"IFERROR(INDIRECT($C14&\"!\"&K$19),1)","v":0}]
[11,10,"Oktober",{"$f":"INDIRECT($C15&\"!\"&D$19)","v":-1},99,{"$f":"INDIRECT($C15&\"!\"&F$19)","v":"Nicht Relevant"},{"$f":"INDIRECT($C15&\"!\"&G$19)","v":false},{"$f":"MIN($E$5:E14,5)=5","v":false},false,true,{"$f":"IFERROR(INDIRECT($C15&\"!\"&K$19),1)","v":0},"Die OS Version wird bei jedem Logeintrag überprüft, Wenn OS abweicht: Neue Zeile (max. 3)"]
[12,11,"November",{"$f":"INDIRECT($C16&\"!\"&D$19)","v":-1},99,{"$f":"INDIRECT($C16&\"!\"&F$19)","v":"Nicht Relevant"},{"$f":"INDIRECT($C16&\"!\"&G$19)","v":false},{"$f":"MIN($E$5:E15,5)=5","v":false},false,true,{"$f":"IFERROR(INDIRECT($C16&\"!\"&K$19),1)","v":0}]
[13,12,"Dezember",{"$f":"INDIRECT($C17&\"!\"&D$19)","v":-1},99,{"$f":"INDIRECT($C17&\"!\"&F$19)","v":"Nicht Relevant"},{"$f":"INDIRECT($C17&\"!\"&G$19)","v":false},{"$f":"MIN($E$5:E16,5)=5","v":false},false,true,{"$f":"IFERROR(INDIRECT($C17&\"!\"&K$19),1)","v":0}]
[14,null,"Jahresabrechnung",{"$f":"INDIRECT($C18&\"!\"&D$19)","v":3},{"$f":"IF(D18<0,99,D18)","v":3},{"$f":"INDIRECT($C18&\"!\"&F$19)","v":"Warten"},{"$f":"INDIRECT($C18&\"!\"&G$19)","v":false},{"$f":"MIN($E$5:E17,5)=5","v":false},{"$f":"MIN(E5:E17)>=5","v":false},true,{"$f":"SUM(K5:K17)","v":0}]
[null,null,null,"AP10",null,"AP11","AP6",null,null,null,"AN52","Vorgetextete Email",null,"Achtung bei Mac: Alle Umlaute werden für den Link umgewandelt ."]
[null,null,null,false,"nicht mehr verwendet!! (vorher: Basisblatt kann ohne senden abgeschlossen werden)"]
[null,null,null,null,null,null,null,null,null,null,null,"Variable:","[OBJEKT]","Monatsblatt","Basisblatt","Jahresabrechnung"]
[null,null,"TPraefix","Version VSA",null,null,"Mind. ausgefüllte Regelarbeitstage",1,null,null,null,null,"[ZEITRAUM]","202305",2023,2023]
[null,null,"TVersion",106,null,null,null,null,null,null,null,null,null,"Hans Huber_123456_Basisblatt_2023_20230520.xlsx"]
[null,null,"TVers2",{"$f":"TEXT(D23/100,\"0.00\")","v":"1.06"},null,null,"Kontrolle Anz. Feiertage",{"$f":"COUNTA(Kalender!H7:I372)","v":17},"muss in Vorlagen Null oder leer sein!!",null,null,null,"[FILENAME]","Hans Huber_123456_Monatsblatt_202305_20230520.xlsx"]
[null,null,"TZusatz",null,null,null,null,null,"(17 ist korrekt für SL-Tools)",null,null,null,null,"Hans Huber_123456_Jahresabrechnung_2023_20230520.xlsx"]
[null,null,null,null,null,null,"Feiertagstexte in Zeilen 44",{"$f":"IF(SUBTOTAL(103,Dezember!D44:AH44)=0,\"nicht angezeigt\",\"angezeigt\")","v":"angezeigt"},"Sub FeiertagsanzeigeEinblenden()",null,null,null,"[SLNAME]","Der Name der SL aus dem Basisblatt"]
[null,null,null,null,null,null,"Feiertagstexte in Zeilen 44 anzeigen?",1,"1: anzeigen, Leer: ausblenden"]
[null,null,"Hat Bezugs/Formelfehler:",{"$f":"IFERROR(SUM(K5:K18)>0,TRUE())","v":false},null,"=WENNFEHLER(SUMME(K5:K18)>0;WAHR())",null,null,null,null,null,"Betreff:","[OBJEKT] [ZEITRAUM] zur Kontrolle"]
[null,null,"tmp. Kopierschutz eingeschaltet",false,null,"Zugelassene Benutzer (Maske)"]
[null,null,"Im VSA Test-Modus",false,null,"B252*",null,{"$f":"IF(VSATestModus=TRUE(),\"VSA-Modus!\",\"\")","v":""},null,null,null,null,"Guten Tag\n\nHiermit sende ich die Zwischendatei\n[FILENAME]\nzur Kontrolle.\n\nMit freundlichem Gruss\n[SLNAME]"]
[]
[null,null,"Versionsverlauf unten",null,"Vorlage muss nach Weiterentwicklung jedesmal neu erstellt werden!"]
[]
[null,"Versionen"]
[null,1.02,"Pfadlänge korolliert in Function GetSavePath() ",null,null,"(Erzeugt immer noch XLSM-Zwischendateien)"]
[null,null,"nicht dringend, aber für zukünftige Ausgaben bereit"]
[]
[null,null,"Alle Blätter anzeigen \"VSA-Hack\""]
[null,null,"Feiertagsanzeige von hier umschaltbar: Sub FeiertagsanzeigeEinblenden()"]
[]
[null,1.03,"Basisblatt: Berechnungen \"Total\" auf Zeilen 25 bis 31 verifiziert"]
[null,null,"und alle Uebertragsfelder (Spalte E): Keine manuellen Eingaben mehr."]
[]
[null,null,"Modul \"Daten\": Sub DatenVorjahr: Uebernahme angepasst, Blattschutz daher ein/aus."]
[]
[null,null,"Modul \"Export\": Function \"Zwischendatei_Erstellen\" neu als XLSX (ohne Makros)"]
[null,null,"Function \"GetInfo\" angepasst, damit XLSM und/oder XLSX verarbeitet werden können."]
[]
[null,1.04,"Fehler bei der Funktion \"DatenVorversion\" behoben (Visierungszeilen wurden alle in das Basisblatt"]
[null,null,"gescrieben, was in D39 eine Formel zerstörte."]
[]
[null,1.05,"Unterbinden von Verschieben und Ausschneiden/Einfügen und Blatt-Löschen 1)"]
[null,null,"Zugriff für VSA-User durch Erkennung anhand User-ID"]
[null,null,"Monatsblatt reparieren (X_Monate)"]
[null,null,"Blatt reparieren im VSA Modus möglich"]
[]
[null,null,"Kritische Fehlermeldungen enthalten einen codierten Umgebungscode im Titel"]

{"sheet":"Logbuch","index":2,"n_rows":4,"n_cols":9,"rows_kept":4,"cut":false,"hidden":true,"merged":[]}
[]
[]
["Aktions-Logeinträge:",{"$f":"COUNTA(A5:A5004)","v":0},null,null,null,null,null,null,"Maximal 5000 Einträge möglich"]
["Timestamp","Computername","Benutzername","Objekt","Betreff","Aktion","Weitere Aktionen","Speziell, Grund","Zwischendatei-Name"]

{"sheet":"Undo","index":3,"n_rows":54,"n_cols":46,"rows_kept":54,"cut":false,"hidden":true,"merged":[]}
[null,null,null,null,null,null,null,null,null,null,null,null,null,null,null,null,null,null,null,null,null,null,null,null,null,null,null,null,null,null,null,null,null,null,null,{"$f":"COLUMN()","v":36},{"$f":"COLUMN()","v":37},null,{"$f":"COLUMN()","v":39},{"$f":"COLUMN()","v":40},{"$f":"COLUMN()","v":41},{"$f":"COLUMN()","v":42},{"$f":"COLUMN()","v":43},{"$f":"COLUMN()","v":44},{"$f":"COLUMN()","v":45}]
["Blatt:",null,null,"Die Daten werden immer beim Entsperren zurückgesetzt und neu kopiert.",null,null,null,null,null,null,null,null,null,null,null,null,null,null,null,null,null,null,null,null,null,null,null,null,null,null,null,null,null,null,null,"Nr","Status"]
[null,null,null,null,null,null,null,null,null,null,null,null,null,null,null,null,null,null,null,null,null,null,null,null,null,null,null,null,null,null,null,null,null,null,null,1,null,null,null,null,null,null,null,null,null,"Maximale Nummer"]
[null,null,null,1,2,3,4,5,6,7,8,9,10,11,12,13,14,15,16,17,18,19,20,21,22,23,24,25,26,27,28,29,30,31,null,2,null,null,null,null,null,null,null,null,null,{"$f":"MAX(AK3:AK54)","v":0}]
[null,"     Ein   >>>",null,null,null,null,null,null,null,null,null,null,null,null,null,null,null,null,null,null,null,null,null,null,null,null,null,null,null,null,null,null,null,null,null,5]
[null,"<<<   Aus     ",null,null,null,null,null,null,null,null,null,null,null,null,null,null,null,null,null,null,null,null,null,null,null,null,null,null,null,null,null,null,null,null,null,2]
[null,"     Ein   >>>",null,null,null,null,null,null,null,null,null,null,null,null,null,null,null,null,null,null,null,null,null,null,null,null,null,null,null,null,null,null,null,null,null,1]
[null,"<<<   Aus     ",null,null,null,null,null,null,null,null,null,null,null,null,null,null,null,null,null,null,null,null,null,null,null,null,null,null,null,null,null,null,null,null,null,1]
[null,"     Ein   >>>"]
[null,"<<<   Aus     "]
[null,"     Ein   >>>"]
[null,"<<<   Aus     ",null,null,null,null,null,null,null,null,null,null,null,null,null,null,null,null,null,null,null,null,null,null,null,null,null,null,null,null,null,null,null,null,null,null,null,null,null,null,null,null,null,null,null,"E-Mail-Adresse der vorgesetzten Stelle:"]
[null,null,null,null,null,null,null,null,null,null,null,null,null,null,null,null,null,null,null,null,null,null,null,null,null,null,null,null,null,null,null,null,null,null,null,1]
[]
[null,null,null,"Werte nur beim \"Entsperren\" aus dem betreffenden Monat als Werte herauskopiert."]
["HatDaten:",{"$f":"COUNTA(B2,D5:AH12,D20:AH35,AK3:AS54)>0","v":false},null,"Beim Drücken von \"Abschliessen\" können die Änderungen zurückgenommen werden",null,null,null,null,null,null,null,null,null,null,null,null,null,null,null,null,null,null,null,null,null,null,null,null,null,null,null,null,null,null,null,null,null,null,null,null,null,null,null,null,null,"Startsaldi / Jahresübertrag"]
[null,null,null,"Dann werden alle diese Werte im betreffenden Monat wieder eingetragen"]
[]
[]
[null,"Ferien"]
[null,"Kompensation Arbeitstage"]
[null,"Arztbesuch"]
[null,"Krankheit"]
[null,"Berufsunfall"]
[null,"Nichtberufsunfall",null,null,null,null,null,null,null,null,null,null,null,null,null,null,null,null,null,null,null,null,null,null,null,null,null,null,null,null,null,null,null,null,null,2]
[null,"Militär / Zivilschutz",null,null,null,null,null,null,null,null,null,null,null,null,null,null,null,null,null,null,null,null,null,null,null,null,null,null,null,null,null,null,null,null,null,2]
[null,"Unbezahlter Urlaub",null,null,null,null,null,null,null,null,null,null,null,null,null,null,null,null,null,null,null,null,null,null,null,null,null,null,null,null,null,null,null,null,null,2]
[null,"Bezahlter Urlaub",null,null,null,null,null,null,null,null,null,null,null,null,null,null,null,null,null,null,null,null,null,null,null,null,null,null,null,null,null,null,null,null,null,2]
[null,"Nebenbeschäftigung",null,null,null,null,null,null,null,null,null,null,null,null,null,null,null,null,null,null,null,null,null,null,null,null,null,null,null,null,null,null,null,null,null,2]
[null,"D A G"]
[null,"Diverses",null,null,null,null,null,null,null,null,null,null,null,null,null,null,null,null,null,null,null,null,null,null,null,null,null,null,null,null,null,null,null,null,null,2]
[null,"Fam./pers. Ereignisse"]
[null,"freie Zeile 1"]
[null,"freie Zeile 2"]
[null,"Weiterbildung"]
[]
[null,null,null,null,null,null,null,null,null,null,null,null,null,null,null,null,null,null,null,null,null,null,null,null,null,null,null,null,null,null,null,null,null,null,null,null,null,null,null,null,null,null,null,null,null,"Beschäftigungsgrad, Ferienanspruch, empfohlene regelmässige Arbeitszeit"]
[]
[]
[null,null,null,null,null,null,null,null,null,null,null,null,null,null,null,null,null,null,null,null,null,null,null,null,null,null,null,null,null,null,null,null,null,null,null,3]
[null,null,null,null,null,null,null,null,null,null,null,null,null,null,null,null,null,null,null,null,null,null,null,null,null,null,null,null,null,null,null,null,null,null,null,3]
[null,null,null,null,null,null,null,null,null,null,null,null,null,null,null,null,null,null,null,null,null,null,null,null,null,null,null,null,null,null,null,null,null,null,null,3]
[null,null,null,null,null,null,null,null,null,null,null,null,null,null,null,null,null,null,null,null,null,null,null,null,null,null,null,null,null,null,null,null,null,null,null,3]
[null,null,null,null,null,null,null,null,null,null,null,null,null,null,null,null,null,null,null,null,null,null,null,null,null,null,null,null,null,null,null,null,null,null,null,3]
[]
[]
[]
[null,null,null,null,null,null,null,null,null,null,null,null,null,null,null,null,null,null,null,null,null,null,null,null,null,null,null,null,null,null,null,null,null,null,null,null,null,null,null,null,null,null,null,null,null,"Regelarbeitszeit"]
[]
[null,null,null,null,null,null,null,null,null,null,null,null,null,null,null,null,null,null,null,null,null,null,null,null,null,null,null,null,null,null,null,null,null,null,null,3]
[null,null,null,null,null,null,null,null,null,null,null,null,null,null,null,null,null,null,null,null,null,null,null,null,null,null,null,null,null,null,null,null,null,null,null,3]
[null,null,null,null,null,null,null,null,null,null,null,null,null,null,null,null,null,null,null,null,null,null,null,null,null,null,null,null,null,null,null,null,null,null,null,3]
[null,null,null,null,null,null,null,null,null,null,null,null,null,null,null,null,null,null,null,null,null,null,null,null,null,null,null,null,null,null,null,null,null,null,null,3]
[null,null,null,null,null,null,null,null,null,null,null,null,null,null,null,null,null,null,null,null,null,null,null,null,null,null,null,null,null,null,null,null,null,null,null,3]

{"sheet":"tmpMonat","index":4,"n_rows":134,"n_cols":45,"rows_kept":134,"cut":false,"hidden":true,"merged":[[11,34,12,35]]}
[1,{"$f":"DATEVALUE(\"1.\"&A1&\".\"&SL_Jahr)","v":"2024-01-01"},{"$f":"SL_Jahr","v":2024},{"$f":"B_Gde","v":"Gde:"},{"$f":"SL_Gemeinde","v":0},null,null,null,null,null,null,null,null,null,null,null,null,null,null,{"$f":"B_Schule","v":"Schule:"},{"$f":"SL_Schule","v":0},null,null,null,null,null,null,null,null,null,null,null,null,null,null,null,null,null,"Abschluss-Teilbedingungen:"]
[{"$f":"VLOOKUP(A1,Monatsenden,2)","v":45322},{"$f":"B_Bg","v":"BG:"},{"$f":"VLOOKUP(B1,VSA_Kalender,13)","v":1},{"$f":"B_Name","v":"Name:"},{"$f":"SL_Name","v":0},null,null,null,null,null,null,null,null,null,null,null,null,null,null,null,null,null,null,null,null,null,null,null,null,null,null,null,null,null,null,null,null,null,"Regel ok",{"$f":"(AN14>=AN15)","v":false},"Nicht Relevant",{"$f":"D83=0","v":true},-1,{"$f":"IF(AP2=TRUE,AQ2,0)","v":-1},"Nicht Relevant"]
[null,{"$f":"Zerf_Version & \" \" & Zerf_T","v":"Version VSA 1.06 "},null,{"$f":"DATE($C$1,MONTH($B$1),D$4)","v":"2024-01-01"},{"$f":"DATE($C$1,MONTH($B$1),E$4)","v":"2024-01-02"},"2024-01-03","2024-01-04","2024-01-05","2024-01-06","2024-01-07","2024-01-08","2024-01-09","2024-01-10","2024-01-11","2024-01-12","2024-01-13","2024-01-14","2024-01-15","2024-01-16","2024-01-17","2024-01-18","2024-01-19","2024-01-20","2024-01-21","2024-01-22","2024-01-23","2024-01-24","2024-01-25","2024-01-26","2024-01-27","2024-01-28",{"$f":"IF(MONTH(DATE($C$1,MONTH($B$1),AF$41))>MONTH($B$1),\"\",DATE($C$1,MONTH($B$1),AF$4))","v":"2024-01-29"},{"$f":"IF(MONTH(DATE($C$1,MONTH($B$1),AG$41))>MONTH($B$1),\"\",DATE($C$1,MONTH($B$1),AG$4))","v":"2024-01-30"},{"$f":"IF(MONTH(DATE($C$1,MONTH($B$1),AH$41))>MONTH($B$1),\"\",DATE($C$1,MONTH($B$1),AH$4))","v":"2024-01-31"},null,null,null,null,"Spalten ok",{"$f":"(L83>=D83)","v":true},"Entsperrt",false,1,{"$f":"AP3*AQ3","v":0},"Entsperrt"]
[null,{"$f":"IF(VSATestModus=TRUE(),\"VSA-Modus!\",\"\")","v":""},{"$f":"IF(AN52>0,\"DEFEKT\",\"\")","v":""},{"$f":"IF(MONTH(DATE($C$1,MONTH($B$1),D$41))>MONTH($B$1),\"\",D41)","v":1},2,3,4,5,6,7,8,9,10,11,12,13,14,15,16,17,18,19,20,21,22,23,24,25,26,27,28,{"$f":"IF(MONTH(DATE($C$1,MONTH($B$1),AF$41))>MONTH($B$1),\"\",AF41)","v":29},{"$f":"IF(MONTH(DATE($C$1,MONTH($B$1),AG$41))>MONTH($B$1),\"\",AG41)","v":30},{"$f":"IF(MONTH(DATE($C$1,MONTH($B$1),AH$41))>MONTH($B$1),\"\",AH41)","v":31},null,null,null,null,"Keine Fehler",{"$f":"(SUM(D87:AH87)=0)","v":true},"Geändert",false,2,{"$f":"AP4*AQ4","v":0},"Geändert"]
[null,"     Ein   >>>",null,null,null,null,null,null,null,null,null,null,null,null,null,null,null,null,null,null,null,null,null,null,null,null,null,null,null,null,null,null,null,null,null,null,null,null,"Keine Hand",{"$f":"(AI12=\"\")","v":true},"Sperre",{"$f":"AS11=2","v":false},3,{"$f":"NOT(AP6)*AQ5","v":3},"Eingaben vornehmen"]
[null,"<<<   Aus     ",null,null,null,null,null,null,null,null,null,null,null,null,null,null,null,null,null,null,null,null,null,null,null,null,null,null,null,null,null,null,null,null,null,null,null,null,null,null,"Abschliessbar 1",{"$f":"AND(OR(AN2,AN3),AN4,AN5,NOT(AP7),NOT(AP2))","v":false},4,{"$f":"AND(NOT(OR(AP3,AP4)),AP6)*AQ6","v":0},"Abschliessbar 1"]
[null,"     Ein   >>>",null,null,null,null,null,null,null,null,null,null,null,null,null,null,null,null,null,null,null,null,null,null,null,null,null,null,null,null,null,null,null,null,null,null,null,null,null,null,"Abgeschlossen",false,5,{"$f":"AND(NOT(OR(AP3,AP4)),AP7)*AQ7","v":0},"Abgeschlossen"]
[null,"<<<   Aus     ",null,null,null,null,null,null,null,null,null,null,null,null,null,null,null,null,null,null,null,null,null,null,null,null,null,null,null,null,null,null,null,null,null,null,null,null,null,null,"Für Jahr OK",{"$f":"AND(OR(AP2,AP7),NOT(AP3))","v":true}]
[null,"     Ein   >>>",null,null,null,null,null,null,null,null,null,null,null,null,null,null,null,null,null,null,null,null,null,null,null,null,null,null,null,null,null,null,null,null,"VORLAGE MONAT!"]
[null,"<<<   Aus     ",null,null,null,null,null,null,null,null,null,null,null,null,null,null,null,null,null,null,null,null,null,null,null,null,null,null,null,null,null,null,null,null,"IMMER UNGESCHÜTZT",null,null,null,null,null,"Statusnummer:",{"$f":"IF(AR2=AQ2,AQ2,MAX(AR2:AR7))","v":-1}]
[null,"     Ein   >>>",null,null,null,null,null,null,null,null,null,null,null,null,null,null,null,null,null,null,null,null,null,null,null,null,null,null,null,null,null,null,null,null,"IMMER AUSGEBLENDET 2",null,null,null,"HatDaten:",{"$f":"AND(AP2=FALSE,OR(AP10<>3,COUNTA(D5:AH12,D20:AH35,D39:L40)>0))","v":false},"Statustext:",{"$f":"IFERROR(VLOOKUP(AP10,AR2:AS7,2,FALSE),\"unbekannt\")","v":"Nicht Relevant"},null,null,0]
[null,"<<<   Aus     ",null,null,null,null,null,null,null,null,null,null,null,null,null,null,null,null,null,null,null,null,null,null,null,null,null,null,null,null,null,null,null,null,{"$f":"IF(COUNTIF(D37:AH37,\"I\")>0,\"I\",\"\")","v":""}]
[null,{"$f":"B_PrZeit","v":"Präsenzzeit"},null,{"$f":"24*(D6-D5+D8-D7+D10-D9+D12-D11)*D88","v":0},{"$f":"24*(E6-E5+E8-E7+E10-E9+E12-E11)*E88","v":0},0,0,0,0,0,0,0,0,0,0,0,0,0,0,0,0,0,0,0,0,0,0,0,0,0,0,0,0,0,null,null,null,null,"Anzahl Regeltage:",{"$f":"D83","v":0}]
[null,{"$f":"B_TotalAZist","v":"Total Arbeitszeit (IST)"},null,{"$f":"IF(D13+D35>=D15,D13+D35,MIN(D13+D35+SUM(D20,D22,D23,D24,D25,D26,D27,D28,D29,D30,D31,D32,D33,D34),IF(D15<0,0,D15)))*D82","v":0},0,0,0,0,0,0,0,0,0,0,0,0,0,{"$f":"IF(R13+R35>=R15,R13+R35,MIN(R13+R35+SUM(R20,R22,R23,R24,R25,R26,R27,R28,R29,R30,R31,R32,R33,R34),IF(R15<0,0,R15)))*R82","v":0},{"$f":"IF(S13+S35>=S15,S13+S35,MIN(S13+S35+SUM(S20,S22,S23,S24,S25,S26,S27,S28,S29,S30,S31,S32,S33,S34),IF(S15<0,0,S15)))*S82","v":0},{"$f":"IF(T13+T35>=T15,T13+T35,MIN(T13+T35+SUM(T20,T22,T23,T24,T25,T26,T27,T28,T29,T30,T31,T32,T33,T34),IF(T15<0,0,T15)))*T82","v":0},{"$f":"IF(U13+U35>=U15,U13+U35,MIN(U13+U35+SUM(U20,U22,U23,U24,U25,U26,U27,U28,U29,U30,U31,U32,U33,U34),IF(U15<0,0,U15)))*U82","v":0},0,0,0,0,0,0,0,0,0,0,0,0,0,{"$f":"SUMIF($D$82:$AH$82,1,D14:AH14)","v":0},{"$f":"AI14-AI15","v":16.8},null,null,"Erfasste Regeltage",{"$f":"L83","v":0},{"$f":"AN13-AN14","v":0},"Fehlende Regeltage"]
[null,{"$f":"B_NettoSollAZ","v":"Netto-SOLL-Arbeitszeit"},null,{"$f":"ROUND(D16-D19,2)","v":-8.4},{"$f":"ROUND(E16-E19,2)","v":-8.4},0,0,0,0,0,0,0,0,0,0,0,0,0,0,0,0,0,0,0,0,0,0,0,0,0,0,{"$f":"IF(AF$42=4,0,ROUND(AF16-AF19,2))","v":0},{"$f":"IF(AG$42=4,0,ROUND(AG16-AG19,2))","v":0},0,{"$f":"SUMIF($D$82:$AH$82,1,D15:AH15)","v":-16.8},null,null,null,"Minimum Regeltage",{"$f":"MinRegeltage","v":1},"Ist als Konstante im Blatt \"Intern\" hinterlegt"]
[null,{"$f":"B_BruttoSollAZ","v":"Brutto-SOLL-Arb.zeit"},null,{"$f":"VLOOKUP(D3,VSA_Kalender,16)","v":0},0,0,0,0,0,0,0,0,0,0,0,0,0,0,0,0,0,0,0,0,0,0,0,0,0,0,0,{"$f":"IF(AF$42=4,0,VLOOKUP(AF3,VSA_Kalender,16))","v":0},{"$f":"IF(AG$42=4,0,VLOOKUP(AG3,VSA_Kalender,16))","v":0},{"$f":"IF(AH$42=4,0,VLOOKUP(AH3,VSA_Kalender,16))","v":0},null,null,null,null,"Regel ok","Mind. eigetr. Regeltage erfüllt"]
[null,{"$f":"B_MehrMinder","v":"Mehr-/Minderleistung"},null,{"$f":"(SL_BisDatum>=D3)*ROUND(D14-D15,2)","v":8.4},8.4,0,0,0,0,0,0,0,0,0,0,0,0,0,0,0,0,0,0,0,0,0,0,0,0,0,0,0,0,0,{"$f":"B_Total","v":"Total"},{"$f":"B_Vortrag","v":"Vortrag"},null,null,"Spalten ok:","Alle Einträge an Regeltagen ok"]
[null,{"$f":"B_AZSaldo","v":"AZ - Saldo"},{"$f":"VLOOKUP(ROW(),VSA_Uebertrag,$A$1+3)","v":0},{"$f":"IFERROR((C18+D17)*(D3<=SL_BisDatum)*VLOOKUP(D3,VSA_Kalender,21,FALSE),0)","v":8.4},16.8,16.8,{"$f":"IFERROR((F18+G17)*(G3<=SL_BisDatum)*VLOOKUP(G3,VSA_Kalender,21,FALSE),0)","v":16.8},16.8,16.8,16.8,16.8,16.8,16.8,16.8,16.8,16.8,16.8,16.8,16.8,16.8,16.8,16.8,16.8,16.8,16.8,16.8,16.8,16.8,16.8,16.8,16.8,16.8,16.8,16.8,null,{"$f":"SUMIF($D$82:$AH$82,1,D17:AH17)+C18","v":16.8}]
[null,{"$f":"B_FTA","v":"Feiertagsanspruch"},0,{"$f":"VLOOKUP(D3,VSA_Kalender,14)","v":8.4},8.4,0,0,0,0,0,0,0,0,0,0,0,0,0,0,0,0,0,0,0,0,0,0,0,0,0,0,{"$f":"IF(AF$42=4,0,VLOOKUP(AF3,VSA_Kalender,14))","v":0},{"$f":"IF(AG$42=4,0,VLOOKUP(AG3,VSA_Kalender,14))","v":0},{"$f":"IF(AH$42=4,0,VLOOKUP(AH3,VSA_Kalender,14))","v":0},{"$f":"SUM(D19:AH19)","v":16.8}]
[null,{"$f":"B_Ferien","v":"Ferien"},{"$f":"VLOOKUP(ROW(),VSA_Uebertrag,$A$1+3)","v":0},null,null,null,null,null,null,null,null,null,null,null,null,null,null,null,null,null,null,null,null,null,null,null,null,null,null,null,null,null,null,null,{"$f":"SUMIF($D$82:$AH$82,1,D20:AH20)","v":0},{"$f":"ROUND(C20-AI20,2)","v":0},"Rest"]
[null,{"$f":"B_KompAZ","v":"Kompensation Arbeitstage"},0,null,null,null,null,null,null,null,null,null,null,null,null,null,null,null,null,null,null,null,null,null,null,null,null,null,null,null,null,null,null,null,0,{"$f":"ROUND(A21+C21-AI21,0)","v":0}]
[null,{"$f":"B_Arzt","v":"Arztbesuch"},0,null,null,null,null,null,null,null,null,null,null,null,null,null,null,null,null,null,null,null,null,null,null,null,null,null,null,null,null,null,null,null,0,{"$f":"ROUND(A22+C22+AI22,2)","v":0},"Summen"]
[null,{"$f":"B_Krank","v":"Krankheit"},0,null,null,null,null,null,null,null,null,null,null,null,null,null,null,null,null,null,null,null,null,null,null,null,null,null,null,null,null,null,null,null,0,{"$f":"ROUND(A23+C23+AI23,2)","v":0}]
[null,{"$f":"B_BU","v":"Berufsunfall"},0,null,null,null,null,null,null,null,null,null,null,null,null,null,null,null,null,null,null,null,null,null,null,null,null,null,null,null,null,null,null,null,0,0]
[null,{"$f":"B_NBU","v":"Nichtberufsunfall"},0,null,null,null,null,null,null,null,null,null,null,null,null,null,null,null,null,null,null,null,null,null,null,null,null,null,null,null,null,null,null,null,0,0]
[null,{"$f":"B_MilZiv","v":"Militär / Zivilschutz"},0,null,null,null,null,null,null,null,null,null,null,null,null,null,null,null,null,null,null,null,null,null,null,null,null,null,null,null,null,null,null,null,0,0]
[null,{"$f":"B_UUB","v":"Unbezahlter Urlaub"},0,null,null,null,null,null,null,null,null,null,null,null,null,null,null,null,null,null,null,null,null,null,null,null,null,null,null,null,null,null,null,null,0,{"$f":"ROUND(A27+C27-AI27,2)","v":0},"Rest"]
[null,{"$f":"B_UB","v":"Bezahlter Urlaub"},0,null,null,null,null,null,null,null,null,null,null,null,null,null,null,null,null,null,null,null,null,null,null,null,null,null,null,null,null,null,null,null,0,{"$f":"ROUND(A28+C28-AI28,2)","v":0}]
[null,{"$f":"B_NebenB","v":"Nebenbeschäftigung"},0,null,null,null,null,null,null,null,null,null,null,null,null,null,null,null,null,null,null,null,null,null,null,null,null,null,null,null,null,null,null,null,0,0]
[null,{"$f":"B_DAG","v":"D A G"},0,null,null,null,null,null,null,null,null,null,null,null,null,null,null,null,null,null,null,null,null,null,null,null,null,null,null,null,null,null,null,null,0,0]
[null,{"$f":"B_Divers","v":"Diverses"},0,null,null,null,null,null,null,null,null,null,null,null,null,null,null,null,null,null,null,null,null,null,null,null,null,null,null,null,null,null,null,null,0,0,"Summen"]
[null,{"$f":"B_FamPersErg","v":"Fam./pers. Ereignisse"},0,null,null,null,null,null,null,null,null,null,null,null,null,null,null,null,null,null,null,null,null,null,null,null,null,null,null,null,null,null,null,null,0,0]
[null,{"$f":"B_FZ1","v":"freie Zeile 1"},0,null,null,null,null,null,null,null,null,null,null,null,null,null,null,null,null,null,null,null,null,null,null,null,null,null,null,null,null,null,null,null,0,0]
[null,{"$f":"B_FZ2","v":"freie Zeile 2"},0,null,null,null,null,null,null,null,null,null,null,null,null,null,null,null,null,null,null,null,null,null,null,null,null,null,null,null,null,null,null,null,0,0]
[null,{"$f":"B_WB","v":"Weiterbildung"},0,null,null,null,null,null,null,null,null,null,null,null,null,null,null,null,null,null,null,null,null,null,null,null,null,null,null,null,null,null,null,null,0,0]
[null,{"$f":"B_FEL","v":"frei einsetzbare Lekt."},0,null,null,null,null,null,null,null,null,null,null,null,null,null,null,null,null,null,null,null,null,null,null,null,null,null,null,null,null,null,null,null,{"$f":"SUM(D36:AH36)","v":0},{"$f":"ROUND(C36-AI36,0)","v":0}]
[null,null,null,{"$f":"IF(AND((D13 - D15)+SUM(D20,D22:D34)>0.00001,SUM(D20,D22:D34)>0),\"I\",\"\")","v":""},"","","","","","","","","","","","","","","","","","","","","","","","","","","","","",""]
[null,null,"Visum","Identität:",null,null,null,null,"Datum:",null,"Status:"]
[null,null,"SL"]
[null,null,"VG"]
[null,null,null,1,2,3,4,5,6,7,8,9,10,11,12,13,14,15,16,17,18,19,20,21,22,23,24,25,26,27,28,29,30,31]
[null,null,null,{"$f":"IF(D3=\"\",4,VLOOKUP(D3,VSA_Kalender,18))","v":1},1,0,0,0,1,1,0,0,0,0,0,1,1,0,0,0,0,0,1,1,0,0,0,0,0,1,1,0,0,0]
[]
[null,null,null,{"$f":"IF(D19>0,VLOOKUP(D3,KalFeiertage,6,FALSE),\"\")","v":"Neujahr"},"Berchtoldstag","","","","","","","","","","","","","","","","","","","","","","","","","","","","",""]
[null,null,null,"FT=WENN(D13+D35>=D15;D13+D35;MIN(D13+D35+SUMME(D20;D22;D23;D24;D25;D26;D27;D28;D29;D30;D31;D32;D33;D34);WENN(D15<0;0;D15)))*D82","FT=WENN(E13+E35>=E15;E13+E35;MIN(E13+E35+SUMME(E20;E22;E23;E24;E25;E26;E27;E28;E29;E30;E31;E32;E33;E34);WENN(E15<0;0;E15)))*E82","FT=WENN(F13+F35>=F15;F13+F35;MIN(F13+F35+SUMME(F20;F22;F23;F24;F25;F26;F27;F28;F29;F30;F31;F32;F33;F34);WENN(F15<0;0;F15)))*F82","FT=WENN(G13+G35>=G15;G13+G35;MIN(G13+G35+SUMME(G20;G22;G23;G24;G25;G26;G27;G28;G29;G30;G31;G32;G33;G34);WENN(G15<0;0;G15)))*G82","FT=WENN(H13+H35>=H15;H13+H35;MIN(H13+H35+SUMME(H20;H22;H23;H24;H25;H26;H27;H28;H29;H30;H31;H32;H33;H34);WENN(H15<0;0;H15)))*H82","FT=WENN(I13+I35>=I15;I13+I35;MIN(I13+I35+SUMME(I20;I22;I23;I24;I25;I26;I27;I28;I29;I30;I31;I32;I33;I34);WENN(I15<0;0;I15)))*I82","FT=WENN(J13+J35>=J15;J13+J35;MIN(J13+J35+SUMME(J20;J22;J23;J24;J25;J26;J27;J28;J29;J30;J31;J32;J33;J34);WENN(J15<0;0;J15)))*J82","FT=WENN(K13+K35>=K15;K13+K35;MIN(K13+K35+SUMME(K20;K22;K23;K24;K25;K26;K27;K28;K29;K30;K31;K32;K33;K34);WENN(K15<0;0;K15)))*K82","FT=WENN(L13+L35>=L15;L13+L35;MIN(L13+L35+SUMME(L20;L22;L23;L24;L25;L26;L27;L28;L29;L30;L31;L32;L33;L34);WENN(L15<0;0;L15)))*L82","FT=WENN(M13+M35>=M15;M13+M35;MIN(M13+M35+SUMME(M20;M22;M23;M24;M25;M26;M27;M28;M29;M30;M31;M32;M33;M34);WENN(M15<0;0;M15)))*M82","FT=WENN(N13+N35>=N15;N13+N35;MIN(N13+N35+SUMME(N20;N22;N23;N24;N25;N26;N27;N28;N29;N30;N31;N32;N33;N34);WENN(N15<0;0;N15)))*N82","FT=WENN(O13+O35>=O15;O13+O35;MIN(O13+O35+SUMME(O20;O22;O23;O24;O25;O26;O27;O28;O29;O30;O31;O32;O33;O34);WENN(O15<0;0;O15)))*O82","FT=WENN(P13+P35>=P15;P13+P35;MIN(P13+P35+SUMME(P20;P22;P23;P24;P25;P26;P27;P28;P29;P30;P31;P32;P33;P34);WENN(P15<0;0;P15)))*P82","FT=WENN(Q13+Q35>=Q15;Q13+Q35;MIN(Q13+Q35+SUMME(Q20;Q22;Q23;Q24;Q25;Q26;Q27;Q28;Q29;Q30;Q31;Q32;Q33;Q34);WENN(Q15<0;0;Q15)))*Q82","FT=WENN(R13+R35>=R15;R13+R35;MIN(R13+R35+SUMME(R20;R22;R23;R24;R25;R26;R27;R28;R29;R30;R31;R32;R33;R34);WENN(R15<0;0;R15)))*R82","FT=WENN(S13+S35>=S15;S13+S35;MIN(S13+S35+SUMME(S20;S22;S23;S24;S25;S26;S27;S28;S29;S30;S31;S32;S33;S34);WENN(S15<0;0;S15)))*S82","FT=WENN(T13+T35>=T15;T13+T35;MIN(T13+T35+SUMME(T20;T22;T23;T24;T25;T26;T27;T28;T29;T30;T31;T32;T33;T34);WENN(T15<0;0;T15)))*T82","FT=WENN(U13+U35>=U15;U13+U35;MIN(U13+U35+SUMME(U20;U22;U23;U24;U25;U26;U27;U28;U29;U30;U31;U32;U33;U34);WENN(U15<0;0;U15)))*U82","FT=WENN(V13+V35>=V15;V13+V35;MIN(V13+V35+SUMME(V20;V22;V23;V24;V25;V26;V27;V28;V29;V30;V31;V32;V33;V34);WENN(V15<0;0;V15)))*V82","FT=WENN(W13+W35>=W15;W13+W35;MIN(W13+W35+SUMME(W20;W22;W23;W24;W25;W26;W27;W28;W29;W30;W31;W32;W33;W34);WENN(W15<0;0;W15)))*W82","FT=WENN(X13+X35>=X15;X13+X35;MIN(X13+X35+SUMME(X20;X22;X23;X24;X25;X26;X27;X28;X29;X30;X31;X32;X33;X34);WENN(X15<0;0;X15)))*X82","FT=WENN(Y13+Y35>=Y15;Y13+Y35;MIN(Y13+Y35+SUMME(Y20;Y22;Y23;Y24;Y25;Y26;Y27;Y28;Y29;Y30;Y31;Y32;Y33;Y34);WENN(Y15<0;0;Y15)))*Y82","FT=WENN(Z13+Z35>=Z15;Z13+Z35;MIN(Z13+Z35+SUMME(Z20;Z22;Z23;Z24;Z25;Z26;Z27;Z28;Z29;Z30;Z31;Z32;Z33;Z34);WENN(Z15<0;0;Z15)))*Z82","FT=WENN(AA13+AA35>=AA15;AA13+AA35;MIN(AA13+AA35+SUMME(AA20;AA22;AA23;AA24;AA25;AA26;AA27;AA28;AA29;AA30;AA31;AA32;AA33;AA34);WENN(AA15<0;0;AA15)))*AA82","FT=WENN(AB13+AB35>=AB15;AB13+AB35;MIN(AB13+AB35+SUMME(AB20;AB22;AB23;AB24;AB25;AB26;AB27;AB28;AB29;AB30;AB31;AB32;AB33;AB34);WENN(AB15<0;0;AB15)))*AB82","FT=WENN(AC13+AC35>=AC15;AC13+AC35;MIN(AC13+AC35+SUMME(AC20;AC22;AC23;AC24;AC25;AC26;AC27;AC28;AC29;AC30;AC31;AC32;AC33;AC34);WENN(AC15<0;0;AC15)))*AC82","FT=WENN(AD13+AD35>=AD15;AD13+AD35;MIN(AD13+AD35+SUMME(AD20;AD22;AD23;AD24;AD25;AD26;AD27;AD28;AD29;AD30;AD31;AD32;AD33;AD34);WENN(AD15<0;0;AD15)))*AD82","FT=WENN(AE13+AE35>=AE15;AE13+AE35;MIN(AE13+AE35+SUMME(AE20;AE22;AE23;AE24;AE25;AE26;AE27;AE28;AE29;AE30;AE31;AE32;AE33;AE34);WENN(AE15<0;0;AE15)))*AE82","FT=WENN(AF13+AF35>=AF15;AF13+AF35;MIN(AF13+AF35+SUMME(AF20;AF22;AF23;AF24;AF25;AF26;AF27;AF28;AF29;AF30;AF31;AF32;AF33;AF34);WENN(AF15<0;0;AF15)))*AF82","FT=WENN(AG13+AG35>=AG15;AG13+AG35;MIN(AG13+AG35+SUMME(AG20;AG22;AG23;AG24;AG25;AG26;AG27;AG28;AG29;AG30;AG31;AG32;AG33;AG34);WENN(AG15<0;0;AG15)))*AG82","FT=WENN(AH13+AH35>=AH15;AH13+AH35;MIN(AH13+AH35+SUMME(AH20;AH22;AH23;AH24;AH25;AH26;AH27;AH28;AH29;AH30;AH31;AH32;AH33;AH34);WENN(AH15<0;0;AH15)))*AH82"]
[null,null,null,"FT=24*(D6-D5+D8-D7+D10-D9+D12-D11)*D88","FT=24*(E6-E5+E8-E7+E10-E9+E12-E11)*E88","FT=24*(F6-F5+F8-F7+F10-F9+F12-F11)*F88","FT=24*(G6-G5+G8-G7+G10-G9+G12-G11)*G88","FT=24*(H6-H5+H8-H7+H10-H9+H12-H11)*H88","FT=24*(I6-I5+I8-I7+I10-I9+I12-I11)*I88","FT=24*(J6-J5+J8-J7+J10-J9+J12-J11)*J88","FT=24*(K6-K5+K8-K7+K10-K9+K12-K11)*K88","FT=24*(L6-L5+L8-L7+L10-L9+L12-L11)*L88","FT=24*(M6-M5+M8-M7+M10-M9+M12-M11)*M88","FT=24*(N6-N5+N8-N7+N10-N9+N12-N11)*N88","FT=24*(O6-O5+O8-O7+O10-O9+O12-O11)*O88","FT=24*(P6-P5+P8-P7+P10-P9+P12-P11)*P88","FT=24*(Q6-Q5+Q8-Q7+Q10-Q9+Q12-Q11)*Q88","FT=24*(R6-R5+R8-R7+R10-R9+R12-R11)*R88","FT=24*(S6-S5+S8-S7+S10-S9+S12-S11)*S88","FT=24*(T6-T5+T8-T7+T10-T9+T12-T11)*T88","FT=24*(U6-U5+U8-U7+U10-U9+U12-U11)*U88","FT=24*(V6-V5+V8-V7+V10-V9+V12-V11)*V88","FT=24*(W6-W5+W8-W7+W10-W9+W12-W11)*W88","FT=24*(X6-X5+X8-X7+X10-X9+X12-X11)*X88","FT=24*(Y6-Y5+Y8-Y7+Y10-Y9+Y12-Y11)*Y88","FT=24*(Z6-Z5+Z8-Z7+Z10-Z9+Z12-Z11)*Z88","FT=24*(AA6-AA5+AA8-AA7+AA10-AA9+AA12-AA11)*AA88","FT=24*(AB6-AB5+AB8-AB7+AB10-AB9+AB12-AB11)*AB88","FT=24*(AC6-AC5+AC8-AC7+AC10-AC9+AC12-AC11)*AC88","FT=24*(AD6-AD5+AD8-AD7+AD10-AD9+AD12-AD11)*AD88","FT=24*(AE6-AE5+AE8-AE7+AE10-AE9+AE12-AE11)*AE88","FT=24*(AF6-AF5+AF8-AF7+AF10-AF9+AF12-AF11)*AF88","FT=24*(AG6-AG5+AG8-AG7+AG10-AG9+AG12-AG11)*AG88","FT=24*(AH6-AH5+AH8-AH7+AH10-AH9+AH12-AH11)*AH88"]
[null,null,null,"FT=ODER(D14>0;D21>0)*1","FT=ODER(E14>0;E21>0)*1","FT=ODER(F14>0;F21>0)*1","FT=ODER(G14>0;G21>0)*1","FT=ODER(H14>0;H21>0)*1","FT=ODER(I14>0;I21>0)*1","FT=ODER(J14>0;J21>0)*1","FT=ODER(K14>0;K21>0)*1","FT=ODER(L14>0;L21>0)*1","FT=ODER(M14>0;M21>0)*1","FT=ODER(N14>0;N21>0)*1","FT=ODER(O14>0;O21>0)*1","FT=ODER(P14>0;P21>0)*1","FT=ODER(Q14>0;Q21>0)*1","FT=ODER(R14>0;R21>0)*1","FT=ODER(S14>0;S21>0)*1","FT=ODER(T14>0;T21>0)*1","FT=ODER(U14>0;U21>0)*1","FT=ODER(V14>0;V21>0)*1","FT=ODER(W14>0;W21>0)*1","FT=ODER(X14>0;X21>0)*1","FT=ODER(Y14>0;Y21>0)*1","FT=ODER(Z14>0;Z21>0)*1","FT=ODER(AA14>0;AA21>0)*1","FT=ODER(AB14>0;AB21>0)*1","FT=ODER(AC14>0;AC21>0)*1","FT=ODER(AD14>0;AD21>0)*1","FT=ODER(AE14>0;AE21>0)*1","FT=ODER(AF14>0;AF21>0)*1","FT=ODER(AG14>0;AG21>0)*1","FT=ODER(AH14>0;AH21>0)*1"]
[null,null,null,{"$f":"ABS(\"FT\"&_xlfn.FORMULATEXT(D14)<>D45)","v":0},{"$f":"ABS(\"FT\"&_xlfn.FORMULATEXT(E14)<>E45)","v":0},0,0,0,0,0,0,0,0,0,0,0,0,0,0,0,0,0,0,0,0,0,0,0,0,0,0,0,0,0]
[null,null,null,{"$f":"ABS(\"FT\"&_xlfn.FORMULATEXT(D13)<>D46)","v":0},{"$f":"ABS(\"FT\"&_xlfn.FORMULATEXT(E13)<>E46)","v":0},0,0,0,0,0,0,0,0,0,0,0,0,0,0,0,0,0,0,0,0,0,0,0,0,0,0,0,0,0]
[null,null,null,{"$f":"ABS(\"FT\"&_xlfn.FORMULATEXT(D80)<>D47)","v":0},{"$f":"ABS(\"FT\"&_xlfn.FORMULATEXT(E80)<>E47)","v":0},0,0,0,0,0,0,0,0,0,0,0,0,0,0,0,0,0,0,0,0,0,0,0,0,0,0,0,0,0]
[null,null,null,{"$f":"ABS(ISERROR(D37))","v":0},{"$f":"ABS(ISERROR(E37))","v":0},0,0,0,0,0,0,0,0,0,0,0,0,0,0,0,0,0,0,0,0,0,0,0,0,0,0,0,0,0]
[null,null,null,{"$f":"SUM(D48:D51)","v":0},{"$f":"SUM(E48:E51)","v":0},0,0,0,0,0,0,0,0,0,0,0,0,0,0,0,0,0,0,0,0,0,0,0,0,0,0,0,0,0,null,null,null,null,"Formel defekt",{"$f":"SUM(D52:AH52)","v":0}]
[]
[]
[]
[]
[]
[]
[]
[]
[]
[]
[]
[]
[]
[]
[]
[]
[]
[]
[]
[]
[]
[]
[]
[]
[null,"HT_Naz-Kopie",{"$f":"HT_NAZ","v":8.4}]
[null,"Heute:",{"$f":"SL_BisDatum","v":"2024-02-02"}]
[null,null,"Reguläre Tage ausgefüllt",{"$f":"((D80*D81)=1)*1","v":0},{"$f":"((E80*E81)=1)*1","v":0},0,0,0,0,0,0,0,0,0,0,0,0,0,0,0,0,0,0,0,0,0,0,0,0,0,0,0,0,0]
[null,null,"Arbeitstage ausgefüllt",{"$f":"OR(D14>0,D21>0)*1","v":0},{"$f":"OR(E14>0,E21>0)*1","v":0},0,0,0,0,0,0,0,0,0,0,0,0,0,0,0,0,0,0,0,0,0,0,0,0,0,0,0,0,0]
[null,null,"Arbeitstage wenn BG>0%",{"$f":"IFERROR(VLOOKUP(D3,VSA_Kalender,22),0)","v":0},0,0,0,0,0,0,0,0,0,0,0,0,0,0,0,0,0,0,0,0,0,0,0,0,0,0,0,0,0,0]
[null,null,"Der BG beträgt mehr als 0%",{"$f":"IF(D4=\"\",0,ABS(VLOOKUP(D3,VSA_Kalender,13,FALSE)>0))","v":1},1,1,1,1,1,1,1,1,1,1,1,1,1,1,1,1,1,1,1,1,1,1,1,1,1,1,1,1,1,1]
[null,null,"(Ja: 1, Nein: 0)",{"$f":"SUM(D81:AH81)","v":0},"Total Tage bei BG>0%",null,null,{"$f":"SUM(D80:AH80)","v":0},"Total Tage ausgefüllt",null,null,{"$f":"SUM(D79:AH79)","v":0},"Total reguläre Tage ausgefüllt"]
[]
[null,null,"Tag des Monats",{"$f":"D4","v":1},2,3,4,5,6,7,8,9,10,11,12,13,14,15,16,17,18,19,20,21,22,23,24,25,26,27,28,29,30,31]
[null,null,"Ist Arbeitsbereich",{"$f":"IFERROR(ABS(WEEKDAY(D3,2)<6),0)","v":1},1,1,1,1,0,0,1,1,1,1,1,0,0,1,1,1,1,1,0,0,1,1,1,1,1,0,0,1,1,1]
[null,null,"Maximaler Fehler",{"$f":"MAX(D100:D107,D98,D134)","v":0},{"$f":"MAX(E100:E107,E98,E134)","v":0},0,0,0,0,0,0,0,0,0,0,0,0,0,0,0,0,0,0,0,0,0,0,0,0,0,0,0,0,0]
[null,null,"Wird die Präsenzzeit angezeigt?",{"$f":"IF(D87=0,1,0)","v":1},{"$f":"IF(E87=0,1,0)","v":1},1,1,1,1,1,1,1,1,1,1,1,1,1,1,1,1,1,1,1,1,1,1,1,1,1,1,1,1,1]
[]
[null,null,"Gruppenfehler 1",{"$f":"IF(AND(D6-D5=0,COUNTA(D7:D12)>0),1,0)","v":0},0,0,0,0,0,0,0,0,0,0,0,0,0,0,0,0,0,0,0,0,0,0,0,0,0,0,0,0,0,0]
[null,"Gruppenfehler","(aus)",{"$f":"D90","v":0},0,0,0,0,0,0,0,0,0,0,0,0,0,0,0,0,0,0,0,0,0,0,0,0,0,0,0,0,0,0]
[null,null,"Gruppenfehler 2",{"$f":"IF(AND(D8-D7=0,COUNTA(D9:D12)>0),1,0)","v":0},0,0,0,0,0,0,0,0,0,0,0,0,0,0,0,0,0,0,0,0,0,0,0,0,0,0,0,0,0,0]
[null,null,"(aus)",{"$f":"D92","v":0},0,0,0,0,0,0,0,0,0,0,0,0,0,0,0,0,0,0,0,0,0,0,0,0,0,0,0,0,0,0]
[null,null,"Gruppenfehler 3",{"$f":"IF(AND(D10-D9=0,COUNTA(D11:D12)>0),1,0)","v":0},0,0,0,0,0,0,0,0,0,0,0,0,0,0,0,0,0,0,0,0,0,0,0,0,0,0,0,0,0,0]
[null,null,"(aus)",{"$f":"D94","v":0},0,0,0,0,0,0,0,0,0,0,0,0,0,0,0,0,0,0,0,0,0,0,0,0,0,0,0,0,0,0]
[null,null,"leer"]
[null,null,"leer"]
[null,null,"Genereller Gruppenfehler",{"$f":"MAX(D90:D95)","v":0},0,0,0,0,0,0,0,0,0,0,0,0,0,0,0,0,0,0,0,0,0,0,0,0,0,0,0,0,0,0]
[]
[null,null,"Ein1",{"$f":"IF(AND(D109=0,D110>0),1,0)","v":0},{"$f":"IF(AND(E109=0,E110>0),1,0)","v":0},0,0,0,0,0,0,0,0,0,0,0,0,0,0,0,0,0,0,0,0,0,0,0,0,0,0,0,0,0]
[null,null,"Aus1",{"$f":"IF(AND(D110>0,D110<D109),3,IF(AND(D109>0,D110=0),1,0))*D$86","v":0},{"$f":"IF(AND(E110>0,E110<E109),3,IF(AND(E109>0,E110=0),1,0))*E$86","v":0},0,0,0,0,0,0,0,0,0,0,0,0,0,0,0,0,0,0,0,0,0,0,0,0,0,0,0,0,0]
[null,null,"Ein2",{"$f":"IF(AND(D111>0,D111<D110),3,IF(AND(D111=0,D112>0),1,0))*D$86","v":0},0,0,0,0,0,0,0,0,0,0,0,0,0,0,0,0,0,0,0,0,0,0,0,0,0,0,0,0,0,0]
[null,null,"Aus2",{"$f":"IF(AND(D112>0,D112<D111),3,IF(AND(D111>0,D112=0),1,0))*D$86","v":0},{"$f":"IF(AND(E112>0,E112<E111),3,IF(AND(E111>0,E112=0),1,0))*E$86","v":0},0,0,0,0,0,0,0,0,0,0,0,0,0,0,0,0,0,0,0,0,0,0,0,0,0,0,0,0,0]
[null,"Zellenfehler","Ein3",{"$f":"IF(AND(D113>0,D113<D112),3,IF(AND(D113=0,D114>0),1,0))*D$86","v":0},{"$f":"IF(AND(E113>0,E113<E112),3,IF(AND(E113=0,E114>0),1,0))*E$86","v":0},0,0,0,0,0,0,0,0,0,0,0,0,0,0,0,0,0,0,0,0,0,0,0,0,0,0,0,0,0]
[null,null,"Aus3",{"$f":"IF(AND(D114>0,D114<D113),3,IF(AND(D113>0,D114=0),1,0))*D$86","v":0},{"$f":"IF(AND(E114>0,E114<E113),3,IF(AND(E113>0,E114=0),1,0))*E$86","v":0},0,0,0,0,0,0,0,0,0,0,0,0,0,0,0,0,0,0,0,0,0,0,0,0,0,0,0,0,0]
[null,null,"Ein4",{"$f":"IF(AND(D115>0,D115<D114),3,IF(AND(D115=0,D116>0),1,0))*D$86","v":0},{"$f":"IF(AND(E115>0,E115<E114),3,IF(AND(E115=0,E116>0),1,0))*E$86","v":0},0,0,0,0,0,0,0,0,0,0,0,0,0,0,0,0,0,0,0,0,0,0,0,0,0,0,0,0,0]
[null,null,"Aus4",{"$f":"IF(AND(D116>0,D116<D115),3,IF(AND(D115>0,D116=0),1,0))*D$86","v":0},{"$f":"IF(AND(E116>0,E116<E115),3,IF(AND(E115>0,E116=0),1,0))*E$86","v":0},0,0,0,0,0,0,0,0,0,0,0,0,0,0,0,0,0,0,0,0,0,0,0,0,0,0,0,0,0]
[]
[null,null,"Ein1",{"$f":"ROUND(D5*24,2)","v":0},0,0,0,0,0,0,0,0,0,0,0,0,0,0,0,0,0,0,0,0,0,0,0,0,0,0,0,0,0,0]
[null,null,"Aus1",0,0,0,0,0,0,0,0,0,0,0,0,0,0,0,0,0,0,0,0,0,0,0,0,0,0,0,0,0,0,0]
[null,"Zeiten dezimal gewandelt","Ein2",0,0,0,0,0,0,0,0,0,0,0,0,0,0,0,0,0,0,0,0,0,0,0,0,0,0,0,0,0,0,0]
[null,null,"Aus2",0,0,0,0,0,0,0,0,0,0,0,0,0,0,0,0,0,0,0,0,0,0,0,0,0,0,0,0,0,0,0]
[null,null,"Ein3",0,0,0,0,0,0,0,0,0,0,0,0,0,0,0,0,0,0,0,0,0,0,0,0,0,0,0,0,0,0,0]
[null,null,"Aus3",0,0,0,0,0,0,0,0,0,0,0,0,0,0,0,0,0,0,0,0,0,0,0,0,0,0,0,0,0,0,0]
[null,null,"Ein4",0,0,0,0,0,0,0,0,0,0,0,0,0,0,0,0,0,0,0,0,0,0,0,0,0,0,0,0,0,0,0]
[null,null,"Aus4",0,0,0,0,0,0,0,0,0,0,0,0,0,0,0,0,0,0,0,0,0,0,0,0,0,0,0,0,0,0,0]
[]
[null,"Pausenfehler","Gruppe1",{"$f":"IF(OR(D109=\"\",D110=\"\"),0,D110-D109)","v":0},{"$f":"IF(OR(E109=\"\",E110=\"\"),0,E110-E109)","v":0},0,0,0,0,0,0,0,0,0,0,0,0,0,0,0,{"$f":"IF(OR(U109=\"\",U110=\"\"),0,U110-U109)","v":0},{"$f":"IF(OR(V109=\"\",V110=\"\"),0,V110-V109)","v":0},0,0,0,0,0,0,0,0,0,0,0,0]
[null,null,"Gruppe2",{"$f":"IF(OR(D111=\"\",D112=\"\"),0,D112-D111)","v":0},{"$f":"IF(OR(E111=\"\",E112=\"\"),0,E112-E111)","v":0},0,0,0,0,0,0,0,0,0,0,0,0,0,0,0,{"$f":"IF(OR(U111=\"\",U112=\"\"),0,U112-U111)","v":0},{"$f":"IF(OR(V111=\"\",V112=\"\"),0,V112-V111)","v":0},0,0,0,0,0,0,0,0,0,0,0,0]
[null,null,"Gruppe3",{"$f":"IF(OR(D113=\"\",D114=\"\"),0,D114-D113)","v":0},{"$f":"IF(OR(E113=\"\",E114=\"\"),0,E114-E113)","v":0},0,0,0,0,0,0,0,0,0,0,0,0,0,0,0,{"$f":"IF(OR(U113=\"\",U114=\"\"),0,U114-U113)","v":0},{"$f":"IF(OR(V113=\"\",V114=\"\"),0,V114-V113)","v":0},0,0,0,0,0,0,0,0,0,0,0,0]
[null,null,"Gruppe4",{"$f":"IF(OR(D115=\"\",D116=\"\"),0,D116-D115)","v":0},{"$f":"IF(OR(E115=\"\",E116=\"\"),0,E116-E115)","v":0},0,0,0,0,0,0,0,0,0,0,0,0,0,0,0,{"$f":"IF(OR(U115=\"\",U116=\"\"),0,U116-U115)","v":0},{"$f":"IF(OR(V115=\"\",V116=\"\"),0,V116-V115)","v":0},0,0,0,0,0,0,0,0,0,0,0,0]
[]
[null,null,"Pause12",{"$f":"IF(OR(D110=\"\",D111=\"\"),0,D111-D110)","v":0},{"$f":"IF(OR(E110=\"\",E111=\"\"),0,E111-E110)","v":0},0,0,0,0,0,0,0,0,0,0,0,0,0,0,0,{"$f":"IF(OR(U110=\"\",U111=\"\"),0,U111-U110)","v":0},{"$f":"IF(OR(V110=\"\",V111=\"\"),0,V111-V110)","v":0},0,0,0,0,0,0,0,0,0,0,0,0]
[null,null,"Pause23",{"$f":"IF(OR(D112=\"\",D113=\"\"),0,D113-D112)","v":0},{"$f":"IF(OR(E112=\"\",E113=\"\"),0,E113-E112)","v":0},0,0,0,0,0,0,0,0,0,0,0,0,0,0,0,{"$f":"IF(OR(U112=\"\",U113=\"\"),0,U113-U112)","v":0},{"$f":"IF(OR(V112=\"\",V113=\"\"),0,V113-V112)","v":0},0,0,0,0,0,0,0,0,0,0,0,0]
[null,null,"Pause34",{"$f":"IF(OR(D114=\"\",D115=\"\"),0,D115-D114)","v":0},{"$f":"IF(OR(E114=\"\",E115=\"\"),0,E115-E114)","v":0},0,0,0,0,0,0,0,0,0,0,0,0,0,0,0,{"$f":"IF(OR(U114=\"\",U115=\"\"),0,U115-U114)","v":0},{"$f":"IF(OR(V114=\"\",V115=\"\"),0,V115-V114)","v":0},0,0,0,0,0,0,0,0,0,0,0,0]
[]
[null,null,"Kum12",{"$f":"IF(D123>=0.5,0,D118+D119)","v":0},{"$f":"IF(E123>=0.5,0,E118+E119)","v":0},0,0,0,0,0,0,0,0,0,0,0,0,0,0,0,{"$f":"IF(U123>=0.5,0,U118+U119)","v":0},{"$f":"IF(V123>=0.5,0,V118+V119)","v":0},0,0,0,0,0,0,0,0,0,0,0,0]
[null,null,"Kum123",{"$f":"IF(OR(D123>=0.5,D124>=0.5),0,D118+D119+D120)","v":0},{"$f":"IF(OR(E123>=0.5,E124>=0.5),0,E118+E119+E120)","v":0},0,0,0,0,0,0,0,0,0,0,0,0,0,0,0,{"$f":"IF(OR(U123>=0.5,U124>=0.5),0,U118+U119+U120)","v":0},{"$f":"IF(OR(V123>=0.5,V124>=0.5),0,V118+V119+V120)","v":0},0,0,0,0,0,0,0,0,0,0,0,0]
[null,null,"Kum1234",{"$f":"IF(OR(D123>=0.5,D124>=0.5,D125>=0.5),0,D118+D119+D120+D121)","v":0},{"$f":"IF(OR(E123>=0.5,E124>=0.5,E125>=0.5),0,E118+E119+E120+E121)","v":0},0,0,0,0,0,0,0,0,0,0,0,0,0,0,0,{"$f":"IF(OR(U123>=0.5,U124>=0.5,U125>=0.5),0,U118+U119+U120+U121)","v":0},{"$f":"IF(OR(V123>=0.5,V124>=0.5,V125>=0.5),0,V118+V119+V120+V121)","v":0},0,0,0,0,0,0,0,0,0,0,0,0]
[null,null,"Kum23",{"$f":"IF(D124>=0.5,0,D119+D120)","v":0},{"$f":"IF(E124>=0.5,0,E119+E120)","v":0},0,0,0,0,0,0,0,0,0,0,0,0,0,0,0,{"$f":"IF(U124>=0.5,0,U119+U120)","v":0},{"$f":"IF(V124>=0.5,0,V119+V120)","v":0},0,0,0,0,0,0,0,0,0,0,0,0]
[null,null,"Kum234",{"$f":"IF(OR(D124>=0.5,D125>=0.5),0,D119+D120+D121)","v":0},{"$f":"IF(OR(E124>=0.5,E125>=0.5),0,E119+E120+E121)","v":0},0,0,0,0,0,0,0,0,0,0,0,0,0,0,0,{"$f":"IF(OR(U124>=0.5,U125>=0.5),0,U119+U120+U121)","v":0},{"$f":"IF(OR(V124>=0.5,V125>=0.5),0,V119+V120+V121)","v":0},0,0,0,0,0,0,0,0,0,0,0,0]
[null,null,"Kum34",{"$f":"IF(D125>=0.5,0,D120+D121)","v":0},{"$f":"IF(E125>=0.5,0,E120+E121)","v":0},0,0,0,0,0,0,0,0,0,0,0,0,0,0,0,{"$f":"IF(U125>=0.5,0,U120+U121)","v":0},{"$f":"IF(V125>=0.5,0,V120+V121)","v":0},0,0,0,0,0,0,0,0,0,0,0,0]
[]
[null,null,"Pausenfehler-Code",{"$f":"IF(MAX(D118:D121,D127:D132)>6,2,0)","v":0},{"$f":"IF(MAX(E118:E121,E127:E132)>6,2,0)","v":0},0,0,0,0,0,0,0,0,0,0,0,0,0,0,0,0,0,0,0,0,0,0,0,0,0,0,0,0,0]

{"sheet":"Basisblatt","index":5,"n_rows":68,"n_cols":45,"rows_kept":68,"cut":false,"hidden":false,"merged":[[28,15,28,18],[29,15,29,18],[2,2,2,4],[3,2,3,4],[4,2,4,4],[5,2,5,4],[6,2,6,4],[7,2,7,4],[8,9,8,10],[8,2,8,4],[11,2,11,4]]}
[null,"Zeiterfassung für das Jahr:",null,null,null,2024,null,null,null,null,{"$f":"TPraefix & \" \" & TVers2","v":"Version VSA 1.06"},null,null,null,null,null,null,null,null,null,null,"Spalten ausblenden",null,null,null,null,null,null,null,null,null,null,null,null,null,null,null,null,null,"Nur im Testmodus mit 'Statusblock' belassen' sichtbar"]
[null,null,{"$f":"ABS(SL_Jahrgang>0)","v":0},null,null,"Bitte nur weisse Eingabefelder verändern",null,null,null,null,null,null,null,null,null,null,null,null,null,null,null,null,null,null,null,null,null,null,null,null,null,null,null,null,null,null,null,null,"Abschluss-Teilbedingungen:",null,"Nicht Relevant",false,null,{"$f":"IF(AP2=TRUE,AQ2,0)","v":0},"Nicht Relevant"]
[null,"Name",null,null,null,"Beschäftigungsgrad  (Durchschnitt)",null,null,null,{"$f":"INDEX(P40:P44,AnzZeilen)","v":100},"%",null,null,"Abschluss-Status der Blätter:",null,null,null,null,null,null,null,null,null,null,null,null,null,null,null,null,null,null,null,null,null,null,null,null,"Namenblock",{"$f":"COUNTA(C3:C8)=6","v":false},"Entsperrt",false,1,{"$f":"AP3*AQ3","v":0},"Entsperrt"]
[null,"Jahrgang",null,null,null,"Ferienanspruch bei 100%:",null,null,null,{"$f":"VLOOKUP(SL_Jahr-SL_Jahrgang,VSA_FerienAnspruch,2,TRUE)","v":0},"Std.",null,null,"Basisblatt",null,null,{"$f":"IF(AP7=TRUE,\"Abgeschlossen\",\"\")","v":""},null,null,null,null,null,null,null,null,null,null,null,null,null,null,null,null,null,null,null,null,null,"EmailVG",{"$f":"NOT(ISBLANK(EmailVG))","v":false},"Geändert",false,2,{"$f":"AP4*AQ4","v":0},"Geändert"]
[null,"Pers.Nr.",null,null,null,"Kompensationsanspruch bei 100%:",null,null,null,15,"Tage",null,null,"Januar",null,null,{"$f":"IF(INDIRECT(N5&\"!AP7\")=TRUE,\"Abgeschlossen\",\"\")","v":""},null,{"$f":"INDIRECT(N5&\"!C4\")&\"\"","v":""},null,null,{"$f":"INDIRECT(N5& \"!D83\")","v":0},null,null,null,null,null,null,null,null,null,null,null,null,1,null,null,null,"BG1",{"$f":"NOT(ISBLANK(D40))","v":true},"Sperre",{"$f":"AS11=2","v":false},3,{"$f":"NOT(AP6)*AQ5","v":3},"Eingaben vornehmen"]
[null,"Bezirk","Ausserhalb Zürich",null,null," ",null,null,null,"optional:","gültig:",null,{"$f":"IF(SL_Bezirk=\"Zürich\",1,2)","v":2},"Februar",null,null,{"$f":"IF(INDIRECT(N6&\"!AP7\")=TRUE,\"Abgeschlossen\",\"\")","v":""},null,{"$f":"INDIRECT(N6&\"!C4\")&\"\"","v":""},null,null,{"$f":"INDIRECT(N6& \"!D83\")","v":0},null,null,null,null,null,null,null,null,null,null,null,null,null,null,null,null,"Regelzeiten",{"$f":"MAX(V50:V54)<2","v":false},"Abschliessbar",{"$f":"AND(AN3,AN4,AN5,AN6,NOT(AP7))","v":false},4,{"$f":"AND(NOT(OR(AP3,AP4)),AP6)*AQ6","v":0},"Abschliessbar"]
[null,"Gemeinde",null,null,null,"Berechnungsdatum bis ...",null,null,null,null,{"$f":"IF(ISBLANK(J7),TODAY(),J7)","v":"2024-02-02"},null,null,"März",null,null,{"$f":"IF(INDIRECT(N7&\"!AP7\")=TRUE,\"Abgeschlossen\",\"\")","v":""},null,{"$f":"INDIRECT(N7&\"!C4\")&\"\"","v":""},null,null,{"$f":"INDIRECT(N7& \"!D83\")","v":0},null,null,null,null,null,null,null,null,null,null,null,null,null,null,null,null,null,null,"Abgeschlossen",false,5,{"$f":"AND(NOT(OR(AP3,AP4)),AP7)*AQ7","v":0},"Abgeschlossen"]
[null,"Schule",null,null,null,"bitte leer lassen für automatisches Datum (heute)",null,null,null,null,null,null,null,"April",null,null,{"$f":"IF(INDIRECT(N8&\"!AP7\")=TRUE,\"Abgeschlossen\",\"\")","v":""},null,{"$f":"INDIRECT(N8&\"!C4\")&\"\"","v":""},null,null,{"$f":"INDIRECT(N8& \"!D83\")","v":0},null,null,null,null,null,null,null,null,null,null,null,null,null,null,null,null,null,null,"Für Jahr OK",{"$f":"AND(OR(AP2,AP7),NOT(AP3))","v":false}]
[null,"E-Mail",null,null,null,"Beginn des neuen Schuljahrs",null,null,null,{"$f":"DATE(SL_Jahr,8,1)","v":"2024-08-01"},null,null,null,"Mai",null,null,{"$f":"IF(INDIRECT(N9&\"!AP7\")=TRUE,\"Abgeschlossen\",\"\")","v":""},null,{"$f":"INDIRECT(N9&\"!C4\")&\"\"","v":""},null,null,{"$f":"INDIRECT(N9& \"!D83\")","v":0}]
[null,null,null,null,null,null,null,null,null,null,null,null,null,"Juni",null,null,{"$f":"IF(INDIRECT(N10&\"!AP7\")=TRUE,\"Abgeschlossen\",\"\")","v":""},null,{"$f":"INDIRECT(N10&\"!C4\")&\"\"","v":""},null,null,{"$f":"INDIRECT(N10& \"!D83\")","v":0},null,null,null,null,null,null,null,null,null,null,null,null,null,null,null,null,null,null,"Statusnummer:",{"$f":"MAX(AR2:AR7)","v":3}]
[null,null,"E-Mail-Adresse der vorgesetzten Stelle:",null,null,null,null,null,null,null,null,null,null,"Juli",null,null,{"$f":"IF(INDIRECT(N11&\"!AP7\")=TRUE,\"Abgeschlossen\",\"\")","v":""},null,{"$f":"INDIRECT(N11&\"!C4\")&\"\"","v":""},null,null,{"$f":"INDIRECT(N11& \"!D83\")","v":0},null,null,null,null,null,null,null,null,null,null,null,null,null,null,null,null,"HatDaten:",{"$f":"OR(AP10<>3,D40<>100,COUNTA(C3:E5,C7:E9,EmailVG,E25:F29,G27:G29,G31,P29:S30,B41:B44,D41:D44,D50:H54,C67:G68)>0)","v":false},"Statustext:",{"$f":"IFERROR(VLOOKUP(AP10,AR2:AS7,2,FALSE),\"unbekannt\")","v":"Eingaben vornehmen"},null,null,1]
[null,null,null,null,null,{"$f":"\"Ordner für Zwischendokumente \" &SL_Jahr&\" aufrufen\"","v":"Ordner für Zwischendokumente 2024 aufrufen"},null,null,null,null,null,null,null,"August",null,null,{"$f":"IF(INDIRECT(N12&\"!AP7\")=TRUE,\"Abgeschlossen\",\"\")","v":""},null,{"$f":"INDIRECT(N12&\"!C4\")&\"\"","v":""},null,null,{"$f":"INDIRECT(N12& \"!D83\")","v":0}]
[null,null,null,null,null,null,null,null,null,null,null,null,null,"September",null,null,{"$f":"IF(INDIRECT(N13&\"!AP7\")=TRUE,\"Abgeschlossen\",\"\")","v":""},null,{"$f":"INDIRECT(N13&\"!C4\")&\"\"","v":""},null,null,{"$f":"INDIRECT(N13& \"!D83\")","v":0}]
[null,null,null,null,null,null,null,null,null,null,null,null,null,"Oktober",null,null,{"$f":"IF(INDIRECT(N14&\"!AP7\")=TRUE,\"Abgeschlossen\",\"\")","v":""},null,{"$f":"INDIRECT(N14&\"!C4\")&\"\"","v":""},null,null,{"$f":"INDIRECT(N14& \"!D83\")","v":0}]
[null,"Startsaldi / Jahresübertrag",null,null,{"$f":"IF(VSATestModus=TRUE(),\"VSA-Modus!\",\"\")","v":""},null,null,null,null,null,null,null,null,"November",null,null,{"$f":"IF(INDIRECT(N15&\"!AP7\")=TRUE,\"Abgeschlossen\",\"\")","v":""},null,{"$f":"INDIRECT(N15&\"!C4\")&\"\"","v":""},null,null,{"$f":"INDIRECT(N15& \"!D83\")","v":0},null,null,null,null,null,null,null,null,null,null,null,null,null,null,null,null,null,null,null,{"$f":"SUM(AP2:AP8)","v":0}]
[null,null,null,null,null,null,null,null,null,null,null,null,null,"Dezember",null,null,{"$f":"IF(INDIRECT(N16&\"!AP7\")=TRUE,\"Abgeschlossen\",\"\")","v":""},null,{"$f":"INDIRECT(N16&\"!C4\")&\"\"","v":""},null,null,{"$f":"INDIRECT(N16& \"!D83\")","v":0}]
[null,"Bruttoarbeitszeit volles Pensum",null,null,2184,null,null,null,null,null,"Gemäss V VO §116 vom 16.12.1998",null,null,"Jahresabrechnung",null,null,{"$f":"IF(INDIRECT(N17&\"!AP7\")=TRUE,\"Abgeschlossen\",\"\")","v":""}]
[null,"Normal-Arbeitszeit/Tg. (52 Wo, 5 Tg.)",null,null,8.4]
[null,"Brutto-SOLL-Arbeitszeit nach BG",null,null,{"$f":"SL_Brutto100*MAX(H40:H44)/100","v":2184}]
[null,"Feiertagsanspruch nach BG",null,null,{"$f":"Kalender_Max_FA","v":103.80000000000003}]
[null,"Netto-SOLL-Arbeitszeit (berechnet)",null,null,{"$f":"E19-E20","v":2080.1999999999998}]
[null,"Vereinbarte SOLL-Arbeitszeit",null,null,{"$f":"Jahresabrechnung!Y6","v":-103.8},{"$f":"E22-E21","v":-2184},null,null,null,null,"Differenz Zeile 20 - Zeile 19",null,null,null,null,null,null,null,null,null,null,"Neue Zwischenberechnungen ab V. 1.03",null,null,null,null,null,null,null,null,null,null,null,null,null,null,null,null,null,null,"Gültigiger Wert:","Werte werden akzeptiert:","Limitiert"]
[null,null,null,null,null,null,null,null,null,null,null,null,null,null,null,null,null,null,null,null,null,null,null,null,null,null,null,null,null,null,null,null,null,null,null,null,null,null,null,null,"Übertrag oder ","(BG am 1.1 des Jahres)","Beschränk."]
[null,null,null,null,"Überträge aus dem Vorjahr","Korrekturen","Jahresanspr.","Total",null,null,null,null,null,null,null,null,null,null,null,null,null,null,null,null,null,null,null,null,null,null,null,null,null,null,null,null,null,null,null,null,"Korrektur","(sonst Null)"," Max. saldo"]
[null,"Arbeitszeit(AZ)-Saldo",null,null,null,null,null,{"$f":"AQ25*SL_OK","v":0},{"$f":"AZ_NORM*10*SL_BG/100","v":84},{"$f":"IF(MAX(E25,F25)>ShiftStdProWoche,\"AZ_Saldo maximal 2 Wochen Soll-Zeit!\",\"\")","v":""},null,null,null,null,null,null,null,null,null,null,null,"Arbeitszeit(AZ)-Saldo",null,null,null,null,null,null,null,null,null,null,null,null,null,null,null,null,null,null,{"$f":"IF(ISBLANK(F25),E25,F25)","v":0},{"$f":"AO25*ABS($D$40>0)","v":0},{"$f":"MIN(AP25,ShiftStdProWoche)","v":0},"AZ_Saldo maximal 2 Wochen Soll-Zeit!"]
[null,"Ferien    (Überträge nur möglich wenn Start am 1.1.)",null,null,null,null,{"$f":"INDEX(J40:J45,AnzZeilen)*SL_OK","v":0},{"$f":"(G26+AQ26)*SL_OK","v":0},null,null,null,null,null,"Beschriftungen für \"Freie Zeilen 1+2\" (optional)",null,null,null,null,null,null,null,"Ferien",null,null,null,null,null,null,null,null,null,null,null,null,null,null,null,null,null,null,{"$f":"IF(ISBLANK(F26),E26,F26)","v":0},{"$f":"AO26*ABS($D$40>0)","v":0},{"$f":"AP26","v":0}]
[null,"Dienstaltersgeschenk (DAG)",null,null,null,null,null,{"$f":"(G27+AQ27)*SL_OK","v":0},null,null,null,null,null,null,null,null,null,null,null,null,null,"Dienstaltersgeschenk (DAG)",null,null,null,null,null,null,null,null,null,null,null,null,null,null,null,null,null,null,0,0,{"$f":"AP27","v":0},"(Grau  ohne Limit)"]
[null,{"$f":"B_UUB","v":"Unbezahlter Urlaub"},null,null,null,null,null,{"$f":"(G28+AQ28)*SL_OK","v":0},null,null,null,null,null,null,null,null,null,null,null,null,null,"Unbezahlter Urlaub",null,null,null,null,null,null,null,null,null,null,null,null,null,null,null,null,null,null,0,0,0]
[null,{"$f":"B_UB","v":"Bezahlter Urlaub"},null,null,null,null,null,{"$f":"(G29+AQ29)*SL_OK","v":0},null,null,"§§ 27 ff LPVO",null,null,"freie Zeile 1:",null,null,null,null,null,null,null,"Bezahlter Urlaub",null,null,null,null,null,null,null,null,null,null,null,null,null,null,null,null,null,null,0,0,0]
[null,{"$f":"B_KompAZ","v":"Kompensation Arbeitstage"},null,null,null,null,null,{"$f":"MIN(INDEX(R40:R44,AnzZeilen),SL_KompAnspr)*SL_OK","v":0},null,null,null,null,null,"freie Zeile 2:"]
[null,"Nebenbeschäftigung",null,null,null,0,null,{"$f":"G31*SL_OK","v":0},null,null,"§§ 144 ff VVO",null,null,null,null,null,null,null,null,null,null,null,null,null,"Zellsperrung um abgeschlossene"]
["x","Frei einsetzbare Unterrichtslektionen 1",null,null,null,null,null,null,null,null,{"$f":"\"bis \"&TEXT(VSA_Schulbeginn-1,\"TT.MM.JJJJ\")","v":"bis 31.07.2024"}]
["x","Frei einsetzbare Unterrichtslektionen 2",null,null,null,null,null,null,null,null,{"$f":"\"ab  \"&TEXT(VSA_Schulbeginn,\"TT.MM.JJJJ\")","v":"ab  01.08.2024"}]
[]
[null,null,null,null,null,null,null,null,null,null,null,null,null,null,null,null,null,null,null,null,null,null,null,null,"Monate zu schützen"]
[null,"Beschäftigungsgrad, Ferienanspruch, empfohlene regelmässige Arbeitszeit",null,null,null,null,null,null,null,null,null,null,null,"Kompensationsanspruch",null,null,null,null,null,null,null,null,null,null,"Aufruf: SetLockedRows_BeiEntsperren"]
[null,null,null,null,null,null,null,null,null,null,"Empfohlene Arbeitszeit",null,null,null,null,null,null,null,null,null,null,null,{"$f":"MAX(W40:W44)","v":1},null,"Max:",{"$f":"COUNTIF(Q5:Q16,\"Abgeschlossen\")","v":0},"MinDat"]
[null,"Gültig ab","Gültig bis","BG %","Tage","Ferien","kumuliert","kumul. BG %",null,"Effektiv","Std./ Tag","Std./ Woche",null,"kompens.","kumuliert","kumuliert BG %",null,"Effektiv",null,null,null,null,null,null,"Mon1","gesperrt",{"$f":"IFERROR(MAX(AA40:AA44),ErsterJahrestag)","v":"00:00:00"}]
["x","00:00:00",null,{"$f":"IF(D40<1,D41,D40)","v":100},null,null,0,0,{"$f":"HT_NAZ","v":8.4},null,null,null,null,null,0,0]
[null,{"$f":"DATE(SL_Jahr,1,1)","v":"2024-01-01"},{"$f":"IF(ISBLANK(B41),DATE(SL_Jahr,12,31),B41-1)","v":"2024-12-31"},100,{"$f":"IF(AND(B40>0,C40>0,D40>0),DAYS360(B40,C40+1),0)","v":360},{"$f":"IF(V40=1,SL_FerienAnspr*E40/360*D40/100,0)","v":0},{"$f":"G39+F40","v":0},{"$f":"D40*E40/360+H39","v":100},{"$f":"IF(AND(B40>0,OR(D40<1,D40>100)),\"(leer)\",\"\")","v":""},{"$f":"IF(V40=1,IF(I40=\"\",G40,0),0)","v":0},{"$f":"IF(V40=1,ROUND(AZ_NORM*D40/100,2),0)","v":8.4},{"$f":"IF(K40=0,0,K40*5)","v":42},null,{"$f":"IF(AND(B40>0,C40>0,D40>0),ROUND(SL_KompAnspr*(C40-B40)/365,0),0)","v":15},{"$f":"IF(B40>0,SUM($N$39:N40),0)","v":15},{"$f":"H40","v":100},{"$f":"IF(AND(B40>0,C40>0),IF(P40>100,\"Fehler\",0),0)","v":0},{"$f":"O40","v":15},null,null,null,{"$f":"ABS(AND(B40>0,D40>0))","v":1},1,null,{"$f":"IF(B40<1,12,MONTH(B40))","v":1},{"$f":"Y40<=$Z$37","v":false},{"$f":"IFERROR(C40*Z40,0)","v":"00:00:00"}]
[null,null,{"$f":"IF(ISBLANK(B41),\"\",IF(ISBLANK(B42),DATE(SL_Jahr,12,31),B42-1))","v":""},null,{"$f":"IF(AND(B41>0,C41>0,D41>0),DAYS360(B41,C41+1),0)","v":0},{"$f":"IF(V41=1,SL_FerienAnspr*E41/360*D41/100,0)","v":0},{"$f":"G40+F41","v":0},{"$f":"D41*E41/360+H40","v":100},{"$f":"IF(AND(B41>0,OR(D41<1,D41>100)),\"(leer)\",\"\")","v":""},{"$f":"IF(V41=1,IF(I41=\"\",G41,0),0)","v":0},{"$f":"IF(V41=1,ROUNDDOWN(AZ_NORM*D41/100,2),0)","v":0},{"$f":"IF(K41=0,0,K41*5)","v":0},null,{"$f":"IF(AND(B41>0,C41>0,D41>0),ROUND(SL_KompAnspr*(C41-B41)/365,0),0)","v":0},{"$f":"IF(B41>0,SUM($N$39:N41),0)","v":0},{"$f":"H41","v":100},{"$f":"IF(AND(B41>0,C41>0),IF(P41>100,\"Fehler\",0),0)","v":0},{"$f":"O41","v":0},null,null,null,{"$f":"ABS(AND(B41>0,D41>0))","v":0},{"$f":"IF(D41>0,2,0)","v":0},null,{"$f":"IF(B41<1,12,MONTH(B41))","v":12},{"$f":"Y41<=$Z$37","v":false},{"$f":"IFERROR(C41*Z41,0)","v":"00:00:00"}]
[null,null,{"$f":"IF(ISBLANK(B42),\"\",IF(ISBLANK(B43),DATE(SL_Jahr,12,31),B43-1))","v":""},null,{"$f":"IF(AND(B42>0,C42>0,D42>0),DAYS360(B42,C42+1),0)","v":0},{"$f":"IF(V42=1,SL_FerienAnspr*E42/360*D42/100,0)","v":0},0,{"$f":"D42*E42/360+H41","v":100},"",{"$f":"IF(V42=1,IF(I42=\"\",G42,0),0)","v":0},{"$f":"IF(V42=1,ROUNDDOWN(AZ_NORM*D42/100,2),0)","v":0},0,null,{"$f":"IF(AND(B42>0,C42>0,D42>0),ROUND(SL_KompAnspr*(C42-B42)/365,0),0)","v":0},{"$f":"IF(B42>0,SUM($N$39:N42),0)","v":0},{"$f":"H42","v":100},{"$f":"IF(AND(B42>0,C42>0),IF(P42>100,\"Fehler\",0),0)","v":0},{"$f":"O42","v":0},null,null,null,{"$f":"ABS(AND(B42>0,D42>0))","v":0},{"$f":"IF(D42>0,3,0)","v":0},null,12,{"$f":"Y42<=$Z$37","v":false},{"$f":"IFERROR(C42*Z42,0)","v":"00:00:00"}]
[null,null,{"$f":"IF(ISBLANK(B43),\"\",IF(ISBLANK(B44),DATE(SL_Jahr,12,31),B44-1))","v":""},null,0,{"$f":"IF(V43=1,SL_FerienAnspr*E43/360*D43/100,0)","v":0},0,100,"",{"$f":"IF(V43=1,IF(I43=\"\",G43,0),0)","v":0},{"$f":"IF(V43=1,ROUNDDOWN(AZ_NORM*D43/100,2),0)","v":0},0,null,{"$f":"IF(AND(B43>0,C43>0,D43>0),ROUND(SL_KompAnspr*(C43-B43)/365,0),0)","v":0},{"$f":"IF(B43>0,SUM($N$39:N43),0)","v":0},{"$f":"H43","v":100},{"$f":"IF(AND(B43>0,C43>0),IF(P43>100,\"Fehler\",0),0)","v":0},{"$f":"O43","v":0},null,null,null,{"$f":"ABS(AND(B43>0,D43>0))","v":0},{"$f":"IF(D43>0,4,0)","v":0},null,12,{"$f":"Y43<=$Z$37","v":false},"00:00:00"]
[null,null,{"$f":"IF(ISBLANK(B44),\"\",DATE(SL_Jahr,12,31))","v":""},null,0,{"$f":"IF(V44=1,SL_FerienAnspr*E44/360*D44/100,0)","v":0},0,100,"",{"$f":"IF(V44=1,IF(I44=\"\",G44,0),0)","v":0},{"$f":"IF(V44=1,ROUNDDOWN(AZ_NORM*D44/100,2),0)","v":0},0,null,{"$f":"IF(AND(B44>0,C44>0,D44>0),ROUND(SL_KompAnspr*(C44-B44)/365,0),0)","v":0},{"$f":"IF(B44>0,SUM($N$39:N44),0)","v":0},{"$f":"H44","v":100},{"$f":"IF(AND(B44>0,C44>0),IF(P44>100,\"Fehler\",0),0)","v":0},{"$f":"O44","v":0},null,null,null,{"$f":"ABS(AND(B44>0,D44>0))","v":0},{"$f":"IF(D44>0,5,0)","v":0},null,12,{"$f":"Y44<=$Z$37","v":false},"00:00:00"]
[]
[null,null,null,null,null,null,null,null,null,null,null,null,null,null,null,null,null,null,null,null,null,0.05]
[null,"Regelarbeitszeit",null,"(Brutto-SOLL-Arbeitszeit,=vereinbarte SOLL-Arbeitszeit)",null,null,null,null,null,null,null,null,null,"Beispiele (dezimale Eingaben!):"]
[null,null,null,null,null,null,null,null,null,null,null,"Kontrolle",null,"50% Anstellung  (5 Tage anwesend)"]
[null,"Gültig ab","Gültig bis","Montag","Dienstag","Mittwoch","Donnerstag","Freitag","Samstag","Sonntag",null,"Woche",null,"Montag","Dienstag","Mittwoch","Donnerstag","Freitag","Samstag","Sonntag"]
[null,{"$f":"ErsterJahrestag","v":"2024-01-01"},{"$f":"C40","v":"2024-12-31"},null,null,null,null,null,null,null,1,{"$f":"SUM(D50:J50)*W50","v":0},null,{"$f":"HT_NAZ/2","v":4.2},{"$f":"HT_NAZ/2","v":4.2},{"$f":"HT_NAZ/2","v":4.2},{"$f":"HT_NAZ/2","v":4.2},{"$f":"HT_NAZ/2","v":4.2},0,0,null,{"$f":"IF(L50=L40,0,IF(ABS(L50-L40)<=TOLAB,1,2))","v":2},{"$f":"(D50<=HT_NAZ)*(E50<=HT_NAZ)*(F50<=HT_NAZ)*(G50<=HT_NAZ)*(H50<=HT_NAZ)","v":1},null,null,{"$f":"Z40","v":false}]
[null,{"$f":"B41","v":"00:00:00"},{"$f":"C41","v":""},null,null,null,null,null,null,null,{"$f":"IF(B51>0,2,K50)","v":1},{"$f":"SUM(D51:J51)*W51","v":0},null,null,null,null,null,null,null,null,null,{"$f":"IF(L51=L41,0,IF(ABS(L51-L41)<=TOLAB,1,2))","v":0},{"$f":"(D51<=HT_NAZ)*(E51<=HT_NAZ)*(F51<=HT_NAZ)*(G51<=HT_NAZ)*(H51<=HT_NAZ)","v":1},null,null,false]
[null,{"$f":"B42","v":"00:00:00"},"",null,null,null,null,null,null,null,{"$f":"IF(B52>0,3,K51)","v":1},0,null,null,null,null,null,null,null,null,null,{"$f":"IF(L52=L42,0,IF(ABS(L52-L42)<=TOLAB,1,2))","v":0},{"$f":"(D52<=HT_NAZ)*(E52<=HT_NAZ)*(F52<=HT_NAZ)*(G52<=HT_NAZ)*(H52<=HT_NAZ)","v":1},null,null,false,null,null,null,null,null,null,null,null,null,null,null,null,null,0]
[null,"00:00:00","",null,null,null,null,null,null,null,{"$f":"IF(B53>0,4,K52)","v":1},0,null,null,null,null,null,null,null,null,null,{"$f":"IF(L53=L43,0,IF(ABS(L53-L43)<=TOLAB,1,2))","v":0},{"$f":"(D53<=HT_NAZ)*(E53<=HT_NAZ)*(F53<=HT_NAZ)*(G53<=HT_NAZ)*(H53<=HT_NAZ)","v":1},null,null,false]
[null,"00:00:00","",null,null,null,null,null,null,null,{"$f":"IF(B54>0,5,K53)","v":1},0,null,"80% Anstellung  (4 Tage anwesend)",null,null,null,null,null,null,null,{"$f":"IF(L54=L44,0,IF(ABS(L54-L44)<=TOLAB,1,2))","v":0},{"$f":"(D54<=HT_NAZ)*(E54<=HT_NAZ)*(F54<=HT_NAZ)*(G54<=HT_NAZ)*(H54<=HT_NAZ)","v":1},null,null,false]
[null,{"$f":"COUNT(Datum_Schritt)-1","v":4},null,null,null,null,null,null,null,null,null,null,null,"Montag","Dienstag","Mittwoch","Donnerstag","Freitag","Samstag","Sonntag"]
[null,"Dargestellt als Stunden und Minuten:",null,null,null,null,null,null,null,null,null,null,null,{"$f":"HT_NAZ","v":8.4},{"$f":"HT_NAZ","v":8.4},{"$f":"HT_NAZ","v":8.4},{"$f":"HT_NAZ","v":8.4},0,0,0]
[]
[null,"Gültig ab","Gültig bis","Montag","Dienstag","Mittwoch","Donnerstag","Freitag","Samstag","Sonntag",null,null,null,null,null,null,null,null,null,null,null,null,null,null,null,"Hilfstabelle BG-Verweise"]
[null,{"$f":"ErsterJahrestag","v":"2024-01-01"},{"$f":"C50","v":"2024-12-31"},{"$f":"D50/24","v":0},{"$f":"E50/24","v":0},0,0,0,null,null,null,{"$f":"IF(ISBLANK(B59),\"\",SUM(D59:J59))*W50","v":0},null,null,null,null,null,null,null,null,null,null,null,null,null,{"$f":"B40","v":"2024-01-01"},{"$f":"INDEX(BG_Liste,AB59)","v":100},{"$f":"K50","v":1}]
[null,{"$f":"B41","v":"00:00:00"},{"$f":"C41","v":""},{"$f":"D51/24","v":0},0,0,0,0,null,null,null,{"$f":"IF(ISBLANK(B60),\"\",SUM(D60:J60))*W51","v":0},null,null,null,null,null,null,null,null,null,null,null,null,null,{"$f":"MAX(ErsterJahrestag:B41)","v":"2024-01-01"},{"$f":"INDEX(BG_Liste,AB60)","v":100},{"$f":"K51","v":1}]
[null,{"$f":"B42","v":"00:00:00"},"",0,0,0,0,0,null,null,null,{"$f":"IF(ISBLANK(B61),\"\",SUM(D61:J61))*W52","v":0},null,null,null,null,null,null,null,null,null,null,null,null,null,{"$f":"MAX(ErsterJahrestag:B42)","v":"2024-01-01"},{"$f":"INDEX(BG_Liste,AB61)","v":100},{"$f":"K52","v":1}]
[null,"00:00:00","",0,0,0,0,0,null,null,null,{"$f":"IF(ISBLANK(B62),\"\",SUM(D62:J62))*W53","v":0},null,null,null,null,null,null,null,null,null,null,null,null,null,{"$f":"MAX(ErsterJahrestag:B43)","v":"2024-01-01"},{"$f":"INDEX(BG_Liste,AB62)","v":100},{"$f":"K53","v":1}]
[null,"00:00:00","",0,0,0,0,0,null,null,null,{"$f":"IF(ISBLANK(B63),\"\",SUM(D63:J63))*W54","v":0},null,null,null,null,null,null,null,null,null,null,null,null,null,{"$f":"MAX(ErsterJahrestag:B44)","v":"2024-01-01"},{"$f":"INDEX(BG_Liste,AB63)","v":100},{"$f":"K54","v":1}]
[]
[]
[null,"Visum","Identität:",null,null,"Datum:","Status:",null,null,null,null,null,null,null,null,null,null,null,null,null,null,"Zeilen"]
[null,"SL",null,null,null,null,null,null,null,null,null,null,null,null,null,null,null,null,null,null,null,"ausblenden"]
[null,"VG"]

{"sheet":"Januar","index":6,"n_rows":134,"n_cols":45,"rows_kept":134,"cut":false,"hidden":true,"merged":[[11,34,12,35]]}
[1,{"$f":"DATEVALUE(\"1.\"&A1&\".\"&SL_Jahr)","v":"2024-01-01"},{"$f":"SL_Jahr","v":2024},{"$f":"B_Gde","v":"Gde:"},{"$f":"SL_Gemeinde","v":0},null,null,null,null,null,null,null,null,null,null,null,null,null,null,{"$f":"B_Schule","v":"Schule:"},{"$f":"SL_Schule","v":0},null,null,null,null,null,null,null,null,null,null,null,null,null,null,null,null,null,"Abschluss-Teilbedingungen:"]
[{"$f":"VLOOKUP(A1,Monatsenden,2)","v":45322},{"$f":"B_Bg","v":"BG:"},{"$f":"VLOOKUP(B1,VSA_Kalender,13)","v":1},{"$f":"B_Name","v":"Name:"},{"$f":"SL_Name","v":0},null,null,null,null,null,null,null,null,null,null,null,null,null,null,null,null,null,null,null,null,null,null,null,null,null,null,null,null,null,null,null,null,null,"Regel ok",{"$f":"(AN14>=AN15)","v":false},"Nicht Relevant",{"$f":"D83=0","v":true},-1,{"$f":"IF(AP2=TRUE,AQ2,0)","v":-1},"Nicht Relevant"]
[null,{"$f":"Zerf_Version & \" \" & Zerf_T","v":"Version VSA 1.06 "},null,{"$f":"DATE($C$1,MONTH($B$1),D$4)","v":"2024-01-01"},{"$f":"DATE($C$1,MONTH($B$1),E$4)","v":"2024-01-02"},"2024-01-03","2024-01-04","2024-01-05","2024-01-06","2024-01-07","2024-01-08","2024-01-09","2024-01-10","2024-01-11","2024-01-12","2024-01-13","2024-01-14","2024-01-15","2024-01-16","2024-01-17","2024-01-18","2024-01-19","2024-01-20","2024-01-21","2024-01-22","2024-01-23","2024-01-24","2024-01-25","2024-01-26","2024-01-27","2024-01-28",{"$f":"IF(MONTH(DATE($C$1,MONTH($B$1),AF$41))>MONTH($B$1),\"\",DATE($C$1,MONTH($B$1),AF$4))","v":"2024-01-29"},{"$f":"IF(MONTH(DATE($C$1,MONTH($B$1),AG$41))>MONTH($B$1),\"\",DATE($C$1,MONTH($B$1),AG$4))","v":"2024-01-30"},{"$f":"IF(MONTH(DATE($C$1,MONTH($B$1),AH$41))>MONTH($B$1),\"\",DATE($C$1,MONTH($B$1),AH$4))","v":"2024-01-31"},null,null,null,null,"Spalten ok",{"$f":"(L83>=D83)","v":true},"Entsperrt",false,1,{"$f":"AP3*AQ3","v":0},"Entsperrt"]
[null,{"$f":"IF(VSATestModus=TRUE(),\"VSA-Modus!\",\"\")","v":""},{"$f":"IF(AN52>0,\"DEFEKT\",\"\")","v":""},{"$f":"IF(MONTH(DATE($C$1,MONTH($B$1),D$41))>MONTH($B$1),\"\",D41)","v":1},2,3,4,5,6,7,8,9,10,11,12,13,14,15,16,17,18,19,20,21,22,23,24,25,26,27,28,{"$f":"IF(MONTH(DATE($C$1,MONTH($B$1),AF$41))>MONTH($B$1),\"\",AF41)","v":29},{"$f":"IF(MONTH(DATE($C$1,MONTH($B$1),AG$41))>MONTH($B$1),\"\",AG41)","v":30},{"$f":"IF(MONTH(DATE($C$1,MONTH($B$1),AH$41))>MONTH($B$1),\"\",AH41)","v":31},null,null,null,null,"Keine Fehler",{"$f":"(SUM(D87:AH87)=0)","v":true},"Geändert",false,2,{"$f":"AP4*AQ4","v":0},"Geändert"]
[null,"     Ein   >>>",null,null,null,null,null,null,null,null,null,null,null,null,null,null,null,null,null,null,null,null,null,null,null,null,null,null,null,null,null,null,null,null,null,null,null,null,"Keine Hand",{"$f":"(AI12=\"\")","v":true},"Sperre",{"$f":"AS11=2","v":false},3,{"$f":"NOT(AP6)*AQ5","v":3},"Eingaben vornehmen"]
[null,"<<<   Aus     ",null,null,null,null,null,null,null,null,null,null,null,null,null,null,null,null,null,null,null,null,null,null,null,null,null,null,null,null,null,null,null,null,null,null,null,null,null,null,"Abschliessbar 1",{"$f":"AND(OR(AN2,AN3),AN4,AN5,NOT(AP7),NOT(AP2))","v":false},4,{"$f":"AND(NOT(OR(AP3,AP4)),AP6)*AQ6","v":0},"Abschliessbar 1"]
[null,"     Ein   >>>",null,null,null,null,null,null,null,null,null,null,null,null,null,null,null,null,null,null,null,null,null,null,null,null,null,null,null,null,null,null,null,null,null,null,null,null,null,null,"Abgeschlossen",false,5,{"$f":"AND(NOT(OR(AP3,AP4)),AP7)*AQ7","v":0},"Abgeschlossen"]
[null,"<<<   Aus     ",null,null,null,null,null,null,null,null,null,null,null,null,null,null,null,null,null,null,null,null,null,null,null,null,null,null,null,null,null,null,null,null,null,null,null,null,null,null,"Für Jahr OK",{"$f":"AND(OR(AP2,AP7),NOT(AP3))","v":true}]
[null,"     Ein   >>>"]
[null,"<<<   Aus     ",null,null,null,null,null,null,null,null,null,null,null,null,null,null,null,null,null,null,null,null,null,null,null,null,null,null,null,null,null,null,null,null,null,null,null,null,null,null,"Statusnummer:",{"$f":"IF(AR2=AQ2,AQ2,MAX(AR2:AR7))","v":-1}]
[null,"     Ein   >>>",null,null,null,null,null,null,null,null,null,null,null,null,null,null,null,null,null,null,null,null,null,null,null,null,null,null,null,null,null,null,null,null,null,null,null,null,"HatDaten:",{"$f":"AND(AP2=FALSE,OR(AP10<>3,COUNTA(D5:AH12,D20:AH35,D39:L40)>0))","v":false},"Statustext:",{"$f":"IFERROR(VLOOKUP(AP10,AR2:AS7,2,FALSE),\"unbekannt\")","v":"Nicht Relevant"},null,null,1]
[null,"<<<   Aus     ",null,null,null,null,null,null,null,null,null,null,null,null,null,null,null,null,null,null,null,null,null,null,null,null,null,null,null,null,null,null,null,null,{"$f":"IF(COUNTIF(D37:AH37,\"I\")>0,\"I\",\"\")","v":""}]
[null,{"$f":"B_PrZeit","v":"Präsenzzeit"},null,{"$f":"24*(D6-D5+D8-D7+D10-D9+D12-D11)*D88","v":0},{"$f":"24*(E6-E5+E8-E7+E10-E9+E12-E11)*E88","v":0},0,0,0,0,0,0,0,0,0,0,0,0,0,0,0,0,0,0,0,0,0,0,0,0,0,0,0,0,0,null,null,null,null,"Anzahl Regeltage:",{"$f":"D83","v":0}]
[null,{"$f":"B_TotalAZist","v":"Total Arbeitszeit (IST)"},null,{"$f":"IF(D13+D35>=D15,D13+D35,MIN(D13+D35+SUM(D20,D22,D23,D24,D25,D26,D27,D28,D29,D30,D31,D32,D33,D34),IF(D15<0,0,D15)))*D82","v":0},0,0,0,0,0,0,0,0,0,0,0,0,0,{"$f":"IF(R13+R35>=R15,R13+R35,MIN(R13+R35+SUM(R20,R22,R23,R24,R25,R26,R27,R28,R29,R30,R31,R32,R33,R34),IF(R15<0,0,R15)))*R82","v":0},{"$f":"IF(S13+S35>=S15,S13+S35,MIN(S13+S35+SUM(S20,S22,S23,S24,S25,S26,S27,S28,S29,S30,S31,S32,S33,S34),IF(S15<0,0,S15)))*S82","v":0},{"$f":"IF(T13+T35>=T15,T13+T35,MIN(T13+T35+SUM(T20,T22,T23,T24,T25,T26,T27,T28,T29,T30,T31,T32,T33,T34),IF(T15<0,0,T15)))*T82","v":0},{"$f":"IF(U13+U35>=U15,U13+U35,MIN(U13+U35+SUM(U20,U22,U23,U24,U25,U26,U27,U28,U29,U30,U31,U32,U33,U34),IF(U15<0,0,U15)))*U82","v":0},0,0,0,0,0,0,0,0,0,0,0,0,0,{"$f":"SUMIF($D$82:$AH$82,1,D14:AH14)","v":0},{"$f":"AI14-AI15","v":16.8},null,null,"Erfasste Regeltage",{"$f":"L83","v":0},{"$f":"AN13-AN14","v":0},"Fehlende Regeltage"]
[null,{"$f":"B_NettoSollAZ","v":"Netto-SOLL-Arbeitszeit"},null,{"$f":"ROUND(D16-D19,2)","v":-8.4},{"$f":"ROUND(E16-E19,2)","v":-8.4},0,0,0,0,0,0,0,0,0,0,0,0,0,0,0,0,0,0,0,0,0,0,0,0,0,0,{"$f":"IF(AF$42=4,0,ROUND(AF16-AF19,2))","v":0},{"$f":"IF(AG$42=4,0,ROUND(AG16-AG19,2))","v":0},0,{"$f":"SUMIF($D$82:$AH$82,1,D15:AH15)","v":-16.8},null,null,null,"Minimum Regeltage",{"$f":"MinRegeltage","v":1},"Ist als Konstante im Blatt \"Intern\" hinterlegt"]
[null,{"$f":"B_BruttoSollAZ","v":"Brutto-SOLL-Arb.zeit"},null,{"$f":"VLOOKUP(D3,VSA_Kalender,16)","v":0},0,0,0,0,0,0,0,0,0,0,0,0,0,0,0,0,0,0,0,0,0,0,0,0,0,0,0,{"$f":"IF(AF$42=4,0,VLOOKUP(AF3,VSA_Kalender,16))","v":0},{"$f":"IF(AG$42=4,0,VLOOKUP(AG3,VSA_Kalender,16))","v":0},{"$f":"IF(AH$42=4,0,VLOOKUP(AH3,VSA_Kalender,16))","v":0},null,null,null,null,"Regel ok","Mind. eigetr. Regeltage erfüllt"]
[null,{"$f":"B_MehrMinder","v":"Mehr-/Minderleistung"},null,{"$f":"(SL_BisDatum>=D3)*ROUND(D14-D15,2)","v":8.4},8.4,0,0,0,0,0,0,0,0,0,0,0,0,0,0,0,0,0,0,0,0,0,0,0,0,0,0,0,0,0,{"$f":"B_Total","v":"Total"},{"$f":"B_Vortrag","v":"Vortrag"},null,null,"Spalten ok:","Alle Einträge an Regeltagen ok"]
[null,{"$f":"B_AZSaldo","v":"AZ - Saldo"},{"$f":"VLOOKUP(ROW(),VSA_Uebertrag,$A$1+3)","v":0},{"$f":"IFERROR((C18+D17)*(D3<=SL_BisDatum)*VLOOKUP(D3,VSA_Kalender,21,FALSE),0)","v":8.4},16.8,16.8,{"$f":"IFERROR((F18+G17)*(G3<=SL_BisDatum)*VLOOKUP(G3,VSA_Kalender,21,FALSE),0)","v":16.8},16.8,16.8,16.8,16.8,16.8,16.8,16.8,16.8,16.8,16.8,16.8,16.8,16.8,16.8,16.8,16.8,16.8,16.8,16.8,16.8,16.8,16.8,16.8,16.8,16.8,16.8,16.8,null,{"$f":"SUMIF($D$82:$AH$82,1,D17:AH17)+C18","v":16.8}]
[null,{"$f":"B_FTA","v":"Feiertagsanspruch"},0,{"$f":"VLOOKUP(D3,VSA_Kalender,14)","v":8.4},8.4,0,0,0,0,0,0,0,0,0,0,0,0,0,0,0,0,0,0,0,0,0,0,0,0,0,0,{"$f":"IF(AF$42=4,0,VLOOKUP(AF3,VSA_Kalender,14))","v":0},{"$f":"IF(AG$42=4,0,VLOOKUP(AG3,VSA_Kalender,14))","v":0},{"$f":"IF(AH$42=4,0,VLOOKUP(AH3,VSA_Kalender,14))","v":0},{"$f":"SUM(D19:AH19)","v":16.8}]
[null,{"$f":"B_Ferien","v":"Ferien"},{"$f":"VLOOKUP(ROW(),VSA_Uebertrag,$A$1+3)","v":0},null,null,null,null,null,null,null,null,null,null,null,null,null,null,null,null,null,null,null,null,null,null,null,null,null,null,null,null,null,null,null,{"$f":"SUMIF($D$82:$AH$82,1,D20:AH20)","v":0},{"$f":"ROUND(C20-AI20,2)","v":0},"Rest"]
[null,{"$f":"B_KompAZ","v":"Kompensation Arbeitstage"},0,null,null,null,null,null,null,null,null,null,null,null,null,null,null,null,null,null,null,null,null,null,null,null,null,null,null,null,null,null,null,null,0,{"$f":"ROUND(A21+C21-AI21,0)","v":0}]
[null,{"$f":"B_Arzt","v":"Arztbesuch"},0,null,null,null,null,null,null,null,null,null,null,null,null,null,null,null,null,null,null,null,null,null,null,null,null,null,null,null,null,null,null,null,0,{"$f":"ROUND(A22+C22+AI22,2)","v":0},"Summen"]
[null,{"$f":"B_Krank","v":"Krankheit"},0,null,null,null,null,null,null,null,null,null,null,null,null,null,null,null,null,null,null,null,null,null,null,null,null,null,null,null,null,null,null,null,0,{"$f":"ROUND(A23+C23+AI23,2)","v":0}]
[null,{"$f":"B_BU","v":"Berufsunfall"},0,null,null,null,null,null,null,null,null,null,null,null,null,null,null,null,null,null,null,null,null,null,null,null,null,null,null,null,null,null,null,null,0,0]
[null,{"$f":"B_NBU","v":"Nichtberufsunfall"},0,null,null,null,null,null,null,null,null,null,null,null,null,null,null,null,null,null,null,null,null,null,null,null,null,null,null,null,null,null,null,null,0,0]
[null,{"$f":"B_MilZiv","v":"Militär / Zivilschutz"},0,null,null,null,null,null,null,null,null,null,null,null,null,null,null,null,null,null,null,null,null,null,null,null,null,null,null,null,null,null,null,null,0,0]
[null,{"$f":"B_UUB","v":"Unbezahlter Urlaub"},0,null,null,null,null,null,null,null,null,null,null,null,null,null,null,null,null,null,null,null,null,null,null,null,null,null,null,null,null,null,null,null,0,{"$f":"ROUND(A27+C27-AI27,2)","v":0},"Rest"]
[null,{"$f":"B_UB","v":"Bezahlter Urlaub"},0,null,null,null,null,null,null,null,null,null,null,null,null,null,null,null,null,null,null,null,null,null,null,null,null,null,null,null,null,null,null,null,0,{"$f":"ROUND(A28+C28-AI28,2)","v":0}]
[null,{"$f":"B_NebenB","v":"Nebenbeschäftigung"},0,null,null,null,null,null,null,null,null,null,null,null,null,null,null,null,null,null,null,null,null,null,null,null,null,null,null,null,null,null,null,null,0,0]
[null,{"$f":"B_DAG","v":"D A G"},0,null,null,null,null,null,null,null,null,null,null,null,null,null,null,null,null,null,null,null,null,null,null,null,null,null,null,null,null,null,null,null,0,0]
[null,{"$f":"B_Divers","v":"Diverses"},0,null,null,null,null,null,null,null,null,null,null,null,null,null,null,null,null,null,null,null,null,null,null,null,null,null,null,null,null,null,null,null,0,0,"Summen"]
[null,{"$f":"B_FamPersErg","v":"Fam./pers. Ereignisse"},0,null,null,null,null,null,null,null,null,null,null,null,null,null,null,null,null,null,null,null,null,null,null,null,null,null,null,null,null,null,null,null,0,0]
[null,{"$f":"B_FZ1","v":"freie Zeile 1"},0,null,null,null,null,null,null,null,null,null,null,null,null,null,null,null,null,null,null,null,null,null,null,null,null,null,null,null,null,null,null,null,0,0]
[null,{"$f":"B_FZ2","v":"freie Zeile 2"},0,null,null,null,null,null,null,null,null,null,null,null,null,null,null,null,null,null,null,null,null,null,null,null,null,null,null,null,null,null,null,null,0,0]
[null,{"$f":"B_WB","v":"Weiterbildung"},0,null,null,null,null,null,null,null,null,null,null,null,null,null,null,null,null,null,null,null,null,null,null,null,null,null,null,null,null,null,null,null,0,0]
[null,{"$f":"B_FEL","v":"frei einsetzbare Lekt."},0,null,null,null,null,null,null,null,null,null,null,null,null,null,null,null,null,null,null,null,null,null,null,null,null,null,null,null,null,null,null,null,{"$f":"SUM(D36:AH36)","v":0},{"$f":"ROUND(C36-AI36,0)","v":0}]
[null,null,null,{"$f":"IF(AND((D13 - D15)+SUM(D20,D22:D34)>0.00001,SUM(D20,D22:D34)>0),\"I\",\"\")","v":""},"","","","","","","","","","","","","","","","","","","","","","","","","","","","","",""]
[null,null,"Visum","Identität:",null,null,null,null,"Datum:",null,"Status:"]
[null,null,"SL"]
[null,null,"VG"]
[null,null,null,1,2,3,4,5,6,7,8,9,10,11,12,13,14,15,16,17,18,19,20,21,22,23,24,25,26,27,28,29,30,31]
[null,null,null,{"$f":"IF(D3=\"\",4,VLOOKUP(D3,VSA_Kalender,18))","v":1},1,0,0,0,1,1,0,0,0,0,0,1,1,0,0,0,0,0,1,1,0,0,0,0,0,1,1,0,0,0]
[]
[null,null,null,{"$f":"IF(D19>0,VLOOKUP(D3,KalFeiertage,6,FALSE),\"\")","v":"Neujahr"},"Berchtoldstag","","","","","","","","","","","","","","","","","","","","","","","","","","","","",""]
[null,null,null,"FT=WENN(D13+D35>=D15;D13+D35;MIN(D13+D35+SUMME(D20;D22;D23;D24;D25;D26;D27;D28;D29;D30;D31;D32;D33;D34);WENN(D15<0;0;D15)))*D82","FT=WENN(E13+E35>=E15;E13+E35;MIN(E13+E35+SUMME(E20;E22;E23;E24;E25;E26;E27;E28;E29;E30;E31;E32;E33;E34);WENN(E15<0;0;E15)))*E82","FT=WENN(F13+F35>=F15;F13+F35;MIN(F13+F35+SUMME(F20;F22;F23;F24;F25;F26;F27;F28;F29;F30;F31;F32;F33;F34);WENN(F15<0;0;F15)))*F82","FT=WENN(G13+G35>=G15;G13+G35;MIN(G13+G35+SUMME(G20;G22;G23;G24;G25;G26;G27;G28;G29;G30;G31;G32;G33;G34);WENN(G15<0;0;G15)))*G82","FT=WENN(H13+H35>=H15;H13+H35;MIN(H13+H35+SUMME(H20;H22;H23;H24;H25;H26;H27;H28;H29;H30;H31;H32;H33;H34);WENN(H15<0;0;H15)))*H82","FT=WENN(I13+I35>=I15;I13+I35;MIN(I13+I35+SUMME(I20;I22;I23;I24;I25;I26;I27;I28;I29;I30;I31;I32;I33;I34);WENN(I15<0;0;I15)))*I82","FT=WENN(J13+J35>=J15;J13+J35;MIN(J13+J35+SUMME(J20;J22;J23;J24;J25;J26;J27;J28;J29;J30;J31;J32;J33;J34);WENN(J15<0;0;J15)))*J82","FT=WENN(K13+K35>=K15;K13+K35;MIN(K13+K35+SUMME(K20;K22;K23;K24;K25;K26;K27;K28;K29;K30;K31;K32;K33;K34);WENN(K15<0;0;K15)))*K82","FT=WENN(L13+L35>=L15;L13+L35;MIN(L13+L35+SUMME(L20;L22;L23;L24;L25;L26;L27;L28;L29;L30;L31;L32;L33;L34);WENN(L15<0;0;L15)))*L82","FT=WENN(M13+M35>=M15;M13+M35;MIN(M13+M35+SUMME(M20;M22;M23;M24;M25;M26;M27;M28;M29;M30;M31;M32;M33;M34);WENN(M15<0;0;M15)))*M82","FT=WENN(N13+N35>=N15;N13+N35;MIN(N13+N35+SUMME(N20;N22;N23;N24;N25;N26;N27;N28;N29;N30;N31;N32;N33;N34);WENN(N15<0;0;N15)))*N82","FT=WENN(O13+O35>=O15;O13+O35;MIN(O13+O35+SUMME(O20;O22;O23;O24;O25;O26;O27;O28;O29;O30;O31;O32;O33;O34);WENN(O15<0;0;O15)))*O82","FT=WENN(P13+P35>=P15;P13+P35;MIN(P13+P35+SUMME(P20;P22;P23;P24;P25;P26;P27;P28;P29;P30;P31;P32;P33;P34);WENN(P15<0;0;P15)))*P82","FT=WENN(Q13+Q35>=Q15;Q13+Q35;MIN(Q13+Q35+SUMME(Q20;Q22;Q23;Q24;Q25;Q26;Q27;Q28;Q29;Q30;Q31;Q32;Q33;Q34);WENN(Q15<0;0;Q15)))*Q82","FT=WENN(R13+R35>=R15;R13+R35;MIN(R13+R35+SUMME(R20;R22;R23;R24;R25;R26;R27;R28;R29;R30;R31;R32;R33;R34);WENN(R15<0;0;R15)))*R82","FT=WENN(S13+S35>=S15;S13+S35;MIN(S13+S35+SUMME(S20;S22;S23;S24;S25;S26;S27;S28;S29;S30;S31;S32;S33;S34);WENN(S15<0;0;S15)))*S82","FT=WENN(T13+T35>=T15;T13+T35;MIN(T13+T35+SUMME(T20;T22;T23;T24;T25;T26;T27;T28;T29;T30;T31;T32;T33;T34);WENN(T15<0;0;T15)))*T82","FT=WENN(U13+U35>=U15;U13+U35;MIN(U13+U35+SUMME(U20;U22;U23;U24;U25;U26;U27;U28;U29;U30;U31;U32;U33;U34);WENN(U15<0;0;U15)))*U82","FT=WENN(V13+V35>=V15;V13+V35;MIN(V13+V35+SUMME(V20;V22;V23;V24;V25;V26;V27;V28;V29;V30;V31;V32;V33;V34);WENN(V15<0;0;V15)))*V82","FT=WENN(W13+W35>=W15;W13+W35;MIN(W13+W35+SUMME(W20;W22;W23;W24;W25;W26;W27;W28;W29;W30;W31;W32;W33;W34);WENN(W15<0;0;W15)))*W82","FT=WENN(X13+X35>=X15;X13+X35;MIN(X13+X35+SUMME(X20;X22;X23;X24;X25;X26;X27;X28;X29;X30;X31;X32;X33;X34);WENN(X15<0;0;X15)))*X82","FT=WENN(Y13+Y35>=Y15;Y13+Y35;MIN(Y13+Y35+SUMME(Y20;Y22;Y23;Y24;Y25;Y26;Y27;Y28;Y29;Y30;Y31;Y32;Y33;Y34);WENN(Y15<0;0;Y15)))*Y82","FT=WENN(Z13+Z35>=Z15;Z13+Z35;MIN(Z13+Z35+SUMME(Z20;Z22;Z23;Z24;Z25;Z26;Z27;Z28;Z29;Z30;Z31;Z32;Z33;Z34);WENN(Z15<0;0;Z15)))*Z82","FT=WENN(AA13+AA35>=AA15;AA13+AA35;MIN(AA13+AA35+SUMME(AA20;AA22;AA23;AA24;AA25;AA26;AA27;AA28;AA29;AA30;AA31;AA32;AA33;AA34);WENN(AA15<0;0;AA15)))*AA82","FT=WENN(AB13+AB35>=AB15;AB13+AB35;MIN(AB13+AB35+SUMME(AB20;AB22;AB23;AB24;AB25;AB26;AB27;AB28;AB29;AB30;AB31;AB32;AB33;AB34);WENN(AB15<0;0;AB15)))*AB82","FT=WENN(AC13+AC35>=AC15;AC13+AC35;MIN(AC13+AC35+SUMME(AC20;AC22;AC23;AC24;AC25;AC26;AC27;AC28;AC29;AC30;AC31;AC32;AC33;AC34);WENN(AC15<0;0;AC15)))*AC82","FT=WENN(AD13+AD35>=AD15;AD13+AD35;MIN(AD13+AD35+SUMME(AD20;AD22;AD23;AD24;AD25;AD26;AD27;AD28;AD29;AD30;AD31;AD32;AD33;AD34);WENN(AD15<0;0;AD15)))*AD82","FT=WENN(AE13+AE35>=AE15;AE13+AE35;MIN(AE13+AE35+SUMME(AE20;AE22;AE23;AE24;AE25;AE26;AE27;AE28;AE29;AE30;AE31;AE32;AE33;AE34);WENN(AE15<0;0;AE15)))*AE82","FT=WENN(AF13+AF35>=AF15;AF13+AF35;MIN(AF13+AF35+SUMME(AF20;AF22;AF23;AF24;AF25;AF26;AF27;AF28;AF29;AF30;AF31;AF32;AF33;AF34);WENN(AF15<0;0;AF15)))*AF82","FT=WENN(AG13+AG35>=AG15;AG13+AG35;MIN(AG13+AG35+SUMME(AG20;AG22;AG23;AG24;AG25;AG26;AG27;AG28;AG29;AG30;AG31;AG32;AG33;AG34);WENN(AG15<0;0;AG15)))*AG82","FT=WENN(AH13+AH35>=AH15;AH13+AH35;MIN(AH13+AH35+SUMME(AH20;AH22;AH23;AH24;AH25;AH26;AH27;AH28;AH29;AH30;AH31;AH32;AH33;AH34);WENN(AH15<0;0;AH15)))*AH82"]
[null,null,null,"FT=24*(D6-D5+D8-D7+D10-D9+D12-D11)*D88","FT=24*(E6-E5+E8-E7+E10-E9+E12-E11)*E88","FT=24*(F6-F5+F8-F7+F10-F9+F12-F11)*F88","FT=24*(G6-G5+G8-G7+G10-G9+G12-G11)*G88","FT=24*(H6-H5+H8-H7+H10-H9+H12-H11)*H88","FT=24*(I6-I5+I8-I7+I10-I9+I12-I11)*I88","FT=24*(J6-J5+J8-J7+J10-J9+J12-J11)*J88","FT=24*(K6-K5+K8-K7+K10-K9+K12-K11)*K88","FT=24*(L6-L5+L8-L7+L10-L9+L12-L11)*L88","FT=24*(M6-M5+M8-M7+M10-M9+M12-M11)*M88","FT=24*(N6-N5+N8-N7+N10-N9+N12-N11)*N88","FT=24*(O6-O5+O8-O7+O10-O9+O12-O11)*O88","FT=24*(P6-P5+P8-P7+P10-P9+P12-P11)*P88","FT=24*(Q6-Q5+Q8-Q7+Q10-Q9+Q12-Q11)*Q88","FT=24*(R6-R5+R8-R7+R10-R9+R12-R11)*R88","FT=24*(S6-S5+S8-S7+S10-S9+S12-S11)*S88","FT=24*(T6-T5+T8-T7+T10-T9+T12-T11)*T88","FT=24*(U6-U5+U8-U7+U10-U9+U12-U11)*U88","FT=24*(V6-V5+V8-V7+V10-V9+V12-V11)*V88","FT=24*(W6-W5+W8-W7+W10-W9+W12-W11)*W88","FT=24*(X6-X5+X8-X7+X10-X9+X12-X11)*X88","FT=24*(Y6-Y5+Y8-Y7+Y10-Y9+Y12-Y11)*Y88","FT=24*(Z6-Z5+Z8-Z7+Z10-Z9+Z12-Z11)*Z88","FT=24*(AA6-AA5+AA8-AA7+AA10-AA9+AA12-AA11)*AA88","FT=24*(AB6-AB5+AB8-AB7+AB10-AB9+AB12-AB11)*AB88","FT=24*(AC6-AC5+AC8-AC7+AC10-AC9+AC12-AC11)*AC88","FT=24*(AD6-AD5+AD8-AD7+AD10-AD9+AD12-AD11)*AD88","FT=24*(AE6-AE5+AE8-AE7+AE10-AE9+AE12-AE11)*AE88","FT=24*(AF6-AF5+AF8-AF7+AF10-AF9+AF12-AF11)*AF88","FT=24*(AG6-AG5+AG8-AG7+AG10-AG9+AG12-AG11)*AG88","FT=24*(AH6-AH5+AH8-AH7+AH10-AH9+AH12-AH11)*AH88"]
[null,null,null,"FT=ODER(D14>0;D21>0)*1","FT=ODER(E14>0;E21>0)*1","FT=ODER(F14>0;F21>0)*1","FT=ODER(G14>0;G21>0)*1","FT=ODER(H14>0;H21>0)*1","FT=ODER(I14>0;I21>0)*1","FT=ODER(J14>0;J21>0)*1","FT=ODER(K14>0;K21>0)*1","FT=ODER(L14>0;L21>0)*1","FT=ODER(M14>0;M21>0)*1","FT=ODER(N14>0;N21>0)*1","FT=ODER(O14>0;O21>0)*1","FT=ODER(P14>0;P21>0)*1","FT=ODER(Q14>0;Q21>0)*1","FT=ODER(R14>0;R21>0)*1","FT=ODER(S14>0;S21>0)*1","FT=ODER(T14>0;T21>0)*1","FT=ODER(U14>0;U21>0)*1","FT=ODER(V14>0;V21>0)*1","FT=ODER(W14>0;W21>0)*1","FT=ODER(X14>0;X21>0)*1","FT=ODER(Y14>0;Y21>0)*1","FT=ODER(Z14>0;Z21>0)*1","FT=ODER(AA14>0;AA21>0)*1","FT=ODER(AB14>0;AB21>0)*1","FT=ODER(AC14>0;AC21>0)*1","FT=ODER(AD14>0;AD21>0)*1","FT=ODER(AE14>0;AE21>0)*1","FT=ODER(AF14>0;AF21>0)*1","FT=ODER(AG14>0;AG21>0)*1","FT=ODER(AH14>0;AH21>0)*1"]
[null,null,null,{"$f":"ABS(\"FT\"&_xlfn.FORMULATEXT(D14)<>D45)","v":0},{"$f":"ABS(\"FT\"&_xlfn.FORMULATEXT(E14)<>E45)","v":0},0,0,0,0,0,0,0,0,0,0,0,0,0,0,0,0,0,0,0,0,0,0,0,0,0,0,0,0,0]
[null,null,null,{"$f":"ABS(\"FT\"&_xlfn.FORMULATEXT(D13)<>D46)","v":0},{"$f":"ABS(\"FT\"&_xlfn.FORMULATEXT(E13)<>E46)","v":0},0,0,0,0,0,0,0,0,0,0,0,0,0,0,0,0,0,0,0,0,0,0,0,0,0,0,0,0,0]
[null,null,null,{"$f":"ABS(\"FT\"&_xlfn.FORMULATEXT(D80)<>D47)","v":0},{"$f":"ABS(\"FT\"&_xlfn.FORMULATEXT(E80)<>E47)","v":0},0,0,0,0,0,0,0,0,0,0,0,0,0,0,0,0,0,0,0,0,0,0,0,0,0,0,0,0,0]
[null,null,null,{"$f":"ABS(ISERROR(D37))","v":0},{"$f":"ABS(ISERROR(E37))","v":0},0,0,0,0,0,0,0,0,0,0,0,0,0,0,0,0,0,0,0,0,0,0,0,0,0,0,0,0,0]
[null,null,null,{"$f":"SUM(D48:D51)","v":0},{"$f":"SUM(E48:E51)","v":0},0,0,0,0,0,0,0,0,0,0,0,0,0,0,0,0,0,0,0,0,0,0,0,0,0,0,0,0,0,null,null,null,null,"Formel defekt",{"$f":"SUM(D52:AH52)","v":0}]
[]
[]
[]
[]
[]
[]
[]
[]
[]
[]
[]
[]
[]
[]
[]
[]
[]
[]
[]
[]
[]
[]
[]
[]
[null,"HT_Naz-Kopie",{"$f":"HT_NAZ","v":8.4}]
[null,"Heute:",{"$f":"SL_BisDatum","v":"2024-02-02"}]
[null,null,"Reguläre Tage ausgefüllt",{"$f":"((D80*D81)=1)*1","v":0},{"$f":"((E80*E81)=1)*1","v":0},0,0,0,0,0,0,0,0,0,0,0,0,0,0,0,0,0,0,0,0,0,0,0,0,0,0,0,0,0]
[null,null,"Arbeitstage ausgefüllt",{"$f":"OR(D14>0,D21>0)*1","v":0},{"$f":"OR(E14>0,E21>0)*1","v":0},0,0,0,0,0,0,0,0,0,0,0,0,0,0,0,0,0,0,0,0,0,0,0,0,0,0,0,0,0]
[null,null,"Arbeitstage wenn BG>0%",{"$f":"IFERROR(VLOOKUP(D3,VSA_Kalender,22),0)","v":0},0,0,0,0,0,0,0,0,0,0,0,0,0,0,0,0,0,0,0,0,0,0,0,0,0,0,0,0,0,0]
[null,null,"Der BG beträgt mehr als 0%",{"$f":"IF(D4=\"\",0,ABS(VLOOKUP(D3,VSA_Kalender,13,FALSE)>0))","v":1},1,1,1,1,1,1,1,1,1,1,1,1,1,1,1,1,1,1,1,1,1,1,1,1,1,1,1,1,1,1]
[null,null,"(Ja: 1, Nein: 0)",{"$f":"SUM(D81:AH81)","v":0},"Total Tage bei BG>0%",null,null,{"$f":"SUM(D80:AH80)","v":0},"Total Tage ausgefüllt",null,null,{"$f":"SUM(D79:AH79)","v":0},"Total reguläre Tage ausgefüllt"]
[]
[null,null,"Tag des Monats",{"$f":"D4","v":1},2,3,4,5,6,7,8,9,10,11,12,13,14,15,16,17,18,19,20,21,22,23,24,25,26,27,28,29,30,31]
[null,null,"Ist Arbeitsbereich",{"$f":"IFERROR(ABS(WEEKDAY(D3,2)<6),0)","v":1},1,1,1,1,0,0,1,1,1,1,1,0,0,1,1,1,1,1,0,0,1,1,1,1,1,0,0,1,1,1]
[null,null,"Maximaler Fehler",{"$f":"MAX(D100:D107,D98,D134)","v":0},{"$f":"MAX(E100:E107,E98,E134)","v":0},0,0,0,0,0,0,0,0,0,0,0,0,0,0,0,0,0,0,0,0,0,0,0,0,0,0,0,0,0]
[null,null,"Wird die Präsenzzeit angezeigt?",{"$f":"IF(D87=0,1,0)","v":1},{"$f":"IF(E87=0,1,0)","v":1},1,1,1,1,1,1,1,1,1,1,1,1,1,1,1,1,1,1,1,1,1,1,1,1,1,1,1,1,1]
[]
[null,null,"Gruppenfehler 1",{"$f":"IF(AND(D6-D5=0,COUNTA(D7:D12)>0),1,0)","v":0},0,0,0,0,0,0,0,0,0,0,0,0,0,0,0,0,0,0,0,0,0,0,0,0,0,0,0,0,0,0]
[null,"Gruppenfehler","(aus)",{"$f":"D90","v":0},0,0,0,0,0,0,0,0,0,0,0,0,0,0,0,0,0,0,0,0,0,0,0,0,0,0,0,0,0,0]
[null,null,"Gruppenfehler 2",{"$f":"IF(AND(D8-D7=0,COUNTA(D9:D12)>0),1,0)","v":0},0,0,0,0,0,0,0,0,0,0,0,0,0,0,0,0,0,0,0,0,0,0,0,0,0,0,0,0,0,0]
[null,null,"(aus)",{"$f":"D92","v":0},0,0,0,0,0,0,0,0,0,0,0,0,0,0,0,0,0,0,0,0,0,0,0,0,0,0,0,0,0,0]
[null,null,"Gruppenfehler 3",{"$f":"IF(AND(D10-D9=0,COUNTA(D11:D12)>0),1,0)","v":0},0,0,0,0,0,0,0,0,0,0,0,0,0,0,0,0,0,0,0,0,0,0,0,0,0,0,0,0,0,0]
[null,null,"(aus)",{"$f":"D94","v":0},0,0,0,0,0,0,0,0,0,0,0,0,0,0,0,0,0,0,0,0,0,0,0,0,0,0,0,0,0,0]
[null,null,"leer"]
[null,null,"leer"]
[null,null,"Genereller Gruppenfehler",{"$f":"MAX(D90:D95)","v":0},0,0,0,0,0,0,0,0,0,0,0,0,0,0,0,0,0,0,0,0,0,0,0,0,0,0,0,0,0,0]
[]
[null,null,"Ein1",{"$f":"IF(AND(D109=0,D110>0),1,0)","v":0},{"$f":"IF(AND(E109=0,E110>0),1,0)","v":0},0,0,0,0,0,0,0,0,0,0,0,0,0,0,0,0,0,0,0,0,0,0,0,0,0,0,0,0,0]
[null,null,"Aus1",{"$f":"IF(AND(D110>0,D110<D109),3,IF(AND(D109>0,D110=0),1,0))*D$86","v":0},{"$f":"IF(AND(E110>0,E110<E109),3,IF(AND(E109>0,E110=0),1,0))*E$86","v":0},0,0,0,0,0,0,0,0,0,0,0,0,0,0,0,0,0,0,0,0,0,0,0,0,0,0,0,0,0]
[null,null,"Ein2",{"$f":"IF(AND(D111>0,D111<D110),3,IF(AND(D111=0,D112>0),1,0))*D$86","v":0},0,0,0,0,0,0,0,0,0,0,0,0,0,0,0,0,0,0,0,0,0,0,0,0,0,0,0,0,0,0]
[null,null,"Aus2",{"$f":"IF(AND(D112>0,D112<D111),3,IF(AND(D111>0,D112=0),1,0))*D$86","v":0},{"$f":"IF(AND(E112>0,E112<E111),3,IF(AND(E111>0,E112=0),1,0))*E$86","v":0},0,0,0,0,0,0,0,0,0,0,0,0,0,0,0,0,0,0,0,0,0,0,0,0,0,0,0,0,0]
[null,"Zellenfehler","Ein3",{"$f":"IF(AND(D113>0,D113<D112),3,IF(AND(D113=0,D114>0),1,0))*D$86","v":0},{"$f":"IF(AND(E113>0,E113<E112),3,IF(AND(E113=0,E114>0),1,0))*E$86","v":0},0,0,0,0,0,0,0,0,0,0,0,0,0,0,0,0,0,0,0,0,0,0,0,0,0,0,0,0,0]
[null,null,"Aus3",{"$f":"IF(AND(D114>0,D114<D113),3,IF(AND(D113>0,D114=0),1,0))*D$86","v":0},{"$f":"IF(AND(E114>0,E114<E113),3,IF(AND(E113>0,E114=0),1,0))*E$86","v":0},0,0,0,0,0,0,0,0,0,0,0,0,0,0,0,0,0,0,0,0,0,0,0,0,0,0,0,0,0]
[null,null,"Ein4",{"$f":"IF(AND(D115>0,D115<D114),3,IF(AND(D115=0,D116>0),1,0))*D$86","v":0},{"$f":"IF(AND(E115>0,E115<E114),3,IF(AND(E115=0,E116>0),1,0))*E$86","v":0},0,0,0,0,0,0,0,0,0,0,0,0,0,0,0,0,0,0,0,0,0,0,0,0,0,0,0,0,0]
[null,null,"Aus4",{"$f":"IF(AND(D116>0,D116<D115),3,IF(AND(D115>0,D116=0),1,0))*D$86","v":0},{"$f":"IF(AND(E116>0,E116<E115),3,IF(AND(E115>0,E116=0),1,0))*E$86","v":0},0,0,0,0,0,0,0,0,0,0,0,0,0,0,0,0,0,0,0,0,0,0,0,0,0,0,0,0,0]
[]
[null,null,"Ein1",{"$f":"ROUND(D5*24,2)","v":0},0,0,0,0,0,0,0,0,0,0,0,0,0,0,0,0,0,0,0,0,0,0,0,0,0,0,0,0,0,0]
[null,null,"Aus1",0,0,0,0,0,0,0,0,0,0,0,0,0,0,0,0,0,0,0,0,0,0,0,0,0,0,0,0,0,0,0]
[null,"Zeiten dezimal gewandelt","Ein2",0,0,0,0,0,0,0,0,0,0,0,0,0,0,0,0,0,0,0,0,0,0,0,0,0,0,0,0,0,0,0]
[null,null,"Aus2",0,0,0,0,0,0,0,0,0,0,0,0,0,0,0,0,0,0,0,0,0,0,0,0,0,0,0,0,0,0,0]
[null,null,"Ein3",0,0,0,0,0,0,0,0,0,0,0,0,0,0,0,0,0,0,0,0,0,0,0,0,0,0,0,0,0,0,0]
[null,null,"Aus3",0,0,0,0,0,0,0,0,0,0,0,0,0,0,0,0,0,0,0,0,0,0,0,0,0,0,0,0,0,0,0]
[null,null,"Ein4",0,0,0,0,0,0,0,0,0,0,0,0,0,0,0,0,0,0,0,0,0,0,0,0,0,0,0,0,0,0,0]
[null,null,"Aus4",0,0,0,0,0,0,0,0,0,0,0,0,0,0,0,0,0,0,0,0,0,0,0,0,0,0,0,0,0,0,0]
[]
[null,"Pausenfehler","Gruppe1",{"$f":"IF(OR(D109=\"\",D110=\"\"),0,D110-D109)","v":0},{"$f":"IF(OR(E109=\"\",E110=\"\"),0,E110-E109)","v":0},0,0,0,0,0,0,0,0,0,0,0,0,0,0,0,{"$f":"IF(OR(U109=\"\",U110=\"\"),0,U110-U109)","v":0},{"$f":"IF(OR(V109=\"\",V110=\"\"),0,V110-V109)","v":0},0,0,0,0,0,0,0,0,0,0,0,0]
[null,null,"Gruppe2",{"$f":"IF(OR(D111=\"\",D112=\"\"),0,D112-D111)","v":0},{"$f":"IF(OR(E111=\"\",E112=\"\"),0,E112-E111)","v":0},0,0,0,0,0,0,0,0,0,0,0,0,0,0,0,{"$f":"IF(OR(U111=\"\",U112=\"\"),0,U112-U111)","v":0},{"$f":"IF(OR(V111=\"\",V112=\"\"),0,V112-V111)","v":0},0,0,0,0,0,0,0,0,0,0,0,0]
[null,null,"Gruppe3",{"$f":"IF(OR(D113=\"\",D114=\"\"),0,D114-D113)","v":0},{"$f":"IF(OR(E113=\"\",E114=\"\"),0,E114-E113)","v":0},0,0,0,0,0,0,0,0,0,0,0,0,0,0,0,{"$f":"IF(OR(U113=\"\",U114=\"\"),0,U114-U113)","v":0},{"$f":"IF(OR(V113=\"\",V114=\"\"),0,V114-V113)","v":0},0,0,0,0,0,0,0,0,0,0,0,0]
[null,null,"Gruppe4",{"$f":"IF(OR(D115=\"\",D116=\"\"),0,D116-D115)","v":0},{"$f":"IF(OR(E115=\"\",E116=\"\"),0,E116-E115)","v":0},0,0,0,0,0,0,0,0,0,0,0,0,0,0,0,{"$f":"IF(OR(U115=\"\",U116=\"\"),0,U116-U115)","v":0},{"$f":"IF(OR(V115=\"\",V116=\"\"),0,V116-V115)","v":0},0,0,0,0,0,0,0,0,0,0,0,0]
[]
[null,null,"Pause12",{"$f":"IF(OR(D110=\"\",D111=\"\"),0,D111-D110)","v":0},{"$f":"IF(OR(E110=\"\",E111=\"\"),0,E111-E110)","v":0},0,0,0,0,0,0,0,0,0,0,0,0,0,0,0,{"$f":"IF(OR(U110=\"\",U111=\"\"),0,U111-U110)","v":0},{"$f":"IF(OR(V110=\"\",V111=\"\"),0,V111-V110)","v":0},0,0,0,0,0,0,0,0,0,0,0,0]
[null,null,"Pause23",{"$f":"IF(OR(D112=\"\",D113=\"\"),0,D113-D112)","v":0},{"$f":"IF(OR(E112=\"\",E113=\"\"),0,E113-E112)","v":0},0,0,0,0,0,0,0,0,0,0,0,0,0,0,0,{"$f":"IF(OR(U112=\"\",U113=\"\"),0,U113-U112)","v":0},{"$f":"IF(OR(V112=\"\",V113=\"\"),0,V113-V112)","v":0},0,0,0,0,0,0,0,0,0,0,0,0]
[null,null,"Pause34",{"$f":"IF(OR(D114=\"\",D115=\"\"),0,D115-D114)","v":0},{"$f":"IF(OR(E114=\"\",E115=\"\"),0,E115-E114)","v":0},0,0,0,0,0,0,0,0,0,0,0,0,0,0,0,{"$f":"IF(OR(U114=\"\",U115=\"\"),0,U115-U114)","v":0},{"$f":"IF(OR(V114=\"\",V115=\"\"),0,V115-V114)","v":0},0,0,0,0,0,0,0,0,0,0,0,0]
[]
[null,null,"Kum12",{"$f":"IF(D123>=0.5,0,D118+D119)","v":0},{"$f":"IF(E123>=0.5,0,E118+E119)","v":0},0,0,0,0,0,0,0,0,0,0,0,0,0,0,0,{"$f":"IF(U123>=0.5,0,U118+U119)","v":0},{"$f":"IF(V123>=0.5,0,V118+V119)","v":0},0,0,0,0,0,0,0,0,0,0,0,0]
[null,null,"Kum123",{"$f":"IF(OR(D123>=0.5,D124>=0.5),0,D118+D119+D120)","v":0},{"$f":"IF(OR(E123>=0.5,E124>=0.5),0,E118+E119+E120)","v":0},0,0,0,0,0,0,0,0,0,0,0,0,0,0,0,{"$f":"IF(OR(U123>=0.5,U124>=0.5),0,U118+U119+U120)","v":0},{"$f":"IF(OR(V123>=0.5,V124>=0.5),0,V118+V119+V120)","v":0},0,0,0,0,0,0,0,0,0,0,0,0]
[null,null,"Kum1234",{"$f":"IF(OR(D123>=0.5,D124>=0.5,D125>=0.5),0,D118+D119+D120+D121)","v":0},{"$f":"IF(OR(E123>=0.5,E124>=0.5,E125>=0.5),0,E118+E119+E120+E121)","v":0},0,0,0,0,0,0,0,0,0,0,0,0,0,0,0,{"$f":"IF(OR(U123>=0.5,U124>=0.5,U125>=0.5),0,U118+U119+U120+U121)","v":0},{"$f":"IF(OR(V123>=0.5,V124>=0.5,V125>=0.5),0,V118+V119+V120+V121)","v":0},0,0,0,0,0,0,0,0,0,0,0,0]
[null,null,"Kum23",{"$f":"IF(D124>=0.5,0,D119+D120)","v":0},{"$f":"IF(E124>=0.5,0,E119+E120)","v":0},0,0,0,0,0,0,0,0,0,0,0,0,0,0,0,{"$f":"IF(U124>=0.5,0,U119+U120)","v":0},{"$f":"IF(V124>=0.5,0,V119+V120)","v":0},0,0,0,0,0,0,0,0,0,0,0,0]
[null,null,"Kum234",{"$f":"IF(OR(D124>=0.5,D125>=0.5),0,D119+D120+D121)","v":0},{"$f":"IF(OR(E124>=0.5,E125>=0.5),0,E119+E120+E121)","v":0},0,0,0,0,0,0,0,0,0,0,0,0,0,0,0,{"$f":"IF(OR(U124>=0.5,U125>=0.5),0,U119+U120+U121)","v":0},{"$f":"IF(OR(V124>=0.5,V125>=0.5),0,V119+V120+V121)","v":0},0,0,0,0,0,0,0,0,0,0,0,0]
[null,null,"Kum34",{"$f":"IF(D125>=0.5,0,D120+D121)","v":0},{"$f":"IF(E125>=0.5,0,E120+E121)","v":0},0,0,0,0,0,0,0,0,0,0,0,0,0,0,0,{"$f":"IF(U125>=0.5,0,U120+U121)","v":0},{"$f":"IF(V125>=0.5,0,V120+V121)","v":0},0,0,0,0,0,0,0,0,0,0,0,0]
[]
[null,null,"Pausenfehler-Code",{"$f":"IF(MAX(D118:D121,D127:D132)>6,2,0)","v":0},{"$f":"IF(MAX(E118:E121,E127:E132)>6,2,0)","v":0},0,0,0,0,0,0,0,0,0,0,0,0,0,0,0,0,0,0,0,0,0,0,0,0,0,0,0,0,0]

{"sheet":"Februar","index":7,"n_rows":134,"n_cols":45,"rows_kept":134,"cut":false,"hidden":true,"merged":[[11,34,12,35]]}
[2,{"$f":"DATEVALUE(\"1.\"&A1&\".\"&SL_Jahr)","v":"2024-02-01"},{"$f":"SL_Jahr","v":2024},{"$f":"B_Gde","v":"Gde:"},{"$f":"SL_Gemeinde","v":0},null,null,null,null,null,null,null,null,null,null,null,null,null,null,{"$f":"B_Schule","v":"Schule:"},{"$f":"SL_Schule","v":0},null,null,null,null,null,null,null,null,null,null,null,null,null,null,null,null,null,"Abschluss-Teilbedingungen:"]
[{"$f":"VLOOKUP(A1,Monatsenden,2)","v":45351},{"$f":"B_Bg","v":"BG:"},{"$f":"VLOOKUP(B1,VSA_Kalender,13)","v":1},{"$f":"B_Name","v":"Name:"},{"$f":"SL_Name","v":0},null,null,null,null,null,null,null,null,null,null,null,null,null,null,null,null,null,null,null,null,null,null,null,null,null,null,null,null,null,null,null,null,null,"Regel ok",{"$f":"(AN14>=AN15)","v":false},"Nicht Relevant",{"$f":"D83=0","v":true},-1,{"$f":"IF(AP2=TRUE,AQ2,0)","v":-1},"Nicht Relevant"]
[null,{"$f":"Zerf_Version & \" \" & Zerf_T","v":"Version VSA 1.06 "},null,{"$f":"DATE($C$1,MONTH($B$1),D$4)","v":"2024-02-01"},{"$f":"DATE($C$1,MONTH($B$1),E$4)","v":"2024-02-02"},"2024-02-03","2024-02-04","2024-02-05","2024-02-06","2024-02-07","2024-02-08","2024-02-09","2024-02-10","2024-02-11","2024-02-12","2024-02-13","2024-02-14","2024-02-15","2024-02-16","2024-02-17","2024-02-18","2024-02-19","2024-02-20","2024-02-21","2024-02-22","2024-02-23","2024-02-24","2024-02-25","2024-02-26","2024-02-27","2024-02-28",{"$f":"IF(MONTH(DATE($C$1,MONTH($B$1),AF$41))>MONTH($B$1),\"\",DATE($C$1,MONTH($B$1),AF$4))","v":"2024-02-29"},{"$f":"IF(MONTH(DATE($C$1,MONTH($B$1),AG$41))>MONTH($B$1),\"\",DATE($C$1,MONTH($B$1),AG$4))","v":""},{"$f":"IF(MONTH(DATE($C$1,MONTH($B$1),AH$41))>MONTH($B$1),\"\",DATE($C$1,MONTH($B$1),AH$4))","v":""},null,null,null,null,"Spalten ok",{"$f":"(L83>=D83)","v":true},"Entsperrt",false,1,{"$f":"AP3*AQ3","v":0},"Entsperrt"]
[null,{"$f":"IF(VSATestModus=TRUE(),\"VSA-Modus!\",\"\")","v":""},{"$f":"IF(AN52>0,\"DEFEKT\",\"\")","v":""},{"$f":"IF(MONTH(DATE($C$1,MONTH($B$1),D$41))>MONTH($B$1),\"\",D41)","v":1},2,3,4,5,6,7,8,9,10,11,12,13,14,15,16,17,18,19,20,21,22,23,24,25,26,27,28,{"$f":"IF(MONTH(DATE($C$1,MONTH($B$1),AF$41))>MONTH($B$1),\"\",AF41)","v":29},{"$f":"IF(MONTH(DATE($C$1,MONTH($B$1),AG$41))>MONTH($B$1),\"\",AG41)","v":""},{"$f":"IF(MONTH(DATE($C$1,MONTH($B$1),AH$41))>MONTH($B$1),\"\",AH41)","v":""},null,null,null,null,"Keine Fehler",{"$f":"(SUM(D87:AH87)=0)","v":true},"Geändert",false,2,{"$f":"AP4*AQ4","v":0},"Geändert"]
[null,"     Ein   >>>",null,null,null,null,null,null,null,null,null,null,null,null,null,null,null,null,null,null,null,null,null,null,null,null,null,null,null,null,null,null,null,null,null,null,null,null,"Keine Hand",{"$f":"(AI12=\"\")","v":true},"Sperre",{"$f":"AS11=2","v":false},3,{"$f":"NOT(AP6)*AQ5","v":3},"Eingaben vornehmen"]
[null,"<<<   Aus     ",null,null,null,null,null,null,null,null,null,null,null,null,null,null,null,null,null,null,null,null,null,null,null,null,null,null,null,null,null,null,null,null,null,null,null,null,null,null,"Abschliessbar 1",{"$f":"AND(OR(AN2,AN3),AN4,AN5,NOT(AP7),NOT(AP2))","v":false},4,{"$f":"AND(NOT(OR(AP3,AP4)),AP6)*AQ6","v":0},"Abschliessbar 1"]
[null,"     Ein   >>>",null,null,null,null,null,null,null,null,null,null,null,null,null,null,null,null,null,null,null,null,null,null,null,null,null,null,null,null,null,null,null,null,null,null,null,null,null,null,"Abgeschlossen",false,5,{"$f":"AND(NOT(OR(AP3,AP4)),AP7)*AQ7","v":0},"Abgeschlossen"]
[null,"<<<   Aus     ",null,null,null,null,null,null,null,null,null,null,null,null,null,null,null,null,null,null,null,null,null,null,null,null,null,null,null,null,null,null,null,null,null,null,null,null,null,null,"Für Jahr OK",{"$f":"AND(OR(AP2,AP7),NOT(AP3))","v":true}]
[null,"     Ein   >>>"]
[null,"<<<   Aus     ",null,null,null,null,null,null,null,null,null,null,null,null,null,null,null,null,null,null,null,null,null,null,null,null,null,null,null,null,null,null,null,null,null,null,null,null,null,null,"Statusnummer:",{"$f":"IF(AR2=AQ2,AQ2,MAX(AR2:AR7))","v":-1}]
[null,"     Ein   >>>",null,null,null,null,null,null,null,null,null,null,null,null,null,null,null,null,null,null,null,null,null,null,null,null,null,null,null,null,null,null,null,null,null,null,null,null,"HatDaten:",{"$f":"AND(AP2=FALSE,OR(AP10<>3,COUNTA(D5:AH12,D20:AH35,D39:L40)>0))","v":false},"Statustext:",{"$f":"IFERROR(VLOOKUP(AP10,AR2:AS7,2,FALSE),\"unbekannt\")","v":"Nicht Relevant"},null,null,1]
[null,"<<<   Aus     ",null,null,null,null,null,null,null,null,null,null,null,null,null,null,null,null,null,null,null,null,null,null,null,null,null,null,null,null,null,null,null,null,{"$f":"IF(COUNTIF(D37:AH37,\"I\")>0,\"I\",\"\")","v":""}]
[null,{"$f":"B_PrZeit","v":"Präsenzzeit"},null,{"$f":"24*(D6-D5+D8-D7+D10-D9+D12-D11)*D88","v":0},{"$f":"24*(E6-E5+E8-E7+E10-E9+E12-E11)*E88","v":0},0,0,0,0,0,0,0,0,0,0,0,0,0,0,0,0,0,0,0,0,0,0,0,0,0,0,0,0,0,null,null,null,null,"Anzahl Regeltage:",{"$f":"D83","v":0}]
[null,{"$f":"B_TotalAZist","v":"Total Arbeitszeit (IST)"},null,{"$f":"IF(D13+D35>=D15,D13+D35,MIN(D13+D35+SUM(D20,D22,D23,D24,D25,D26,D27,D28,D29,D30,D31,D32,D33,D34),IF(D15<0,0,D15)))*D82","v":0},0,0,0,0,0,0,0,0,0,0,0,0,0,{"$f":"IF(R13+R35>=R15,R13+R35,MIN(R13+R35+SUM(R20,R22,R23,R24,R25,R26,R27,R28,R29,R30,R31,R32,R33,R34),IF(R15<0,0,R15)))*R82","v":0},{"$f":"IF(S13+S35>=S15,S13+S35,MIN(S13+S35+SUM(S20,S22,S23,S24,S25,S26,S27,S28,S29,S30,S31,S32,S33,S34),IF(S15<0,0,S15)))*S82","v":0},{"$f":"IF(T13+T35>=T15,T13+T35,MIN(T13+T35+SUM(T20,T22,T23,T24,T25,T26,T27,T28,T29,T30,T31,T32,T33,T34),IF(T15<0,0,T15)))*T82","v":0},{"$f":"IF(U13+U35>=U15,U13+U35,MIN(U13+U35+SUM(U20,U22,U23,U24,U25,U26,U27,U28,U29,U30,U31,U32,U33,U34),IF(U15<0,0,U15)))*U82","v":0},0,0,0,0,0,0,0,0,0,0,0,0,0,{"$f":"SUMIF($D$82:$AH$82,1,D14:AH14)","v":0},{"$f":"AI14-AI15","v":8.4},null,null,"Erfasste Regeltage",{"$f":"L83","v":0},{"$f":"AN13-AN14","v":0},"Fehlende Regeltage für Meldungsaufbau"]
[null,{"$f":"B_NettoSollAZ","v":"Netto-SOLL-Arbeitszeit"},null,{"$f":"ROUND(D16-D19,2)","v":0},{"$f":"ROUND(E16-E19,2)","v":0},0,0,0,0,0,0,0,0,0,0,0,0,0,0,0,0,-8.4,0,0,0,0,0,0,0,0,0,{"$f":"IF(AF$42=4,0,ROUND(AF16-AF19,2))","v":0},{"$f":"IF(AG$42=4,0,ROUND(AG16-AG19,2))","v":0},0,{"$f":"SUMIF($D$82:$AH$82,1,D15:AH15)","v":-8.4},null,null,null,"Minimum Regeltage",{"$f":"MinRegeltage","v":1},"Ist als Konstante im Blatt \"Intern\" hinterlegt"]
[null,{"$f":"B_BruttoSollAZ","v":"Brutto-SOLL-Arb.zeit"},null,{"$f":"VLOOKUP(D3,VSA_Kalender,16)","v":0},0,0,0,0,0,0,0,0,0,0,0,0,0,0,0,0,0,0,0,0,0,0,0,0,0,0,0,{"$f":"IF(AF$42=4,0,VLOOKUP(AF3,VSA_Kalender,16))","v":0},{"$f":"IF(AG$42=4,0,VLOOKUP(AG3,VSA_Kalender,16))","v":0},{"$f":"IF(AH$42=4,0,VLOOKUP(AH3,VSA_Kalender,16))","v":0},null,null,null,null,"Regel ok","Mind. eigetr. Regeltage erfüllt"]
[null,{"$f":"B_MehrMinder","v":"Mehr-/Minderleistung"},null,{"$f":"(SL_BisDatum>=D3)*ROUND(D14-D15,2)","v":0},0,0,0,0,0,0,0,0,0,0,0,0,0,0,0,0,0,0,0,0,0,0,0,0,0,0,0,0,0,0,{"$f":"B_Total","v":"Total"},{"$f":"B_Vortrag","v":"Vortrag"},null,null,"Spalten ok:","Alle Einträge an Regeltagen ok"]
[null,{"$f":"B_AZSaldo","v":"AZ - Saldo"},{"$f":"VLOOKUP(ROW(),VSA_Uebertrag,$A$1+3)","v":16.8},{"$f":"IFERROR((C18+D17)*(D3<=SL_BisDatum)*VLOOKUP(D3,VSA_Kalender,21,FALSE),0)","v":16.8},16.8,0,{"$f":"IFERROR((F18+G17)*(G3<=SL_BisDatum)*VLOOKUP(G3,VSA_Kalender,21,FALSE),0)","v":0},0,0,0,0,0,0,0,0,0,0,0,0,0,0,0,0,0,0,0,0,0,0,0,0,0,0,0,null,{"$f":"SUMIF($D$82:$AH$82,1,D17:AH17)+C18","v":16.8}]
[null,{"$f":"B_FTA","v":"Feiertagsanspruch"},0,{"$f":"VLOOKUP(D3,VSA_Kalender,14)","v":0},0,0,0,0,0,0,0,0,0,0,0,0,0,0,0,0,0,8.4,0,0,0,0,0,0,0,0,0,{"$f":"IF(AF$42=4,0,VLOOKUP(AF3,VSA_Kalender,14))","v":0},{"$f":"IF(AG$42=4,0,VLOOKUP(AG3,VSA_Kalender,14))","v":0},{"$f":"IF(AH$42=4,0,VLOOKUP(AH3,VSA_Kalender,14))","v":0},{"$f":"SUM(D19:AH19)","v":8.4}]
[null,{"$f":"B_Ferien","v":"Ferien"},{"$f":"VLOOKUP(ROW(),VSA_Uebertrag,$A$1+3)","v":0},null,null,null,null,null,null,null,null,null,null,null,null,null,null,null,null,null,null,null,null,null,null,null,null,null,null,null,null,null,null,null,{"$f":"SUMIF($D$82:$AH$82,1,D20:AH20)","v":0},{"$f":"ROUND(C20-AI20,2)","v":0},"Rest"]
[null,{"$f":"B_KompAZ","v":"Kompensation Arbeitstage"},0,null,null,null,null,null,null,null,null,null,null,null,null,null,null,null,null,null,null,null,null,null,null,null,null,null,null,null,null,null,null,null,0,{"$f":"ROUND(A21+C21-AI21,0)","v":0}]
[null,{"$f":"B_Arzt","v":"Arztbesuch"},0,null,null,null,null,null,null,null,null,null,null,null,null,null,null,null,null,null,null,null,null,null,null,null,null,null,null,null,null,null,null,null,0,{"$f":"ROUND(A22+C22+AI22,2)","v":0},"Summen"]
[null,{"$f":"B_Krank","v":"Krankheit"},0,null,null,null,null,null,null,null,null,null,null,null,null,null,null,null,null,null,null,null,null,null,null,null,null,null,null,null,null,null,null,null,0,{"$f":"ROUND(A23+C23+AI23,2)","v":0}]
[null,{"$f":"B_BU","v":"Berufsunfall"},0,null,null,null,null,null,null,null,null,null,null,null,null,null,null,null,null,null,null,null,null,null,null,null,null,null,null,null,null,null,null,null,0,0]
[null,{"$f":"B_NBU","v":"Nichtberufsunfall"},0,null,null,null,null,null,null,null,null,null,null,null,null,null,null,null,null,null,null,null,null,null,null,null,null,null,null,null,null,null,null,null,0,0]
[null,{"$f":"B_MilZiv","v":"Militär / Zivilschutz"},0,null,null,null,null,null,null,null,null,null,null,null,null,null,null,null,null,null,null,null,null,null,null,null,null,null,null,null,null,null,null,null,0,0]
[null,{"$f":"B_UUB","v":"Unbezahlter Urlaub"},0,null,null,null,null,null,null,null,null,null,null,null,null,null,null,null,null,null,null,null,null,null,null,null,null,null,null,null,null,null,null,null,0,{"$f":"ROUND(A27+C27-AI27,2)","v":0},"Rest"]
[null,{"$f":"B_UB","v":"Bezahlter Urlaub"},0,null,null,null,null,null,null,null,null,null,null,null,null,null,null,null,null,null,null,null,null,null,null,null,null,null,null,null,null,null,null,null,0,{"$f":"ROUND(A28+C28-AI28,2)","v":0}]
[null,{"$f":"B_NebenB","v":"Nebenbeschäftigung"},0,null,null,null,null,null,null,null,null,null,null,null,null,null,null,null,null,null,null,null,null,null,null,null,null,null,null,null,null,null,null,null,0,0]
[null,{"$f":"B_DAG","v":"D A G"},0,null,null,null,null,null,null,null,null,null,null,null,null,null,null,null,null,null,null,null,null,null,null,null,null,null,null,null,null,null,null,null,0,0]
[null,{"$f":"B_Divers","v":"Diverses"},0,null,null,null,null,null,null,null,null,null,null,null,null,null,null,null,null,null,null,null,null,null,null,null,null,null,null,null,null,null,null,null,0,0,"Summen"]
[null,{"$f":"B_FamPersErg","v":"Fam./pers. Ereignisse"},0,null,null,null,null,null,null,null,null,null,null,null,null,null,null,null,null,null,null,null,null,null,null,null,null,null,null,null,null,null,null,null,0,0]
[null,{"$f":"B_FZ1","v":"freie Zeile 1"},0,null,null,null,null,null,null,null,null,null,null,null,null,null,null,null,null,null,null,null,null,null,null,null,null,null,null,null,null,null,null,null,0,0]
[null,{"$f":"B_FZ2","v":"freie Zeile 2"},0,null,null,null,null,null,null,null,null,null,null,null,null,null,null,null,null,null,null,null,null,null,null,null,null,null,null,null,null,null,null,null,0,0]
[null,{"$f":"B_WB","v":"Weiterbildung"},0,null,null,null,null,null,null,null,null,null,null,null,null,null,null,null,null,null,null,null,null,null,null,null,null,null,null,null,null,null,null,null,0,0]
[null,{"$f":"B_FEL","v":"frei einsetzbare Lekt."},0,null,null,null,null,null,null,null,null,null,null,null,null,null,null,null,null,null,null,null,null,null,null,null,null,null,null,null,null,null,null,null,{"$f":"SUM(D36:AH36)","v":0},{"$f":"ROUND(C36-AI36,0)","v":0}]
[null,null,null,{"$f":"IF(AND((D13 - D15)+SUM(D20,D22:D34)>0.00001,SUM(D20,D22:D34)>0),\"I\",\"\")","v":""},"","","","","","","","","","","","","","","","","","","","","","","","","","","","","",""]
[null,null,"Visum","Identität:",null,null,null,null,"Datum:",null,"Status:"]
[null,null,"SL"]
[null,null,"VG"]
[null,null,null,1,2,3,4,5,6,7,8,9,10,11,12,13,14,15,16,17,18,19,20,21,22,23,24,25,26,27,28,29,30,31]
[null,null,null,{"$f":"IF(D3=\"\",4,VLOOKUP(D3,VSA_Kalender,18))","v":0},0,1,1,0,0,0,0,0,1,1,0,0,0,0,0,1,1,1,0,0,0,0,1,1,0,0,0,0,4,4]
[]
[null,null,null,{"$f":"IF(D19>0,VLOOKUP(D3,KalFeiertage,6,FALSE),\"\")","v":""},"","","","","","","","","","","","","","","","","","Fasnachtsmontag","","","","","","","","","","","",""]
[null,null,null,"FT=WENN(D13+D35>=D15;D13+D35;MIN(D13+D35+SUMME(D20;D22;D23;D24;D25;D26;D27;D28;D29;D30;D31;D32;D33;D34);WENN(D15<0;0;D15)))*D82","FT=WENN(E13+E35>=E15;E13+E35;MIN(E13+E35+SUMME(E20;E22;E23;E24;E25;E26;E27;E28;E29;E30;E31;E32;E33;E34);WENN(E15<0;0;E15)))*E82","FT=WENN(F13+F35>=F15;F13+F35;MIN(F13+F35+SUMME(F20;F22;F23;F24;F25;F26;F27;F28;F29;F30;F31;F32;F33;F34);WENN(F15<0;0;F15)))*F82","FT=WENN(G13+G35>=G15;G13+G35;MIN(G13+G35+SUMME(G20;G22;G23;G24;G25;G26;G27;G28;G29;G30;G31;G32;G33;G34);WENN(G15<0;0;G15)))*G82","FT=WENN(H13+H35>=H15;H13+H35;MIN(H13+H35+SUMME(H20;H22;H23;H24;H25;H26;H27;H28;H29;H30;H31;H32;H33;H34);WENN(H15<0;0;H15)))*H82","FT=WENN(I13+I35>=I15;I13+I35;MIN(I13+I35+SUMME(I20;I22;I23;I24;I25;I26;I27;I28;I29;I30;I31;I32;I33;I34);WENN(I15<0;0;I15)))*I82","FT=WENN(J13+J35>=J15;J13+J35;MIN(J13+J35+SUMME(J20;J22;J23;J24;J25;J26;J27;J28;J29;J30;J31;J32;J33;J34);WENN(J15<0;0;J15)))*J82","FT=WENN(K13+K35>=K15;K13+K35;MIN(K13+K35+SUMME(K20;K22;K23;K24;K25;K26;K27;K28;K29;K30;K31;K32;K33;K34);WENN(K15<0;0;K15)))*K82","FT=WENN(L13+L35>=L15;L13+L35;MIN(L13+L35+SUMME(L20;L22;L23;L24;L25;L26;L27;L28;L29;L30;L31;L32;L33;L34);WENN(L15<0;0;L15)))*L82","FT=WENN(M13+M35>=M15;M13+M35;MIN(M13+M35+SUMME(M20;M22;M23;M24;M25;M26;M27;M28;M29;M30;M31;M32;M33;M34);WENN(M15<0;0;M15)))*M82","FT=WENN(N13+N35>=N15;N13+N35;MIN(N13+N35+SUMME(N20;N22;N23;N24;N25;N26;N27;N28;N29;N30;N31;N32;N33;N34);WENN(N15<0;0;N15)))*N82","FT=WENN(O13+O35>=O15;O13+O35;MIN(O13+O35+SUMME(O20;O22;O23;O24;O25;O26;O27;O28;O29;O30;O31;O32;O33;O34);WENN(O15<0;0;O15)))*O82","FT=WENN(P13+P35>=P15;P13+P35;MIN(P13+P35+SUMME(P20;P22;P23;P24;P25;P26;P27;P28;P29;P30;P31;P32;P33;P34);WENN(P15<0;0;P15)))*P82","FT=WENN(Q13+Q35>=Q15;Q13+Q35;MIN(Q13+Q35+SUMME(Q20;Q22;Q23;Q24;Q25;Q26;Q27;Q28;Q29;Q30;Q31;Q32;Q33;Q34);WENN(Q15<0;0;Q15)))*Q82","FT=WENN(R13+R35>=R15;R13+R35;MIN(R13+R35+SUMME(R20;R22;R23;R24;R25;R26;R27;R28;R29;R30;R31;R32;R33;R34);WENN(R15<0;0;R15)))*R82","FT=WENN(S13+S35>=S15;S13+S35;MIN(S13+S35+SUMME(S20;S22;S23;S24;S25;S26;S27;S28;S29;S30;S31;S32;S33;S34);WENN(S15<0;0;S15)))*S82","FT=WENN(T13+T35>=T15;T13+T35;MIN(T13+T35+SUMME(T20;T22;T23;T24;T25;T26;T27;T28;T29;T30;T31;T32;T33;T34);WENN(T15<0;0;T15)))*T82","FT=WENN(U13+U35>=U15;U13+U35;MIN(U13+U35+SUMME(U20;U22;U23;U24;U25;U26;U27;U28;U29;U30;U31;U32;U33;U34);WENN(U15<0;0;U15)))*U82","FT=WENN(V13+V35>=V15;V13+V35;MIN(V13+V35+SUMME(V20;V22;V23;V24;V25;V26;V27;V28;V29;V30;V31;V32;V33;V34);WENN(V15<0;0;V15)))*V82","FT=WENN(W13+W35>=W15;W13+W35;MIN(W13+W35+SUMME(W20;W22;W23;W24;W25;W26;W27;W28;W29;W30;W31;W32;W33;W34);WENN(W15<0;0;W15)))*W82","FT=WENN(X13+X35>=X15;X13+X35;MIN(X13+X35+SUMME(X20;X22;X23;X24;X25;X26;X27;X28;X29;X30;X31;X32;X33;X34);WENN(X15<0;0;X15)))*X82","FT=WENN(Y13+Y35>=Y15;Y13+Y35;MIN(Y13+Y35+SUMME(Y20;Y22;Y23;Y24;Y25;Y26;Y27;Y28;Y29;Y30;Y31;Y32;Y33;Y34);WENN(Y15<0;0;Y15)))*Y82","FT=WENN(Z13+Z35>=Z15;Z13+Z35;MIN(Z13+Z35+SUMME(Z20;Z22;Z23;Z24;Z25;Z26;Z27;Z28;Z29;Z30;Z31;Z32;Z33;Z34);WENN(Z15<0;0;Z15)))*Z82","FT=WENN(AA13+AA35>=AA15;AA13+AA35;MIN(AA13+AA35+SUMME(AA20;AA22;AA23;AA24;AA25;AA26;AA27;AA28;AA29;AA30;AA31;AA32;AA33;AA34);WENN(AA15<0;0;AA15)))*AA82","FT=WENN(AB13+AB35>=AB15;AB13+AB35;MIN(AB13+AB35+SUMME(AB20;AB22;AB23;AB24;AB25;AB26;AB27;AB28;AB29;AB30;AB31;AB32;AB33;AB34);WENN(AB15<0;0;AB15)))*AB82","FT=WENN(AC13+AC35>=AC15;AC13+AC35;MIN(AC13+AC35+SUMME(AC20;AC22;AC23;AC24;AC25;AC26;AC27;AC28;AC29;AC30;AC31;AC32;AC33;AC34);WENN(AC15<0;0;AC15)))*AC82","FT=WENN(AD13+AD35>=AD15;AD13+AD35;MIN(AD13+AD35+SUMME(AD20;AD22;AD23;AD24;AD25;AD26;AD27;AD28;AD29;AD30;AD31;AD32;AD33;AD34);WENN(AD15<0;0;AD15)))*AD82","FT=WENN(AE13+AE35>=AE15;AE13+AE35;MIN(AE13+AE35+SUMME(AE20;AE22;AE23;AE24;AE25;AE26;AE27;AE28;AE29;AE30;AE31;AE32;AE33;AE34);WENN(AE15<0;0;AE15)))*AE82","FT=WENN(AF13+AF35>=AF15;AF13+AF35;MIN(AF13+AF35+SUMME(AF20;AF22;AF23;AF24;AF25;AF26;AF27;AF28;AF29;AF30;AF31;AF32;AF33;AF34);WENN(AF15<0;0;AF15)))*AF82","FT=WENN(AG13+AG35>=AG15;AG13+AG35;MIN(AG13+AG35+SUMME(AG20;AG22;AG23;AG24;AG25;AG26;AG27;AG28;AG29;AG30;AG31;AG32;AG33;AG34);WENN(AG15<0;0;AG15)))*AG82","FT=WENN(AH13+AH35>=AH15;AH13+AH35;MIN(AH13+AH35+SUMME(AH20;AH22;AH23;AH24;AH25;AH26;AH27;AH28;AH29;AH30;AH31;AH32;AH33;AH34);WENN(AH15<0;0;AH15)))*AH82"]
[null,null,null,"FT=24*(D6-D5+D8-D7+D10-D9+D12-D11)*D88","FT=24*(E6-E5+E8-E7+E10-E9+E12-E11)*E88","FT=24*(F6-F5+F8-F7+F10-F9+F12-F11)*F88","FT=24*(G6-G5+G8-G7+G10-G9+G12-G11)*G88","FT=24*(H6-H5+H8-H7+H10-H9+H12-H11)*H88","FT=24*(I6-I5+I8-I7+I10-I9+I12-I11)*I88","FT=24*(J6-J5+J8-J7+J10-J9+J12-J11)*J88","FT=24*(K6-K5+K8-K7+K10-K9+K12-K11)*K88","FT=24*(L6-L5+L8-L7+L10-L9+L12-L11)*L88","FT=24*(M6-M5+M8-M7+M10-M9+M12-M11)*M88","FT=24*(N6-N5+N8-N7+N10-N9+N12-N11)*N88","FT=24*(O6-O5+O8-O7+O10-O9+O12-O11)*O88","FT=24*(P6-P5+P8-P7+P10-P9+P12-P11)*P88","FT=24*(Q6-Q5+Q8-Q7+Q10-Q9+Q12-Q11)*Q88","FT=24*(R6-R5+R8-R7+R10-R9+R12-R11)*R88","FT=24*(S6-S5+S8-S7+S10-S9+S12-S11)*S88","FT=24*(T6-T5+T8-T7+T10-T9+T12-T11)*T88","FT=24*(U6-U5+U8-U7+U10-U9+U12-U11)*U88","FT=24*(V6-V5+V8-V7+V10-V9+V12-V11)*V88","FT=24*(W6-W5+W8-W7+W10-W9+W12-W11)*W88","FT=24*(X6-X5+X8-X7+X10-X9+X12-X11)*X88","FT=24*(Y6-Y5+Y8-Y7+Y10-Y9+Y12-Y11)*Y88","FT=24*(Z6-Z5+Z8-Z7+Z10-Z9+Z12-Z11)*Z88","FT=24*(AA6-AA5+AA8-AA7+AA10-AA9+AA12-AA11)*AA88","FT=24*(AB6-AB5+AB8-AB7+AB10-AB9+AB12-AB11)*AB88","FT=24*(AC6-AC5+AC8-AC7+AC10-AC9+AC12-AC11)*AC88","FT=24*(AD6-AD5+AD8-AD7+AD10-AD9+AD12-AD11)*AD88","FT=24*(AE6-AE5+AE8-AE7+AE10-AE9+AE12-AE11)*AE88","FT=24*(AF6-AF5+AF8-AF7+AF10-AF9+AF12-AF11)*AF88","FT=24*(AG6-AG5+AG8-AG7+AG10-AG9+AG12-AG11)*AG88","FT=24*(AH6-AH5+AH8-AH7+AH10-AH9+AH12-AH11)*AH88"]
[null,null,null,"FT=ODER(D14>0;D21>0)*1","FT=ODER(E14>0;E21>0)*1","FT=ODER(F14>0;F21>0)*1","FT=ODER(G14>0;G21>0)*1","FT=ODER(H14>0;H21>0)*1","FT=ODER(I14>0;I21>0)*1","FT=ODER(J14>0;J21>0)*1","FT=ODER(K14>0;K21>0)*1","FT=ODER(L14>0;L21>0)*1","FT=ODER(M14>0;M21>0)*1","FT=ODER(N14>0;N21>0)*1","FT=ODER(O14>0;O21>0)*1","FT=ODER(P14>0;P21>0)*1","FT=ODER(Q14>0;Q21>0)*1","FT=ODER(R14>0;R21>0)*1","FT=ODER(S14>0;S21>0)*1","FT=ODER(T14>0;T21>0)*1","FT=ODER(U14>0;U21>0)*1","FT=ODER(V14>0;V21>0)*1","FT=ODER(W14>0;W21>0)*1","FT=ODER(X14>0;X21>0)*1","FT=ODER(Y14>0;Y21>0)*1","FT=ODER(Z14>0;Z21>0)*1","FT=ODER(AA14>0;AA21>0)*1","FT=ODER(AB14>0;AB21>0)*1","FT=ODER(AC14>0;AC21>0)*1","FT=ODER(AD14>0;AD21>0)*1","FT=ODER(AE14>0;AE21>0)*1","FT=ODER(AF14>0;AF21>0)*1","FT=ODER(AG14>0;AG21>0)*1","FT=ODER(AH14>0;AH21>0)*1"]
[null,null,null,{"$f":"ABS(\"FT\"&_xlfn.FORMULATEXT(D14)<>D45)","v":0},{"$f":"ABS(\"FT\"&_xlfn.FORMULATEXT(E14)<>E45)","v":0},0,0,0,0,0,0,0,0,0,0,0,0,0,0,0,0,0,0,0,0,0,0,0,0,0,0,0,0,0]
[null,null,null,{"$f":"ABS(\"FT\"&_xlfn.FORMULATEXT(D13)<>D46)","v":0},{"$f":"ABS(\"FT\"&_xlfn.FORMULATEXT(E13)<>E46)","v":0},0,0,0,0,0,0,0,0,0,0,0,0,0,0,0,0,0,0,0,0,0,0,0,0,0,0,0,0,0]
[null,null,null,{"$f":"ABS(\"FT\"&_xlfn.FORMULATEXT(D80)<>D47)","v":0},{"$f":"ABS(\"FT\"&_xlfn.FORMULATEXT(E80)<>E47)","v":0},0,0,0,0,0,0,0,0,0,0,0,0,0,0,0,0,0,0,0,0,0,0,0,0,0,0,0,0,0]
[null,null,null,{"$f":"ABS(ISERROR(D37))","v":0},{"$f":"ABS(ISERROR(E37))","v":0},0,0,0,0,0,0,0,0,0,0,0,0,0,0,0,0,0,0,0,0,0,0,0,0,0,0,0,0,0]
[null,null,null,{"$f":"SUM(D48:D51)","v":0},{"$f":"SUM(E48:E51)","v":0},0,0,0,0,0,0,0,0,0,0,0,0,0,0,0,0,0,0,0,0,0,0,0,0,0,0,0,0,0,null,null,null,null,"Formel defekt",{"$f":"SUM(D52:AH52)","v":0}]
[]
[]
[]
[]
[]
[]
[]
[]
[]
[]
[]
[]
[]
[]
[]
[]
[]
[]
[]
[]
[]
[]
[]
[]
[null,"HT_Naz-Kopie",{"$f":"HT_NAZ","v":8.4}]
[null,"Heute:",{"$f":"SL_BisDatum","v":"2024-02-02"}]
[null,null,"Reguläre Tage ausgefüllt",{"$f":"((D80*D81)=1)*1","v":0},{"$f":"((E80*E81)=1)*1","v":0},0,0,0,0,0,0,0,0,0,0,0,0,0,0,0,0,0,0,0,0,0,0,0,0,0,0,0,0,0]
[null,null,"Arbeitstage ausgefüllt",{"$f":"OR(D14>0,D21>0)*1","v":0},{"$f":"OR(E14>0,E21>0)*1","v":0},0,0,0,0,0,0,0,0,0,0,0,0,0,0,0,0,0,0,0,0,0,0,0,0,0,0,0,0,0]
[null,null,"Arbeitstage wenn BG>0%",{"$f":"IFERROR(VLOOKUP(D3,VSA_Kalender,22),0)","v":0},0,0,0,0,0,0,0,0,0,0,0,0,0,0,0,0,0,0,0,0,0,0,0,0,0,0,0,0,0,0]
[null,null,"Der BG beträgt mehr als 0%",{"$f":"IF(D4=\"\",0,ABS(VLOOKUP(D3,VSA_Kalender,13,FALSE)>0))","v":1},1,1,1,1,1,1,1,1,1,1,1,1,1,1,1,1,1,1,1,1,1,1,1,1,1,1,1,1,0,0]
[null,null,"(Ja: 1, Nein: 0)",{"$f":"SUM(D81:AH81)","v":0},"Total Tage bei BG>0%",null,null,{"$f":"SUM(D80:AH80)","v":0},"Total Tage ausgefüllt",null,null,{"$f":"SUM(D79:AH79)","v":0},"Total reguläre Tage ausgefüllt"]
[]
[null,null,"Tag des Monats",{"$f":"D4","v":1},2,3,4,5,6,7,8,9,10,11,12,13,14,15,16,17,18,19,20,21,22,23,24,25,26,27,28,29,"",""]
[null,null,"Ist Arbeitsbereich",{"$f":"IFERROR(ABS(WEEKDAY(D3,2)<6),0)","v":1},1,0,0,1,1,1,1,1,0,0,1,1,1,1,1,0,0,1,1,1,1,1,0,0,1,1,1,1,0,0]
[null,null,"Maximaler Fehler",{"$f":"MAX(D100:D107,D98,D134)","v":0},{"$f":"MAX(E100:E107,E98,E134)","v":0},0,0,0,0,0,0,0,0,0,0,0,0,0,0,0,0,0,0,0,0,0,0,0,0,0,0,0,0,0]
[null,null,"Wird die Präsenzzeit angezeigt?",{"$f":"IF(D87=0,1,0)","v":1},{"$f":"IF(E87=0,1,0)","v":1},1,1,1,1,1,1,1,1,1,1,1,1,1,1,1,1,1,1,1,1,1,1,1,1,1,1,1,1,1]
[]
[null,null,"Gruppenfehler 1",{"$f":"IF(AND(D6-D5=0,COUNTA(D7:D12)>0),1,0)","v":0},0,0,0,0,0,0,0,0,0,0,0,0,0,0,0,0,0,0,0,0,0,0,0,0,0,0,0,0,0,0]
[null,"Gruppenfehler","(aus)",{"$f":"D90","v":0},0,0,0,0,0,0,0,0,0,0,0,0,0,0,0,0,0,0,0,0,0,0,0,0,0,0,0,0,0,0]
[null,null,"Gruppenfehler 2",{"$f":"IF(AND(D8-D7=0,COUNTA(D9:D12)>0),1,0)","v":0},0,0,0,0,0,0,0,0,0,0,0,0,0,0,0,0,0,0,0,0,0,0,0,0,0,0,0,0,0,0]
[null,null,"(aus)",{"$f":"D92","v":0},0,0,0,0,0,0,0,0,0,0,0,0,0,0,0,0,0,0,0,0,0,0,0,0,0,0,0,0,0,0]
[null,null,"Gruppenfehler 3",{"$f":"IF(AND(D10-D9=0,COUNTA(D11:D12)>0),1,0)","v":0},0,0,0,0,0,0,0,0,0,0,0,0,0,0,0,0,0,0,0,0,0,0,0,0,0,0,0,0,0,0]
[null,null,"(aus)",{"$f":"D94","v":0},0,0,0,0,0,0,0,0,0,0,0,0,0,0,0,0,0,0,0,0,0,0,0,0,0,0,0,0,0,0]
[null,null,"leer"]
[null,null,"leer"]
[null,null,"Genereller Gruppenfehler",{"$f":"MAX(D90:D95)","v":0},0,0,0,0,0,0,0,0,0,0,0,0,0,0,0,0,0,0,0,0,0,0,0,0,0,0,0,0,0,0]
[]
[null,null,"Ein1",{"$f":"IF(AND(D109=0,D110>0),1,0)","v":0},{"$f":"IF(AND(E109=0,E110>0),1,0)","v":0},0,0,0,0,0,0,0,0,0,0,0,0,0,0,0,0,0,0,0,0,0,0,0,0,0,0,0,0,0]
[null,null,"Aus1",{"$f":"IF(AND(D110>0,D110<D109),3,IF(AND(D109>0,D110=0),1,0))*D$86","v":0},{"$f":"IF(AND(E110>0,E110<E109),3,IF(AND(E109>0,E110=0),1,0))*E$86","v":0},0,0,0,0,0,0,0,0,0,0,0,0,0,0,0,0,0,0,0,0,0,0,0,0,0,0,0,0,0]
[null,null,"Ein2",{"$f":"IF(AND(D111>0,D111<D110),3,IF(AND(D111=0,D112>0),1,0))*D$86","v":0},0,0,0,0,0,0,0,0,0,0,0,0,0,0,0,0,0,0,0,0,0,0,0,0,0,0,0,0,0,0]
[null,null,"Aus2",{"$f":"IF(AND(D112>0,D112<D111),3,IF(AND(D111>0,D112=0),1,0))*D$86","v":0},{"$f":"IF(AND(E112>0,E112<E111),3,IF(AND(E111>0,E112=0),1,0))*E$86","v":0},0,0,0,0,0,0,0,0,0,0,0,0,0,0,0,0,0,0,0,0,0,0,0,0,0,0,0,0,0]
[null,"Zellenfehler","Ein3",{"$f":"IF(AND(D113>0,D113<D112),3,IF(AND(D113=0,D114>0),1,0))*D$86","v":0},{"$f":"IF(AND(E113>0,E113<E112),3,IF(AND(E113=0,E114>0),1,0))*E$86","v":0},0,0,0,0,0,0,0,0,0,0,0,0,0,0,0,0,0,0,0,0,0,0,0,0,0,0,0,0,0]
[null,null,"Aus3",{"$f":"IF(AND(D114>0,D114<D113),3,IF(AND(D113>0,D114=0),1,0))*D$86","v":0},{"$f":"IF(AND(E114>0,E114<E113),3,IF(AND(E113>0,E114=0),1,0))*E$86","v":0},0,0,0,0,0,0,0,0,0,0,0,0,0,0,0,0,0,0,0,0,0,0,0,0,0,0,0,0,0]
[null,null,"Ein4",{"$f":"IF(AND(D115>0,D115<D114),3,IF(AND(D115=0,D116>0),1,0))*D$86","v":0},{"$f":"IF(AND(E115>0,E115<E114),3,IF(AND(E115=0,E116>0),1,0))*E$86","v":0},0,0,0,0,0,0,0,0,0,0,0,0,0,0,0,0,0,0,0,0,0,0,0,0,0,0,0,0,0]
[null,null,"Aus4",{"$f":"IF(AND(D116>0,D116<D115),3,IF(AND(D115>0,D116=0),1,0))*D$86","v":0},{"$f":"IF(AND(E116>0,E116<E115),3,IF(AND(E115>0,E116=0),1,0))*E$86","v":0},0,0,0,0,0,0,0,0,0,0,0,0,0,0,0,0,0,0,0,0,0,0,0,0,0,0,0,0,0]
[]
[null,null,"Ein1",{"$f":"ROUND(D5*24,2)","v":0},0,0,0,0,0,0,0,0,0,0,0,0,0,0,0,0,0,0,0,0,0,0,0,0,0,0,0,0,0,0]
[null,null,"Aus1",0,0,0,0,0,0,0,0,0,0,0,0,0,0,0,0,0,0,0,0,0,0,0,0,0,0,0,0,0,0,0]
[null,"Zeiten dezimal gewandelt","Ein2",0,0,0,0,0,0,0,0,0,0,0,0,0,0,0,0,0,0,0,0,0,0,0,0,0,0,0,0,0,0,0]
[null,null,"Aus2",0,0,0,0,0,0,0,0,0,0,0,0,0,0,0,0,0,0,0,0,0,0,0,0,0,0,0,0,0,0,0]
[null,null,"Ein3",0,0,0,0,0,0,0,0,0,0,0,0,0,0,0,0,0,0,0,0,0,0,0,0,0,0,0,0,0,0,0]
[null,null,"Aus3",0,0,0,0,0,0,0,0,0,0,0,0,0,0,0,0,0,0,0,0,0,0,0,0,0,0,0,0,0,0,0]
[null,null,"Ein4",0,0,0,0,0,0,0,0,0,0,0,0,0,0,0,0,0,0,0,0,0,0,0,0,0,0,0,0,0,0,0]
[null,null,"Aus4",0,0,0,0,0,0,0,0,0,0,0,0,0,0,0,0,0,0,0,0,0,0,0,0,0,0,0,0,0,0,0]
[]
[null,"Pausenfehler","Gruppe1",{"$f":"IF(OR(D109=\"\",D110=\"\"),0,D110-D109)","v":0},{"$f":"IF(OR(E109=\"\",E110=\"\"),0,E110-E109)","v":0},0,0,0,0,0,0,0,0,0,0,0,0,0,0,0,{"$f":"IF(OR(U109=\"\",U110=\"\"),0,U110-U109)","v":0},{"$f":"IF(OR(V109=\"\",V110=\"\"),0,V110-V109)","v":0},0,0,0,0,0,0,0,0,0,0,0,0]
[null,null,"Gruppe2",{"$f":"IF(OR(D111=\"\",D112=\"\"),0,D112-D111)","v":0},{"$f":"IF(OR(E111=\"\",E112=\"\"),0,E112-E111)","v":0},0,0,0,0,0,0,0,0,0,0,0,0,0,0,0,{"$f":"IF(OR(U111=\"\",U112=\"\"),0,U112-U111)","v":0},{"$f":"IF(OR(V111=\"\",V112=\"\"),0,V112-V111)","v":0},0,0,0,0,0,0,0,0,0,0,0,0]
[null,null,"Gruppe3",{"$f":"IF(OR(D113=\"\",D114=\"\"),0,D114-D113)","v":0},{"$f":"IF(OR(E113=\"\",E114=\"\"),0,E114-E113)","v":0},0,0,0,0,0,0,0,0,0,0,0,0,0,0,0,{"$f":"IF(OR(U113=\"\",U114=\"\"),0,U114-U113)","v":0},{"$f":"IF(OR(V113=\"\",V114=\"\"),0,V114-V113)","v":0},0,0,0,0,0,0,0,0,0,0,0,0]
[null,null,"Gruppe4",{"$f":"IF(OR(D115=\"\",D116=\"\"),0,D116-D115)","v":0},{"$f":"IF(OR(E115=\"\",E116=\"\"),0,E116-E115)","v":0},0,0,0,0,0,0,0,0,0,0,0,0,0,0,0,{"$f":"IF(OR(U115=\"\",U116=\"\"),0,U116-U115)","v":0},{"$f":"IF(OR(V115=\"\",V116=\"\"),0,V116-V115)","v":0},0,0,0,0,0,0,0,0,0,0,0,0]
[]
[null,null,"Pause12",{"$f":"IF(OR(D110=\"\",D111=\"\"),0,D111-D110)","v":0},{"$f":"IF(OR(E110=\"\",E111=\"\"),0,E111-E110)","v":0},0,0,0,0,0,0,0,0,0,0,0,0,0,0,0,{"$f":"IF(OR(U110=\"\",U111=\"\"),0,U111-U110)","v":0},{"$f":"IF(OR(V110=\"\",V111=\"\"),0,V111-V110)","v":0},0,0,0,0,0,0,0,0,0,0,0,0]
[null,null,"Pause23",{"$f":"IF(OR(D112=\"\",D113=\"\"),0,D113-D112)","v":0},{"$f":"IF(OR(E112=\"\",E113=\"\"),0,E113-E112)","v":0},0,0,0,0,0,0,0,0,0,0,0,0,0,0,0,{"$f":"IF(OR(U112=\"\",U113=\"\"),0,U113-U112)","v":0},{"$f":"IF(OR(V112=\"\",V113=\"\"),0,V113-V112)","v":0},0,0,0,0,0,0,0,0,0,0,0,0]
[null,null,"Pause34",{"$f":"IF(OR(D114=\"\",D115=\"\"),0,D115-D114)","v":0},{"$f":"IF(OR(E114=\"\",E115=\"\"),0,E115-E114)","v":0},0,0,0,0,0,0,0,0,0,0,0,0,0,0,0,{"$f":"IF(OR(U114=\"\",U115=\"\"),0,U115-U114)","v":0},{"$f":"IF(OR(V114=\"\",V115=\"\"),0,V115-V114)","v":0},0,0,0,0,0,0,0,0,0,0,0,0]
[]
[null,null,"Kum12",{"$f":"IF(D123>=0.5,0,D118+D119)","v":0},{"$f":"IF(E123>=0.5,0,E118+E119)","v":0},0,0,0,0,0,0,0,0,0,0,0,0,0,0,0,{"$f":"IF(U123>=0.5,0,U118+U119)","v":0},{"$f":"IF(V123>=0.5,0,V118+V119)","v":0},0,0,0,0,0,0,0,0,0,0,0,0]
[null,null,"Kum123",{"$f":"IF(OR(D123>=0.5,D124>=0.5),0,D118+D119+D120)","v":0},{"$f":"IF(OR(E123>=0.5,E124>=0.5),0,E118+E119+E120)","v":0},0,0,0,0,0,0,0,0,0,0,0,0,0,0,0,{"$f":"IF(OR(U123>=0.5,U124>=0.5),0,U118+U119+U120)","v":0},{"$f":"IF(OR(V123>=0.5,V124>=0.5),0,V118+V119+V120)","v":0},0,0,0,0,0,0,0,0,0,0,0,0]
[null,null,"Kum1234",{"$f":"IF(OR(D123>=0.5,D124>=0.5,D125>=0.5),0,D118+D119+D120+D121)","v":0},{"$f":"IF(OR(E123>=0.5,E124>=0.5,E125>=0.5),0,E118+E119+E120+E121)","v":0},0,0,0,0,0,0,0,0,0,0,0,0,0,0,0,{"$f":"IF(OR(U123>=0.5,U124>=0.5,U125>=0.5),0,U118+U119+U120+U121)","v":0},{"$f":"IF(OR(V123>=0.5,V124>=0.5,V125>=0.5),0,V118+V119+V120+V121)","v":0},0,0,0,0,0,0,0,0,0,0,0,0]
[null,null,"Kum23",{"$f":"IF(D124>=0.5,0,D119+D120)","v":0},{"$f":"IF(E124>=0.5,0,E119+E120)","v":0},0,0,0,0,0,0,0,0,0,0,0,0,0,0,0,{"$f":"IF(U124>=0.5,0,U119+U120)","v":0},{"$f":"IF(V124>=0.5,0,V119+V120)","v":0},0,0,0,0,0,0,0,0,0,0,0,0]
[null,null,"Kum234",{"$f":"IF(OR(D124>=0.5,D125>=0.5),0,D119+D120+D121)","v":0},{"$f":"IF(OR(E124>=0.5,E125>=0.5),0,E119+E120+E121)","v":0},0,0,0,0,0,0,0,0,0,0,0,0,0,0,0,{"$f":"IF(OR(U124>=0.5,U125>=0.5),0,U119+U120+U121)","v":0},{"$f":"IF(OR(V124>=0.5,V125>=0.5),0,V119+V120+V121)","v":0},0,0,0,0,0,0,0,0,0,0,0,0]
[null,null,"Kum34",{"$f":"IF(D125>=0.5,0,D120+D121)","v":0},{"$f":"IF(E125>=0.5,0,E120+E121)","v":0},0,0,0,0,0,0,0,0,0,0,0,0,0,0,0,{"$f":"IF(U125>=0.5,0,U120+U121)","v":0},{"$f":"IF(V125>=0.5,0,V120+V121)","v":0},0,0,0,0,0,0,0,0,0,0,0,0]
[]
[null,null,"Pausenfehler-Code",{"$f":"IF(MAX(D118:D121,D127:D132)>6,2,0)","v":0},{"$f":"IF(MAX(E118:E121,E127:E132)>6,2,0)","v":0},0,0,0,0,0,0,0,0,0,0,0,0,0,0,0,0,0,0,0,0,0,0,0,0,0,0,0,0,0]

{"sheet":"März","index":8,"n_rows":134,"n_cols":45,"rows_kept":134,"cut":false,"hidden":true,"merged":[[11,34,12,35]]}
[3,{"$f":"DATEVALUE(\"1.\"&A1&\".\"&SL_Jahr)","v":"2024-03-01"},{"$f":"SL_Jahr","v":2024},{"$f":"B_Gde","v":"Gde:"},{"$f":"SL_Gemeinde","v":0},null,null,null,null,null,null,null,null,null,null,null,null,null,null,{"$f":"B_Schule","v":"Schule:"},{"$f":"SL_Schule","v":0},null,null,null,null,null,null,null,null,null,null,null,null,null,null,null,null,null,"Abschluss-Teilbedingungen:"]
[{"$f":"VLOOKUP(A1,Monatsenden,2)","v":45382},{"$f":"B_Bg","v":"BG:"},{"$f":"VLOOKUP(B1,VSA_Kalender,13)","v":1},{"$f":"B_Name","v":"Name:"},{"$f":"SL_Name","v":0},null,null,null,null,null,null,null,null,null,null,null,null,null,null,null,null,null,null,null,null,null,null,null,null,null,null,null,null,null,null,null,null,null,"Regel ok",{"$f":"(AN14>=AN15)","v":false},"Nicht Relevant",{"$f":"D83=0","v":true},-1,{"$f":"IF(AP2=TRUE,AQ2,0)","v":-1},"Nicht Relevant"]
[null,{"$f":"Zerf_Version & \" \" & Zerf_T","v":"Version VSA 1.06 "},null,{"$f":"DATE($C$1,MONTH($B$1),D$4)","v":"2024-03-01"},{"$f":"DATE($C$1,MONTH($B$1),E$4)","v":"2024-03-02"},"2024-03-03","2024-03-04","2024-03-05","2024-03-06","2024-03-07","2024-03-08","2024-03-09","2024-03-10","2024-03-11","2024-03-12","2024-03-13","2024-03-14","2024-03-15","2024-03-16","2024-03-17","2024-03-18","2024-03-19","2024-03-20","2024-03-21","2024-03-22","2024-03-23","2024-03-24","2024-03-25","2024-03-26","2024-03-27","2024-03-28",{"$f":"IF(MONTH(DATE($C$1,MONTH($B$1),AF$41))>MONTH($B$1),\"\",DATE($C$1,MONTH($B$1),AF$4))","v":"2024-03-29"},{"$f":"IF(MONTH(DATE($C$1,MONTH($B$1),AG$41))>MONTH($B$1),\"\",DATE($C$1,MONTH($B$1),AG$4))","v":"2024-03-30"},{"$f":"IF(MONTH(DATE($C$1,MONTH($B$1),AH$41))>MONTH($B$1),\"\",DATE($C$1,MONTH($B$1),AH$4))","v":"2024-03-31"},null,null,null,null,"Spalten ok",{"$f":"(L83>=D83)","v":true},"Entsperrt",false,1,{"$f":"AP3*AQ3","v":0},"Entsperrt"]
[null,{"$f":"IF(VSATestModus=TRUE(),\"VSA-Modus!\",\"\")","v":""},{"$f":"IF(AN52>0,\"DEFEKT\",\"\")","v":""},{"$f":"IF(MONTH(DATE($C$1,MONTH($B$1),D$41))>MONTH($B$1),\"\",D41)","v":1},2,3,4,5,6,7,8,9,10,11,12,13,14,15,16,17,18,19,20,21,22,23,24,25,26,27,28,{"$f":"IF(MONTH(DATE($C$1,MONTH($B$1),AF$41))>MONTH($B$1),\"\",AF41)","v":29},{"$f":"IF(MONTH(DATE($C$1,MONTH($B$1),AG$41))>MONTH($B$1),\"\",AG41)","v":30},{"$f":"IF(MONTH(DATE($C$1,MONTH($B$1),AH$41))>MONTH($B$1),\"\",AH41)","v":31},null,null,null,null,"Keine Fehler",{"$f":"(SUM(D87:AH87)=0)","v":true},"Geändert",false,2,{"$f":"AP4*AQ4","v":0},"Geändert"]
[null,"     Ein   >>>",null,null,null,null,null,null,null,null,null,null,null,null,null,null,null,null,null,null,null,null,null,null,null,null,null,null,null,null,null,null,null,null,null,null,null,null,"Keine Hand",{"$f":"(AI12=\"\")","v":true},"Sperre",{"$f":"AS11=2","v":false},3,{"$f":"NOT(AP6)*AQ5","v":3},"Eingaben vornehmen"]
[null,"<<<   Aus     ",null,null,null,null,null,null,null,null,null,null,null,null,null,null,null,null,null,null,null,null,null,null,null,null,null,null,null,null,null,null,null,null,null,null,null,null,null,null,"Abschliessbar 1",{"$f":"AND(OR(AN2,AN3),AN4,AN5,NOT(AP7),NOT(AP2))","v":false},4,{"$f":"AND(NOT(OR(AP3,AP4)),AP6)*AQ6","v":0},"Abschliessbar 1"]
[null,"     Ein   >>>",null,null,null,null,null,null,null,null,null,null,null,null,null,null,null,null,null,null,null,null,null,null,null,null,null,null,null,null,null,null,null,null,null,null,null,null,null,null,"Abgeschlossen",false,5,{"$f":"AND(NOT(OR(AP3,AP4)),AP7)*AQ7","v":0},"Abgeschlossen"]
[null,"<<<   Aus     ",null,null,null,null,null,null,null,null,null,null,null,null,null,null,null,null,null,null,null,null,null,null,null,null,null,null,null,null,null,null,null,null,null,null,null,null,null,null,"Für Jahr OK",{"$f":"AND(OR(AP2,AP7),NOT(AP3))","v":true}]
[null,"     Ein   >>>"]
[null,"<<<   Aus     ",null,null,null,null,null,null,null,null,null,null,null,null,null,null,null,null,null,null,null,null,null,null,null,null,null,null,null,null,null,null,null,null,null,null,null,null,null,null,"Statusnummer:",{"$f":"IF(AR2=AQ2,AQ2,MAX(AR2:AR7))","v":-1}]
[null,"     Ein   >>>",null,null,null,null,null,null,null,null,null,null,null,null,null,null,null,null,null,null,null,null,null,null,null,null,null,null,null,null,null,null,null,null,null,null,null,null,"HatDaten:",{"$f":"AND(AP2=FALSE,OR(AP10<>3,COUNTA(D5:AH12,D20:AH35,D39:L40)>0))","v":false},"Statustext:",{"$f":"IFERROR(VLOOKUP(AP10,AR2:AS7,2,FALSE),\"unbekannt\")","v":"Nicht Relevant"},null,null,1]
[null,"<<<   Aus     ",null,null,null,null,null,null,null,null,null,null,null,null,null,null,null,null,null,null,null,null,null,null,null,null,null,null,null,null,null,null,null,null,{"$f":"IF(COUNTIF(D37:AH37,\"I\")>0,\"I\",\"\")","v":""}]
[null,{"$f":"B_PrZeit","v":"Präsenzzeit"},null,{"$f":"24*(D6-D5+D8-D7+D10-D9+D12-D11)*D88","v":0},{"$f":"24*(E6-E5+E8-E7+E10-E9+E12-E11)*E88","v":0},0,0,0,0,0,0,0,0,0,0,0,0,0,0,0,0,0,0,0,0,0,0,0,0,0,0,0,0,0,null,null,null,null,"Anzahl Regeltage:",{"$f":"D83","v":0}]
[null,{"$f":"B_TotalAZist","v":"Total Arbeitszeit (IST)"},null,{"$f":"IF(D13+D35>=D15,D13+D35,MIN(D13+D35+SUM(D20,D22,D23,D24,D25,D26,D27,D28,D29,D30,D31,D32,D33,D34),IF(D15<0,0,D15)))*D82","v":0},0,0,0,0,0,0,0,0,0,0,0,0,0,{"$f":"IF(R13+R35>=R15,R13+R35,MIN(R13+R35+SUM(R20,R22,R23,R24,R25,R26,R27,R28,R29,R30,R31,R32,R33,R34),IF(R15<0,0,R15)))*R82","v":0},{"$f":"IF(S13+S35>=S15,S13+S35,MIN(S13+S35+SUM(S20,S22,S23,S24,S25,S26,S27,S28,S29,S30,S31,S32,S33,S34),IF(S15<0,0,S15)))*S82","v":0},{"$f":"IF(T13+T35>=T15,T13+T35,MIN(T13+T35+SUM(T20,T22,T23,T24,T25,T26,T27,T28,T29,T30,T31,T32,T33,T34),IF(T15<0,0,T15)))*T82","v":0},{"$f":"IF(U13+U35>=U15,U13+U35,MIN(U13+U35+SUM(U20,U22,U23,U24,U25,U26,U27,U28,U29,U30,U31,U32,U33,U34),IF(U15<0,0,U15)))*U82","v":0},0,0,0,0,0,0,0,0,0,0,0,0,0,{"$f":"SUMIF($D$82:$AH$82,1,D14:AH14)","v":0},{"$f":"AI14-AI15","v":10.8},null,null,"Erfasste Regeltage",{"$f":"L83","v":0},{"$f":"AN13-AN14","v":0},"Fehlende Regeltage"]
[null,{"$f":"B_NettoSollAZ","v":"Netto-SOLL-Arbeitszeit"},null,{"$f":"ROUND(D16-D19,2)","v":0},{"$f":"ROUND(E16-E19,2)","v":0},0,0,0,0,0,0,0,0,0,0,0,0,0,0,0,0,0,0,0,0,0,0,0,0,0,-2.4,{"$f":"IF(AF$42=4,0,ROUND(AF16-AF19,2))","v":-8.4},{"$f":"IF(AG$42=4,0,ROUND(AG16-AG19,2))","v":0},0,{"$f":"SUMIF($D$82:$AH$82,1,D15:AH15)","v":-10.8},null,null,null,"Minimum Regeltage",{"$f":"MinRegeltage","v":1},"Ist als Konstante im Blatt \"Intern\" hinterlegt"]
[null,{"$f":"B_BruttoSollAZ","v":"Brutto-SOLL-Arb.zeit"},null,{"$f":"VLOOKUP(D3,VSA_Kalender,16)","v":0},0,0,0,0,0,0,0,0,0,0,0,0,0,0,0,0,0,0,0,0,0,0,0,0,0,0,0,{"$f":"IF(AF$42=4,0,VLOOKUP(AF3,VSA_Kalender,16))","v":0},{"$f":"IF(AG$42=4,0,VLOOKUP(AG3,VSA_Kalender,16))","v":0},{"$f":"IF(AH$42=4,0,VLOOKUP(AH3,VSA_Kalender,16))","v":0},null,null,null,null,"Regel ok","Mind. eigetr. Regeltage erfüllt"]
[null,{"$f":"B_MehrMinder","v":"Mehr-/Minderleistung"},null,{"$f":"(SL_BisDatum>=D3)*ROUND(D14-D15,2)","v":0},0,0,0,0,0,0,0,0,0,0,0,0,0,0,0,0,0,0,0,0,0,0,0,0,0,0,0,0,0,0,{"$f":"B_Total","v":"Total"},{"$f":"B_Vortrag","v":"Vortrag"},null,null,"Spalten ok:","Alle Einträge an Regeltagen ok"]
[null,{"$f":"B_AZSaldo","v":"AZ - Saldo"},{"$f":"VLOOKUP(ROW(),VSA_Uebertrag,$A$1+3)","v":16.8},{"$f":"IFERROR((C18+D17)*(D3<=SL_BisDatum)*VLOOKUP(D3,VSA_Kalender,21,FALSE),0)","v":0},0,0,{"$f":"IFERROR((F18+G17)*(G3<=SL_BisDatum)*VLOOKUP(G3,VSA_Kalender,21,FALSE),0)","v":0},0,0,0,0,0,0,0,0,0,0,0,0,0,0,0,0,0,0,0,0,0,0,0,0,0,0,0,null,{"$f":"SUMIF($D$82:$AH$82,1,D17:AH17)+C18","v":16.8}]
[null,{"$f":"B_FTA","v":"Feiertagsanspruch"},0,{"$f":"VLOOKUP(D3,VSA_Kalender,14)","v":0},0,0,0,0,0,0,0,0,0,0,0,0,0,0,0,0,0,0,0,0,0,0,0,0,0,0,2.4,{"$f":"IF(AF$42=4,0,VLOOKUP(AF3,VSA_Kalender,14))","v":8.4},{"$f":"IF(AG$42=4,0,VLOOKUP(AG3,VSA_Kalender,14))","v":0},{"$f":"IF(AH$42=4,0,VLOOKUP(AH3,VSA_Kalender,14))","v":0},{"$f":"SUM(D19:AH19)","v":10.8}]
[null,{"$f":"B_Ferien","v":"Ferien"},{"$f":"VLOOKUP(ROW(),VSA_Uebertrag,$A$1+3)","v":0},null,null,null,null,null,null,null,null,null,null,null,null,null,null,null,null,null,null,null,null,null,null,null,null,null,null,null,null,null,null,null,{"$f":"SUMIF($D$82:$AH$82,1,D20:AH20)","v":0},{"$f":"ROUND(C20-AI20,2)","v":0},"Rest"]
[null,{"$f":"B_KompAZ","v":"Kompensation Arbeitstage"},0,null,null,null,null,null,null,null,null,null,null,null,null,null,null,null,null,null,null,null,null,null,null,null,null,null,null,null,null,null,null,null,0,{"$f":"ROUND(A21+C21-AI21,0)","v":0}]
[null,{"$f":"B_Arzt","v":"Arztbesuch"},0,null,null,null,null,null,null,null,null,null,null,null,null,null,null,null,null,null,null,null,null,null,null,null,null,null,null,null,null,null,null,null,0,{"$f":"ROUND(A22+C22+AI22,2)","v":0},"Summen"]
[null,{"$f":"B_Krank","v":"Krankheit"},0,null,null,null,null,null,null,null,null,null,null,null,null,null,null,null,null,null,null,null,null,null,null,null,null,null,null,null,null,null,null,null,0,{"$f":"ROUND(A23+C23+AI23,2)","v":0}]
[null,{"$f":"B_BU","v":"Berufsunfall"},0,null,null,null,null,null,null,null,null,null,null,null,null,null,null,null,null,null,null,null,null,null,null,null,null,null,null,null,null,null,null,null,0,0]
[null,{"$f":"B_NBU","v":"Nichtberufsunfall"},0,null,null,null,null,null,null,null,null,null,null,null,null,null,null,null,null,null,null,null,null,null,null,null,null,null,null,null,null,null,null,null,0,0]
[null,{"$f":"B_MilZiv","v":"Militär / Zivilschutz"},0,null,null,null,null,null,null,null,null,null,null,null,null,null,null,null,null,null,null,null,null,null,null,null,null,null,null,null,null,null,null,null,0,0]
[null,{"$f":"B_UUB","v":"Unbezahlter Urlaub"},0,null,null,null,null,null,null,null,null,null,null,null,null,null,null,null,null,null,null,null,null,null,null,null,null,null,null,null,null,null,null,null,0,{"$f":"ROUND(A27+C27-AI27,2)","v":0},"Rest"]
[null,{"$f":"B_UB","v":"Bezahlter Urlaub"},0,null,null,null,null,null,null,null,null,null,null,null,null,null,null,null,null,null,null,null,null,null,null,null,null,null,null,null,null,null,null,null,0,{"$f":"ROUND(A28+C28-AI28,2)","v":0}]
[null,{"$f":"B_NebenB","v":"Nebenbeschäftigung"},0,null,null,null,null,null,null,null,null,null,null,null,null,null,null,null,null,null,null,null,null,null,null,null,null,null,null,null,null,null,null,null,0,0]
[null,{"$f":"B_DAG","v":"D A G"},0,null,null,null,null,null,null,null,null,null,null,null,null,null,null,null,null,null,null,null,null,null,null,null,null,null,null,null,null,null,null,null,0,0]
[null,{"$f":"B_Divers","v":"Diverses"},0,null,null,null,null,null,null,null,null,null,null,null,null,null,null,null,null,null,null,null,null,null,null,null,null,null,null,null,null,null,null,null,0,0,"Summen"]
[null,{"$f":"B_FamPersErg","v":"Fam./pers. Ereignisse"},0,null,null,null,null,null,null,null,null,null,null,null,null,null,null,null,null,null,null,null,null,null,null,null,null,null,null,null,null,null,null,null,0,0]
[null,{"$f":"B_FZ1","v":"freie Zeile 1"},0,null,null,null,null,null,null,null,null,null,null,null,null,null,null,null,null,null,null,null,null,null,null,null,null,null,null,null,null,null,null,null,0,0]
[null,{"$f":"B_FZ2","v":"freie Zeile 2"},0,null,null,null,null,null,null,null,null,null,null,null,null,null,null,null,null,null,null,null,null,null,null,null,null,null,null,null,null,null,null,null,0,0]
[null,{"$f":"B_WB","v":"Weiterbildung"},0,null,null,null,null,null,null,null,null,null,null,null,null,null,null,null,null,null,null,null,null,null,null,null,null,null,null,null,null,null,null,null,0,0]
[null,{"$f":"B_FEL","v":"frei einsetzbare Lekt."},0,null,null,null,null,null,null,null,null,null,null,null,null,null,null,null,null,null,null,null,null,null,null,null,null,null,null,null,null,null,null,null,{"$f":"SUM(D36:AH36)","v":0},{"$f":"ROUND(C36-AI36,0)","v":0}]
[null,null,null,{"$f":"IF(AND((D13 - D15)+SUM(D20,D22:D34)>0.00001,SUM(D20,D22:D34)>0),\"I\",\"\")","v":""},"","","","","","","","","","","","","","","","","","","","","","","","","","","","","",""]
[null,null,"Visum","Identität:",null,null,null,null,"Datum:",null,"Status:"]
[null,null,"SL"]
[null,null,"VG"]
[null,null,null,1,2,3,4,5,6,7,8,9,10,11,12,13,14,15,16,17,18,19,20,21,22,23,24,25,26,27,28,29,30,31]
[null,null,null,{"$f":"IF(D3=\"\",4,VLOOKUP(D3,VSA_Kalender,18))","v":0},1,1,0,0,0,0,0,1,1,0,0,0,0,0,1,1,0,0,0,0,0,1,1,0,0,0,0,1,1,1]
[]
[null,null,null,{"$f":"IF(D19>0,VLOOKUP(D3,KalFeiertage,6,FALSE),\"\")","v":""},"","","","","","","","","","","","","","","","","","","","","","","","","","","Gründonnerstag","Karfreitag","",""]
[null,null,null,"FT=WENN(D13+D35>=D15;D13+D35;MIN(D13+D35+SUMME(D20;D22;D23;D24;D25;D26;D27;D28;D29;D30;D31;D32;D33;D34);WENN(D15<0;0;D15)))*D82","FT=WENN(E13+E35>=E15;E13+E35;MIN(E13+E35+SUMME(E20;E22;E23;E24;E25;E26;E27;E28;E29;E30;E31;E32;E33;E34);WENN(E15<0;0;E15)))*E82","FT=WENN(F13+F35>=F15;F13+F35;MIN(F13+F35+SUMME(F20;F22;F23;F24;F25;F26;F27;F28;F29;F30;F31;F32;F33;F34);WENN(F15<0;0;F15)))*F82","FT=WENN(G13+G35>=G15;G13+G35;MIN(G13+G35+SUMME(G20;G22;G23;G24;G25;G26;G27;G28;G29;G30;G31;G32;G33;G34);WENN(G15<0;0;G15)))*G82","FT=WENN(H13+H35>=H15;H13+H35;MIN(H13+H35+SUMME(H20;H22;H23;H24;H25;H26;H27;H28;H29;H30;H31;H32;H33;H34);WENN(H15<0;0;H15)))*H82","FT=WENN(I13+I35>=I15;I13+I35;MIN(I13+I35+SUMME(I20;I22;I23;I24;I25;I26;I27;I28;I29;I30;I31;I32;I33;I34);WENN(I15<0;0;I15)))*I82","FT=WENN(J13+J35>=J15;J13+J35;MIN(J13+J35+SUMME(J20;J22;J23;J24;J25;J26;J27;J28;J29;J30;J31;J32;J33;J34);WENN(J15<0;0;J15)))*J82","FT=WENN(K13+K35>=K15;K13+K35;MIN(K13+K35+SUMME(K20;K22;K23;K24;K25;K26;K27;K28;K29;K30;K31;K32;K33;K34);WENN(K15<0;0;K15)))*K82","FT=WENN(L13+L35>=L15;L13+L35;MIN(L13+L35+SUMME(L20;L22;L23;L24;L25;L26;L27;L28;L29;L30;L31;L32;L33;L34);WENN(L15<0;0;L15)))*L82","FT=WENN(M13+M35>=M15;M13+M35;MIN(M13+M35+SUMME(M20;M22;M23;M24;M25;M26;M27;M28;M29;M30;M31;M32;M33;M34);WENN(M15<0;0;M15)))*M82","FT=WENN(N13+N35>=N15;N13+N35;MIN(N13+N35+SUMME(N20;N22;N23;N24;N25;N26;N27;N28;N29;N30;N31;N32;N33;N34);WENN(N15<0;0;N15)))*N82","FT=WENN(O13+O35>=O15;O13+O35;MIN(O13+O35+SUMME(O20;O22;O23;O24;O25;O26;O27;O28;O29;O30;O31;O32;O33;O34);WENN(O15<0;0;O15)))*O82","FT=WENN(P13+P35>=P15;P13+P35;MIN(P13+P35+SUMME(P20;P22;P23;P24;P25;P26;P27;P28;P29;P30;P31;P32;P33;P34);WENN(P15<0;0;P15)))*P82","FT=WENN(Q13+Q35>=Q15;Q13+Q35;MIN(Q13+Q35+SUMME(Q20;Q22;Q23;Q24;Q25;Q26;Q27;Q28;Q29;Q30;Q31;Q32;Q33;Q34);WENN(Q15<0;0;Q15)))*Q82","FT=WENN(R13+R35>=R15;R13+R35;MIN(R13+R35+SUMME(R20;R22;R23;R24;R25;R26;R27;R28;R29;R30;R31;R32;R33;R34);WENN(R15<0;0;R15)))*R82","FT=WENN(S13+S35>=S15;S13+S35;MIN(S13+S35+SUMME(S20;S22;S23;S24;S25;S26;S27;S28;S29;S30;S31;S32;S33;S34);WENN(S15<0;0;S15)))*S82","FT=WENN(T13+T35>=T15;T13+T35;MIN(T13+T35+SUMME(T20;T22;T23;T24;T25;T26;T27;T28;T29;T30;T31;T32;T33;T34);WENN(T15<0;0;T15)))*T82","FT=WENN(U13+U35>=U15;U13+U35;MIN(U13+U35+SUMME(U20;U22;U23;U24;U25;U26;U27;U28;U29;U30;U31;U32;U33;U34);WENN(U15<0;0;U15)))*U82","FT=WENN(V13+V35>=V15;V13+V35;MIN(V13+V35+SUMME(V20;V22;V23;V24;V25;V26;V27;V28;V29;V30;V31;V32;V33;V34);WENN(V15<0;0;V15)))*V82","FT=WENN(W13+W35>=W15;W13+W35;MIN(W13+W35+SUMME(W20;W22;W23;W24;W25;W26;W27;W28;W29;W30;W31;W32;W33;W34);WENN(W15<0;0;W15)))*W82","FT=WENN(X13+X35>=X15;X13+X35;MIN(X13+X35+SUMME(X20;X22;X23;X24;X25;X26;X27;X28;X29;X30;X31;X32;X33;X34);WENN(X15<0;0;X15)))*X82","FT=WENN(Y13+Y35>=Y15;Y13+Y35;MIN(Y13+Y35+SUMME(Y20;Y22;Y23;Y24;Y25;Y26;Y27;Y28;Y29;Y30;Y31;Y32;Y33;Y34);WENN(Y15<0;0;Y15)))*Y82","FT=WENN(Z13+Z35>=Z15;Z13+Z35;MIN(Z13+Z35+SUMME(Z20;Z22;Z23;Z24;Z25;Z26;Z27;Z28;Z29;Z30;Z31;Z32;Z33;Z34);WENN(Z15<0;0;Z15)))*Z82","FT=WENN(AA13+AA35>=AA15;AA13+AA35;MIN(AA13+AA35+SUMME(AA20;AA22;AA23;AA24;AA25;AA26;AA27;AA28;AA29;AA30;AA31;AA32;AA33;AA34);WENN(AA15<0;0;AA15)))*AA82","FT=WENN(AB13+AB35>=AB15;AB13+AB35;MIN(AB13+AB35+SUMME(AB20;AB22;AB23;AB24;AB25;AB26;AB27;AB28;AB29;AB30;AB31;AB32;AB33;AB34);WENN(AB15<0;0;AB15)))*AB82","FT=WENN(AC13+AC35>=AC15;AC13+AC35;MIN(AC13+AC35+SUMME(AC20;AC22;AC23;AC24;AC25;AC26;AC27;AC28;AC29;AC30;AC31;AC32;AC33;AC34);WENN(AC15<0;0;AC15)))*AC82","FT=WENN(AD13+AD35>=AD15;AD13+AD35;MIN(AD13+AD35+SUMME(AD20;AD22;AD23;AD24;AD25;AD26;AD27;AD28;AD29;AD30;AD31;AD32;AD33;AD34);WENN(AD15<0;0;AD15)))*AD82","FT=WENN(AE13+AE35>=AE15;AE13+AE35;MIN(AE13+AE35+SUMME(AE20;AE22;AE23;AE24;AE25;AE26;AE27;AE28;AE29;AE30;AE31;AE32;AE33;AE34);WENN(AE15<0;0;AE15)))*AE82","FT=WENN(AF13+AF35>=AF15;AF13+AF35;MIN(AF13+AF35+SUMME(AF20;AF22;AF23;AF24;AF25;AF26;AF27;AF28;AF29;AF30;AF31;AF32;AF33;AF34);WENN(AF15<0;0;AF15)))*AF82","FT=WENN(AG13+AG35>=AG15;AG13+AG35;MIN(AG13+AG35+SUMME(AG20;AG22;AG23;AG24;AG25;AG26;AG27;AG28;AG29;AG30;AG31;AG32;AG33;AG34);WENN(AG15<0;0;AG15)))*AG82","FT=WENN(AH13+AH35>=AH15;AH13+AH35;MIN(AH13+AH35+SUMME(AH20;AH22;AH23;AH24;AH25;AH26;AH27;AH28;AH29;AH30;AH31;AH32;AH33;AH34);WENN(AH15<0;0;AH15)))*AH82"]
[null,null,null,"FT=24*(D6-D5+D8-D7+D10-D9+D12-D11)*D88","FT=24*(E6-E5+E8-E7+E10-E9+E12-E11)*E88","FT=24*(F6-F5+F8-F7+F10-F9+F12-F11)*F88","FT=24*(G6-G5+G8-G7+G10-G9+G12-G11)*G88","FT=24*(H6-H5+H8-H7+H10-H9+H12-H11)*H88","FT=24*(I6-I5+I8-I7+I10-I9+I12-I11)*I88","FT=24*(J6-J5+J8-J7+J10-J9+J12-J11)*J88","FT=24*(K6-K5+K8-K7+K10-K9+K12-K11)*K88","FT=24*(L6-L5+L8-L7+L10-L9+L12-L11)*L88","FT=24*(M6-M5+M8-M7+M10-M9+M12-M11)*M88","FT=24*(N6-N5+N8-N7+N10-N9+N12-N11)*N88","FT=24*(O6-O5+O8-O7+O10-O9+O12-O11)*O88","FT=24*(P6-P5+P8-P7+P10-P9+P12-P11)*P88","FT=24*(Q6-Q5+Q8-Q7+Q10-Q9+Q12-Q11)*Q88","FT=24*(R6-R5+R8-R7+R10-R9+R12-R11)*R88","FT=24*(S6-S5+S8-S7+S10-S9+S12-S11)*S88","FT=24*(T6-T5+T8-T7+T10-T9+T12-T11)*T88","FT=24*(U6-U5+U8-U7+U10-U9+U12-U11)*U88","FT=24*(V6-V5+V8-V7+V10-V9+V12-V11)*V88","FT=24*(W6-W5+W8-W7+W10-W9+W12-W11)*W88","FT=24*(X6-X5+X8-X7+X10-X9+X12-X11)*X88","FT=24*(Y6-Y5+Y8-Y7+Y10-Y9+Y12-Y11)*Y88","FT=24*(Z6-Z5+Z8-Z7+Z10-Z9+Z12-Z11)*Z88","FT=24*(AA6-AA5+AA8-AA7+AA10-AA9+AA12-AA11)*AA88","FT=24*(AB6-AB5+AB8-AB7+AB10-AB9+AB12-AB11)*AB88","FT=24*(AC6-AC5+AC8-AC7+AC10-AC9+AC12-AC11)*AC88","FT=24*(AD6-AD5+AD8-AD7+AD10-AD9+AD12-AD11)*AD88","FT=24*(AE6-AE5+AE8-AE7+AE10-AE9+AE12-AE11)*AE88","FT=24*(AF6-AF5+AF8-AF7+AF10-AF9+AF12-AF11)*AF88","FT=24*(AG6-AG5+AG8-AG7+AG10-AG9+AG12-AG11)*AG88","FT=24*(AH6-AH5+AH8-AH7+AH10-AH9+AH12-AH11)*AH88"]
[null,null,null,"FT=ODER(D14>0;D21>0)*1","FT=ODER(E14>0;E21>0)*1","FT=ODER(F14>0;F21>0)*1","FT=ODER(G14>0;G21>0)*1","FT=ODER(H14>0;H21>0)*1","FT=ODER(I14>0;I21>0)*1","FT=ODER(J14>0;J21>0)*1","FT=ODER(K14>0;K21>0)*1","FT=ODER(L14>0;L21>0)*1","FT=ODER(M14>0;M21>0)*1","FT=ODER(N14>0;N21>0)*1","FT=ODER(O14>0;O21>0)*1","FT=ODER(P14>0;P21>0)*1","FT=ODER(Q14>0;Q21>0)*1","FT=ODER(R14>0;R21>0)*1","FT=ODER(S14>0;S21>0)*1","FT=ODER(T14>0;T21>0)*1","FT=ODER(U14>0;U21>0)*1","FT=ODER(V14>0;V21>0)*1","FT=ODER(W14>0;W21>0)*1","FT=ODER(X14>0;X21>0)*1","FT=ODER(Y14>0;Y21>0)*1","FT=ODER(Z14>0;Z21>0)*1","FT=ODER(AA14>0;AA21>0)*1","FT=ODER(AB14>0;AB21>0)*1","FT=ODER(AC14>0;AC21>0)*1","FT=ODER(AD14>0;AD21>0)*1","FT=ODER(AE14>0;AE21>0)*1","FT=ODER(AF14>0;AF21>0)*1","FT=ODER(AG14>0;AG21>0)*1","FT=ODER(AH14>0;AH21>0)*1"]
[null,null,null,{"$f":"ABS(\"FT\"&_xlfn.FORMULATEXT(D14)<>D45)","v":0},{"$f":"ABS(\"FT\"&_xlfn.FORMULATEXT(E14)<>E45)","v":0},0,0,0,0,0,0,0,0,0,0,0,0,0,0,0,0,0,0,0,0,0,0,0,0,0,0,0,0,0]
[null,null,null,{"$f":"ABS(\"FT\"&_xlfn.FORMULATEXT(D13)<>D46)","v":0},{"$f":"ABS(\"FT\"&_xlfn.FORMULATEXT(E13)<>E46)","v":0},0,0,0,0,0,0,0,0,0,0,0,0,0,0,0,0,0,0,0,0,0,0,0,0,0,0,0,0,0]
[null,null,null,{"$f":"ABS(\"FT\"&_xlfn.FORMULATEXT(D80)<>D47)","v":0},{"$f":"ABS(\"FT\"&_xlfn.FORMULATEXT(E80)<>E47)","v":0},0,0,0,0,0,0,0,0,0,0,0,0,0,0,0,0,0,0,0,0,0,0,0,0,0,0,0,0,0]
[null,null,null,{"$f":"ABS(ISERROR(D37))","v":0},{"$f":"ABS(ISERROR(E37))","v":0},0,0,0,0,0,0,0,0,0,0,0,0,0,0,0,0,0,0,0,0,0,0,0,0,0,0,0,0,0]
[null,null,null,{"$f":"SUM(D48:D51)","v":0},{"$f":"SUM(E48:E51)","v":0},0,0,0,0,0,0,0,0,0,0,0,0,0,0,0,0,0,0,0,0,0,0,0,0,0,0,0,0,0,null,null,null,null,"Formel defekt",{"$f":"SUM(D52:AH52)","v":0}]
[]
[]
[]
[]
[]
[]
[]
[]
[]
[]
[]
[]
[]
[]
[]
[]
[]
[]
[]
[]
[]
[]
[]
[]
[null,"HT_Naz-Kopie",{"$f":"HT_NAZ","v":8.4}]
[null,"Heute:",{"$f":"SL_BisDatum","v":"2024-02-02"}]
[null,null,"Reguläre Tage ausgefüllt",{"$f":"((D80*D81)=1)*1","v":0},{"$f":"((E80*E81)=1)*1","v":0},0,0,0,0,0,0,0,0,0,0,0,0,0,0,0,0,0,0,0,0,0,0,0,0,0,0,0,0,0]
[null,null,"Arbeitstage ausgefüllt",{"$f":"OR(D14>0,D21>0)*1","v":0},{"$f":"OR(E14>0,E21>0)*1","v":0},0,0,0,0,0,0,0,0,0,0,0,0,0,0,0,0,0,0,0,0,0,0,0,0,0,0,0,0,0]
[null,null,"Arbeitstage wenn BG>0%",{"$f":"IFERROR(VLOOKUP(D3,VSA_Kalender,22),0)","v":0},0,0,0,0,0,0,0,0,0,0,0,0,0,0,0,0,0,0,0,0,0,0,0,0,0,0,0,0,0,0]
[null,null,"Der BG beträgt mehr als 0%",{"$f":"IF(D4=\"\",0,ABS(VLOOKUP(D3,VSA_Kalender,13,FALSE)>0))","v":1},1,1,1,1,1,1,1,1,1,1,1,1,1,1,1,1,1,1,1,1,1,1,1,1,1,1,1,1,1,1]
[null,null,"(Ja: 1, Nein: 0)",{"$f":"SUM(D81:AH81)","v":0},"Total Tage bei BG>0%",null,null,{"$f":"SUM(D80:AH80)","v":0},"Total Tage ausgefüllt",null,null,{"$f":"SUM(D79:AH79)","v":0},"Total reguläre Tage ausgefüllt"]
[]
[null,null,"Tag des Monats",{"$f":"D4","v":1},2,3,4,5,6,7,8,9,10,11,12,13,14,15,16,17,18,19,20,21,22,23,24,25,26,27,28,29,30,31]
[null,null,"Ist Arbeitsbereich",{"$f":"IFERROR(ABS(WEEKDAY(D3,2)<6),0)","v":1},0,0,1,1,1,1,1,0,0,1,1,1,1,1,0,0,1,1,1,1,1,0,0,1,1,1,1,1,0,0]
[null,null,"Maximaler Fehler",{"$f":"MAX(D100:D107,D98,D134)","v":0},{"$f":"MAX(E100:E107,E98,E134)","v":0},0,0,0,0,0,0,0,0,0,0,0,0,0,0,0,0,0,0,0,0,0,0,0,0,0,0,0,0,0]
[null,null,"Wird die Präsenzzeit angezeigt?",{"$f":"IF(D87=0,1,0)","v":1},{"$f":"IF(E87=0,1,0)","v":1},1,1,1,1,1,1,1,1,1,1,1,1,1,1,1,1,1,1,1,1,1,1,1,1,1,1,1,1,1]
[]
[null,null,"Gruppenfehler 1",{"$f":"IF(AND(D6-D5=0,COUNTA(D7:D12)>0),1,0)","v":0},0,0,0,0,0,0,0,0,0,0,0,0,0,0,0,0,0,0,0,0,0,0,0,0,0,0,0,0,0,0]
[null,"Gruppenfehler","(aus)",{"$f":"D90","v":0},0,0,0,0,0,0,0,0,0,0,0,0,0,0,0,0,0,0,0,0,0,0,0,0,0,0,0,0,0,0]
[null,null,"Gruppenfehler 2",{"$f":"IF(AND(D8-D7=0,COUNTA(D9:D12)>0),1,0)","v":0},0,0,0,0,0,0,0,0,0,0,0,0,0,0,0,0,0,0,0,0,0,0,0,0,0,0,0,0,0,0]
[null,null,"(aus)",{"$f":"D92","v":0},0,0,0,0,0,0,0,0,0,0,0,0,0,0,0,0,0,0,0,0,0,0,0,0,0,0,0,0,0,0]
[null,null,"Gruppenfehler 3",{"$f":"IF(AND(D10-D9=0,COUNTA(D11:D12)>0),1,0)","v":0},0,0,0,0,0,0,0,0,0,0,0,0,0,0,0,0,0,0,0,0,0,0,0,0,0,0,0,0,0,0]
[null,null,"(aus)",{"$f":"D94","v":0},0,0,0,0,0,0,0,0,0,0,0,0,0,0,0,0,0,0,0,0,0,0,0,0,0,0,0,0,0,0]
[null,null,"leer"]
[null,null,"leer"]
[null,null,"Genereller Gruppenfehler",{"$f":"MAX(D90:D95)","v":0},0,0,0,0,0,0,0,0,0,0,0,0,0,0,0,0,0,0,0,0,0,0,0,0,0,0,0,0,0,0]
[]
[null,null,"Ein1",{"$f":"IF(AND(D109=0,D110>0),1,0)","v":0},{"$f":"IF(AND(E109=0,E110>0),1,0)","v":0},0,0,0,0,0,0,0,0,0,0,0,0,0,0,0,0,0,0,0,0,0,0,0,0,0,0,0,0,0]
[null,null,"Aus1",{"$f":"IF(AND(D110>0,D110<D109),3,IF(AND(D109>0,D110=0),1,0))*D$86","v":0},{"$f":"IF(AND(E110>0,E110<E109),3,IF(AND(E109>0,E110=0),1,0))*E$86","v":0},0,0,0,0,0,0,0,0,0,0,0,0,0,0,0,0,0,0,0,0,0,0,0,0,0,0,0,0,0]
[null,null,"Ein2",{"$f":"IF(AND(D111>0,D111<D110),3,IF(AND(D111=0,D112>0),1,0))*D$86","v":0},0,0,0,0,0,0,0,0,0,0,0,0,0,0,0,0,0,0,0,0,0,0,0,0,0,0,0,0,0,0]
[null,null,"Aus2",{"$f":"IF(AND(D112>0,D112<D111),3,IF(AND(D111>0,D112=0),1,0))*D$86","v":0},{"$f":"IF(AND(E112>0,E112<E111),3,IF(AND(E111>0,E112=0),1,0))*E$86","v":0},0,0,0,0,0,0,0,0,0,0,0,0,0,0,0,0,0,0,0,0,0,0,0,0,0,0,0,0,0]
[null,"Zellenfehler","Ein3",{"$f":"IF(AND(D113>0,D113<D112),3,IF(AND(D113=0,D114>0),1,0))*D$86","v":0},{"$f":"IF(AND(E113>0,E113<E112),3,IF(AND(E113=0,E114>0),1,0))*E$86","v":0},0,0,0,0,0,0,0,0,0,0,0,0,0,0,0,0,0,0,0,0,0,0,0,0,0,0,0,0,0]
[null,null,"Aus3",{"$f":"IF(AND(D114>0,D114<D113),3,IF(AND(D113>0,D114=0),1,0))*D$86","v":0},{"$f":"IF(AND(E114>0,E114<E113),3,IF(AND(E113>0,E114=0),1,0))*E$86","v":0},0,0,0,0,0,0,0,0,0,0,0,0,0,0,0,0,0,0,0,0,0,0,0,0,0,0,0,0,0]
[null,null,"Ein4",{"$f":"IF(AND(D115>0,D115<D114),3,IF(AND(D115=0,D116>0),1,0))*D$86","v":0},{"$f":"IF(AND(E115>0,E115<E114),3,IF(AND(E115=0,E116>0),1,0))*E$86","v":0},0,0,0,0,0,0,0,0,0,0,0,0,0,0,0,0,0,0,0,0,0,0,0,0,0,0,0,0,0]
[null,null,"Aus4",{"$f":"IF(AND(D116>0,D116<D115),3,IF(AND(D115>0,D116=0),1,0))*D$86","v":0},{"$f":"IF(AND(E116>0,E116<E115),3,IF(AND(E115>0,E116=0),1,0))*E$86","v":0},0,0,0,0,0,0,0,0,0,0,0,0,0,0,0,0,0,0,0,0,0,0,0,0,0,0,0,0,0]
[]
[null,null,"Ein1",{"$f":"ROUND(D5*24,2)","v":0},0,0,0,0,0,0,0,0,0,0,0,0,0,0,0,0,0,0,0,0,0,0,0,0,0,0,0,0,0,0]
[null,null,"Aus1",0,0,0,0,0,0,0,0,0,0,0,0,0,0,0,0,0,0,0,0,0,0,0,0,0,0,0,0,0,0,0]
[null,"Zeiten dezimal gewandelt","Ein2",0,0,0,0,0,0,0,0,0,0,0,0,0,0,0,0,0,0,0,0,0,0,0,0,0,0,0,0,0,0,0]
[null,null,"Aus2",0,0,0,0,0,0,0,0,0,0,0,0,0,0,0,0,0,0,0,0,0,0,0,0,0,0,0,0,0,0,0]
[null,null,"Ein3",0,0,0,0,0,0,0,0,0,0,0,0,0,0,0,0,0,0,0,0,0,0,0,0,0,0,0,0,0,0,0]
[null,null,"Aus3",0,0,0,0,0,0,0,0,0,0,0,0,0,0,0,0,0,0,0,0,0,0,0,0,0,0,0,0,0,0,0]
[null,null,"Ein4",0,0,0,0,0,0,0,0,0,0,0,0,0,0,0,0,0,0,0,0,0,0,0,0,0,0,0,0,0,0,0]
[null,null,"Aus4",0,0,0,0,0,0,0,0,0,0,0,0,0,0,0,0,0,0,0,0,0,0,0,0,0,0,0,0,0,0,0]
[]
[null,"Pausenfehler","Gruppe1",{"$f":"IF(OR(D109=\"\",D110=\"\"),0,D110-D109)","v":0},{"$f":"IF(OR(E109=\"\",E110=\"\"),0,E110-E109)","v":0},0,0,0,0,0,0,0,0,0,0,0,0,0,0,0,{"$f":"IF(OR(U109=\"\",U110=\"\"),0,U110-U109)","v":0},{"$f":"IF(OR(V109=\"\",V110=\"\"),0,V110-V109)","v":0},0,0,0,0,0,0,0,0,0,0,0,0]
[null,null,"Gruppe2",{"$f":"IF(OR(D111=\"\",D112=\"\"),0,D112-D111)","v":0},{"$f":"IF(OR(E111=\"\",E112=\"\"),0,E112-E111)","v":0},0,0,0,0,0,0,0,0,0,0,0,0,0,0,0,{"$f":"IF(OR(U111=\"\",U112=\"\"),0,U112-U111)","v":0},{"$f":"IF(OR(V111=\"\",V112=\"\"),0,V112-V111)","v":0},0,0,0,0,0,0,0,0,0,0,0,0]
[null,null,"Gruppe3",{"$f":"IF(OR(D113=\"\",D114=\"\"),0,D114-D113)","v":0},{"$f":"IF(OR(E113=\"\",E114=\"\"),0,E114-E113)","v":0},0,0,0,0,0,0,0,0,0,0,0,0,0,0,0,{"$f":"IF(OR(U113=\"\",U114=\"\"),0,U114-U113)","v":0},{"$f":"IF(OR(V113=\"\",V114=\"\"),0,V114-V113)","v":0},0,0,0,0,0,0,0,0,0,0,0,0]
[null,null,"Gruppe4",{"$f":"IF(OR(D115=\"\",D116=\"\"),0,D116-D115)","v":0},{"$f":"IF(OR(E115=\"\",E116=\"\"),0,E116-E115)","v":0},0,0,0,0,0,0,0,0,0,0,0,0,0,0,0,{"$f":"IF(OR(U115=\"\",U116=\"\"),0,U116-U115)","v":0},{"$f":"IF(OR(V115=\"\",V116=\"\"),0,V116-V115)","v":0},0,0,0,0,0,0,0,0,0,0,0,0]
[]
[null,null,"Pause12",{"$f":"IF(OR(D110=\"\",D111=\"\"),0,D111-D110)","v":0},{"$f":"IF(OR(E110=\"\",E111=\"\"),0,E111-E110)","v":0},0,0,0,0,0,0,0,0,0,0,0,0,0,0,0,{"$f":"IF(OR(U110=\"\",U111=\"\"),0,U111-U110)","v":0},{"$f":"IF(OR(V110=\"\",V111=\"\"),0,V111-V110)","v":0},0,0,0,0,0,0,0,0,0,0,0,0]
[null,null,"Pause23",{"$f":"IF(OR(D112=\"\",D113=\"\"),0,D113-D112)","v":0},{"$f":"IF(OR(E112=\"\",E113=\"\"),0,E113-E112)","v":0},0,0,0,0,0,0,0,0,0,0,0,0,0,0,0,{"$f":"IF(OR(U112=\"\",U113=\"\"),0,U113-U112)","v":0},{"$f":"IF(OR(V112=\"\",V113=\"\"),0,V113-V112)","v":0},0,0,0,0,0,0,0,0,0,0,0,0]
[null,null,"Pause34",{"$f":"IF(OR(D114=\"\",D115=\"\"),0,D115-D114)","v":0},{"$f":"IF(OR(E114=\"\",E115=\"\"),0,E115-E114)","v":0},0,0,0,0,0,0,0,0,0,0,0,0,0,0,0,{"$f":"IF(OR(U114=\"\",U115=\"\"),0,U115-U114)","v":0},{"$f":"IF(OR(V114=\"\",V115=\"\"),0,V115-V114)","v":0},0,0,0,0,0,0,0,0,0,0,0,0]
[]
[null,null,"Kum12",{"$f":"IF(D123>=0.5,0,D118+D119)","v":0},{"$f":"IF(E123>=0.5,0,E118+E119)","v":0},0,0,0,0,0,0,0,0,0,0,0,0,0,0,0,{"$f":"IF(U123>=0.5,0,U118+U119)","v":0},{"$f":"IF(V123>=0.5,0,V118+V119)","v":0},0,0,0,0,0,0,0,0,0,0,0,0]
[null,null,"Kum123",{"$f":"IF(OR(D123>=0.5,D124>=0.5),0,D118+D119+D120)","v":0},{"$f":"IF(OR(E123>=0.5,E124>=0.5),0,E118+E119+E120)","v":0},0,0,0,0,0,0,0,0,0,0,0,0,0,0,0,{"$f":"IF(OR(U123>=0.5,U124>=0.5),0,U118+U119+U120)","v":0},{"$f":"IF(OR(V123>=0.5,V124>=0.5),0,V118+V119+V120)","v":0},0,0,0,0,0,0,0,0,0,0,0,0]
[null,null,"Kum1234",{"$f":"IF(OR(D123>=0.5,D124>=0.5,D125>=0.5),0,D118+D119+D120+D121)","v":0},{"$f":"IF(OR(E123>=0.5,E124>=0.5,E125>=0.5),0,E118+E119+E120+E121)","v":0},0,0,0,0,0,0,0,0,0,0,0,0,0,0,0,{"$f":"IF(OR(U123>=0.5,U124>=0.5,U125>=0.5),0,U118+U119+U120+U121)","v":0},{"$f":"IF(OR(V123>=0.5,V124>=0.5,V125>=0.5),0,V118+V119+V120+V121)","v":0},0,0,0,0,0,0,0,0,0,0,0,0]
[null,null,"Kum23",{"$f":"IF(D124>=0.5,0,D119+D120)","v":0},{"$f":"IF(E124>=0.5,0,E119+E120)","v":0},0,0,0,0,0,0,0,0,0,0,0,0,0,0,0,{"$f":"IF(U124>=0.5,0,U119+U120)","v":0},{"$f":"IF(V124>=0.5,0,V119+V120)","v":0},0,0,0,0,0,0,0,0,0,0,0,0]
[null,null,"Kum234",{"$f":"IF(OR(D124>=0.5,D125>=0.5),0,D119+D120+D121)","v":0},{"$f":"IF(OR(E124>=0.5,E125>=0.5),0,E119+E120+E121)","v":0},0,0,0,0,0,0,0,0,0,0,0,0,0,0,0,{"$f":"IF(OR(U124>=0.5,U125>=0.5),0,U119+U120+U121)","v":0},{"$f":"IF(OR(V124>=0.5,V125>=0.5),0,V119+V120+V121)","v":0},0,0,0,0,0,0,0,0,0,0,0,0]
[null,null,"Kum34",{"$f":"IF(D125>=0.5,0,D120+D121)","v":0},{"$f":"IF(E125>=0.5,0,E120+E121)","v":0},0,0,0,0,0,0,0,0,0,0,0,0,0,0,0,{"$f":"IF(U125>=0.5,0,U120+U121)","v":0},{"$f":"IF(V125>=0.5,0,V120+V121)","v":0},0,0,0,0,0,0,0,0,0,0,0,0]
[]
[null,null,"Pausenfehler-Code",{"$f":"IF(MAX(D118:D121,D127:D132)>6,2,0)","v":0},{"$f":"IF(MAX(E118:E121,E127:E132)>6,2,0)","v":0},0,0,0,0,0,0,0,0,0,0,0,0,0,0,0,0,0,0,0,0,0,0,0,0,0,0,0,0,0]

{"sheet":"April","index":9,"n_rows":134,"n_cols":45,"rows_kept":134,"cut":false,"hidden":true,"merged":[[11,34,12,35]]}
[4,{"$f":"DATEVALUE(\"1.\"&A1&\".\"&SL_Jahr)","v":"2024-04-01"},{"$f":"SL_Jahr","v":2024},{"$f":"B_Gde","v":"Gde:"},{"$f":"SL_Gemeinde","v":0},null,null,null,null,null,null,null,null,null,null,null,null,null,null,{"$f":"B_Schule","v":"Schule:"},{"$f":"SL_Schule","v":0},null,null,null,null,null,null,null,null,null,null,null,null,null,null,null,null,null,"Abschluss-Teilbedingungen:"]
[{"$f":"VLOOKUP(A1,Monatsenden,2)","v":45412},{"$f":"B_Bg","v":"BG:"},{"$f":"VLOOKUP(B1,VSA_Kalender,13)","v":1},{"$f":"B_Name","v":"Name:"},{"$f":"SL_Name","v":0},null,null,null,null,null,null,null,null,null,null,null,null,null,null,null,null,null,null,null,null,null,null,null,null,null,null,null,null,null,null,null,null,null,"Regel ok",{"$f":"(AN14>=AN15)","v":false},"Nicht Relevant",{"$f":"D83=0","v":true},-1,{"$f":"IF(AP2=TRUE,AQ2,0)","v":-1},"Nicht Relevant"]
[null,{"$f":"Zerf_Version & \" \" & Zerf_T","v":"Version VSA 1.06 "},null,{"$f":"DATE($C$1,MONTH($B$1),D$4)","v":"2024-04-01"},{"$f":"DATE($C$1,MONTH($B$1),E$4)","v":"2024-04-02"},"2024-04-03","2024-04-04","2024-04-05","2024-04-06","2024-04-07","2024-04-08","2024-04-09","2024-04-10","2024-04-11","2024-04-12","2024-04-13","2024-04-14","2024-04-15","2024-04-16","2024-04-17","2024-04-18","2024-04-19","2024-04-20","2024-04-21","2024-04-22","2024-04-23","2024-04-24","2024-04-25","2024-04-26","2024-04-27","2024-04-28",{"$f":"IF(MONTH(DATE($C$1,MONTH($B$1),AF$41))>MONTH($B$1),\"\",DATE($C$1,MONTH($B$1),AF$4))","v":"2024-04-29"},{"$f":"IF(MONTH(DATE($C$1,MONTH($B$1),AG$41))>MONTH($B$1),\"\",DATE($C$1,MONTH($B$1),AG$4))","v":"2024-04-30"},{"$f":"IF(MONTH(DATE($C$1,MONTH($B$1),AH$41))>MONTH($B$1),\"\",DATE($C$1,MONTH($B$1),AH$4))","v":""},null,null,null,null,"Spalten ok",{"$f":"(L83>=D83)","v":true},"Entsperrt",false,1,{"$f":"AP3*AQ3","v":0},"Entsperrt"]
[null,{"$f":"IF(VSATestModus=TRUE(),\"VSA-Modus!\",\"\")","v":""},{"$f":"IF(AN52>0,\"DEFEKT\",\"\")","v":""},{"$f":"IF(MONTH(DATE($C$1,MONTH($B$1),D$41))>MONTH($B$1),\"\",D41)","v":1},2,3,4,5,6,7,8,9,10,11,12,13,14,15,16,17,18,19,20,21,22,23,24,25,26,27,28,{"$f":"IF(MONTH(DATE($C$1,MONTH($B$1),AF$41))>MONTH($B$1),\"\",AF41)","v":29},{"$f":"IF(MONTH(DATE($C$1,MONTH($B$1),AG$41))>MONTH($B$1),\"\",AG41)","v":30},{"$f":"IF(MONTH(DATE($C$1,MONTH($B$1),AH$41))>MONTH($B$1),\"\",AH41)","v":""},null,null,null,null,"Keine Fehler",{"$f":"(SUM(D87:AH87)=0)","v":true},"Geändert",false,2,{"$f":"AP4*AQ4","v":0},"Geändert"]
[null,"     Ein   >>>",null,null,null,null,null,null,null,null,null,null,null,null,null,null,null,null,null,null,null,null,null,null,null,null,null,null,null,null,null,null,null,null,null,null,null,null,"Keine Hand",{"$f":"(AI12=\"\")","v":true},"Sperre",{"$f":"AS11=2","v":false},3,{"$f":"NOT(AP6)*AQ5","v":3},"Eingaben vornehmen"]
[null,"<<<   Aus     ",null,null,null,null,null,null,null,null,null,null,null,null,null,null,null,null,null,null,null,null,null,null,null,null,null,null,null,null,null,null,null,null,null,null,null,null,null,null,"Abschliessbar 1",{"$f":"AND(OR(AN2,AN3),AN4,AN5,NOT(AP7),NOT(AP2))","v":false},4,{"$f":"AND(NOT(OR(AP3,AP4)),AP6)*AQ6","v":0},"Abschliessbar 1"]
[null,"     Ein   >>>",null,null,null,null,null,null,null,null,null,null,null,null,null,null,null,null,null,null,null,null,null,null,null,null,null,null,null,null,null,null,null,null,null,null,null,null,null,null,"Abgeschlossen",false,5,{"$f":"AND(NOT(OR(AP3,AP4)),AP7)*AQ7","v":0},"Abgeschlossen"]
[null,"<<<   Aus     ",null,null,null,null,null,null,null,null,null,null,null,null,null,null,null,null,null,null,null,null,null,null,null,null,null,null,null,null,null,null,null,null,null,null,null,null,null,null,"Für Jahr OK",{"$f":"AND(OR(AP2,AP7),NOT(AP3))","v":true}]
[null,"     Ein   >>>"]
[null,"<<<   Aus     ",null,null,null,null,null,null,null,null,null,null,null,null,null,null,null,null,null,null,null,null,null,null,null,null,null,null,null,null,null,null,null,null,null,null,null,null,null,null,"Statusnummer:",{"$f":"IF(AR2=AQ2,AQ2,MAX(AR2:AR7))","v":-1}]
[null,"     Ein   >>>",null,null,null,null,null,null,null,null,null,null,null,null,null,null,null,null,null,null,null,null,null,null,null,null,null,null,null,null,null,null,null,null,null,null,null,null,"HatDaten:",{"$f":"AND(AP2=FALSE,OR(AP10<>3,COUNTA(D5:AH12,D20:AH35,D39:L40)>0))","v":false},"Statustext:",{"$f":"IFERROR(VLOOKUP(AP10,AR2:AS7,2,FALSE),\"unbekannt\")","v":"Nicht Relevant"},null,null,1]
[null,"<<<   Aus     ",null,null,null,null,null,null,null,null,null,null,null,null,null,null,null,null,null,null,null,null,null,null,null,null,null,null,null,null,null,null,null,null,{"$f":"IF(COUNTIF(D37:AH37,\"I\")>0,\"I\",\"\")","v":""}]
[null,{"$f":"B_PrZeit","v":"Präsenzzeit"},null,{"$f":"24*(D6-D5+D8-D7+D10-D9+D12-D11)*D88","v":0},{"$f":"24*(E6-E5+E8-E7+E10-E9+E12-E11)*E88","v":0},0,0,0,0,0,0,0,0,0,0,0,0,0,0,0,0,0,0,0,0,0,0,0,0,0,0,0,0,0,null,null,null,null,"Anzahl Regeltage:",{"$f":"D83","v":0}]
[null,{"$f":"B_TotalAZist","v":"Total Arbeitszeit (IST)"},null,{"$f":"IF(D13+D35>=D15,D13+D35,MIN(D13+D35+SUM(D20,D22,D23,D24,D25,D26,D27,D28,D29,D30,D31,D32,D33,D34),IF(D15<0,0,D15)))*D82","v":0},0,0,0,0,0,0,0,0,0,0,0,0,0,{"$f":"IF(R13+R35>=R15,R13+R35,MIN(R13+R35+SUM(R20,R22,R23,R24,R25,R26,R27,R28,R29,R30,R31,R32,R33,R34),IF(R15<0,0,R15)))*R82","v":0},{"$f":"IF(S13+S35>=S15,S13+S35,MIN(S13+S35+SUM(S20,S22,S23,S24,S25,S26,S27,S28,S29,S30,S31,S32,S33,S34),IF(S15<0,0,S15)))*S82","v":0},{"$f":"IF(T13+T35>=T15,T13+T35,MIN(T13+T35+SUM(T20,T22,T23,T24,T25,T26,T27,T28,T29,T30,T31,T32,T33,T34),IF(T15<0,0,T15)))*T82","v":0},{"$f":"IF(U13+U35>=U15,U13+U35,MIN(U13+U35+SUM(U20,U22,U23,U24,U25,U26,U27,U28,U29,U30,U31,U32,U33,U34),IF(U15<0,0,U15)))*U82","v":0},0,0,0,0,0,0,0,0,0,0,0,0,0,{"$f":"SUMIF($D$82:$AH$82,1,D14:AH14)","v":0},{"$f":"AI14-AI15","v":8.4},null,null,"Erfasste Regeltage",{"$f":"L83","v":0},{"$f":"AN13-AN14","v":0},"Fehlende Regeltage"]
[null,{"$f":"B_NettoSollAZ","v":"Netto-SOLL-Arbeitszeit"},null,{"$f":"ROUND(D16-D19,2)","v":-8.4},{"$f":"ROUND(E16-E19,2)","v":0},0,0,0,0,0,0,0,0,0,0,0,0,0,0,0,0,0,0,0,0,0,0,0,0,0,0,{"$f":"IF(AF$42=4,0,ROUND(AF16-AF19,2))","v":0},{"$f":"IF(AG$42=4,0,ROUND(AG16-AG19,2))","v":0},0,{"$f":"SUMIF($D$82:$AH$82,1,D15:AH15)","v":-8.4},null,null,null,"Minimum Regeltage",{"$f":"MinRegeltage","v":1},"Ist als Konstante im Blatt \"Intern\" hinterlegt"]
[null,{"$f":"B_BruttoSollAZ","v":"Brutto-SOLL-Arb.zeit"},null,{"$f":"VLOOKUP(D3,VSA_Kalender,16)","v":0},0,0,0,0,0,0,0,0,0,0,0,0,0,0,0,0,0,0,0,0,0,0,0,0,0,0,0,{"$f":"IF(AF$42=4,0,VLOOKUP(AF3,VSA_Kalender,16))","v":0},{"$f":"IF(AG$42=4,0,VLOOKUP(AG3,VSA_Kalender,16))","v":0},{"$f":"IF(AH$42=4,0,VLOOKUP(AH3,VSA_Kalender,16))","v":0},null,null,null,null,"Regel ok","Mind. eigetr. Regeltage erfüllt"]
[null,{"$f":"B_MehrMinder","v":"Mehr-/Minderleistung"},null,{"$f":"(SL_BisDatum>=D3)*ROUND(D14-D15,2)","v":0},0,0,0,0,0,0,0,0,0,0,0,0,0,0,0,0,0,0,0,0,0,0,0,0,0,0,0,0,0,0,{"$f":"B_Total","v":"Total"},{"$f":"B_Vortrag","v":"Vortrag"},null,null,"Spalten ok:","Alle Einträge an Regeltagen ok"]
[null,{"$f":"B_AZSaldo","v":"AZ - Saldo"},{"$f":"VLOOKUP(ROW(),VSA_Uebertrag,$A$1+3)","v":16.8},{"$f":"IFERROR((C18+D17)*(D3<=SL_BisDatum)*VLOOKUP(D3,VSA_Kalender,21,FALSE),0)","v":0},0,0,{"$f":"IFERROR((F18+G17)*(G3<=SL_BisDatum)*VLOOKUP(G3,VSA_Kalender,21,FALSE),0)","v":0},0,0,0,0,0,0,0,0,0,0,0,0,0,0,0,0,0,0,0,0,0,0,0,0,0,0,0,null,{"$f":"SUMIF($D$82:$AH$82,1,D17:AH17)+C18","v":16.8}]
[null,{"$f":"B_FTA","v":"Feiertagsanspruch"},0,{"$f":"VLOOKUP(D3,VSA_Kalender,14)","v":8.4},0,0,0,0,0,0,0,0,0,0,0,0,0,0,0,0,0,0,0,0,0,0,0,0,0,0,0,{"$f":"IF(AF$42=4,0,VLOOKUP(AF3,VSA_Kalender,14))","v":0},{"$f":"IF(AG$42=4,0,VLOOKUP(AG3,VSA_Kalender,14))","v":0},{"$f":"IF(AH$42=4,0,VLOOKUP(AH3,VSA_Kalender,14))","v":0},{"$f":"SUM(D19:AH19)","v":8.4}]
[null,{"$f":"B_Ferien","v":"Ferien"},{"$f":"VLOOKUP(ROW(),VSA_Uebertrag,$A$1+3)","v":0},null,null,null,null,null,null,null,null,null,null,null,null,null,null,null,null,null,null,null,null,null,null,null,null,null,null,null,null,null,null,null,{"$f":"SUMIF($D$82:$AH$82,1,D20:AH20)","v":0},{"$f":"ROUND(C20-AI20,2)","v":0},"Rest"]
[null,{"$f":"B_KompAZ","v":"Kompensation Arbeitstage"},0,null,null,null,null,null,null,null,null,null,null,null,null,null,null,null,null,null,null,null,null,null,null,null,null,null,null,null,null,null,null,null,0,{"$f":"ROUND(A21+C21-AI21,0)","v":0}]
[null,{"$f":"B_Arzt","v":"Arztbesuch"},0,null,null,null,null,null,null,null,null,null,null,null,null,null,null,null,null,null,null,null,null,null,null,null,null,null,null,null,null,null,null,null,0,{"$f":"ROUND(A22+C22+AI22,2)","v":0},"Summen"]
[null,{"$f":"B_Krank","v":"Krankheit"},0,null,null,null,null,null,null,null,null,null,null,null,null,null,null,null,null,null,null,null,null,null,null,null,null,null,null,null,null,null,null,null,0,{"$f":"ROUND(A23+C23+AI23,2)","v":0}]
[null,{"$f":"B_BU","v":"Berufsunfall"},0,null,null,null,null,null,null,null,null,null,null,null,null,null,null,null,null,null,null,null,null,null,null,null,null,null,null,null,null,null,null,null,0,0]
[null,{"$f":"B_NBU","v":"Nichtberufsunfall"},0,null,null,null,null,null,null,null,null,null,null,null,null,null,null,null,null,null,null,null,null,null,null,null,null,null,null,null,null,null,null,null,0,0]
[null,{"$f":"B_MilZiv","v":"Militär / Zivilschutz"},0,null,null,null,null,null,null,null,null,null,null,null,null,null,null,null,null,null,null,null,null,null,null,null,null,null,null,null,null,null,null,null,0,0]
[null,{"$f":"B_UUB","v":"Unbezahlter Urlaub"},0,null,null,null,null,null,null,null,null,null,null,null,null,null,null,null,null,null,null,null,null,null,null,null,null,null,null,null,null,null,null,null,0,{"$f":"ROUND(A27+C27-AI27,2)","v":0},"Rest"]
[null,{"$f":"B_UB","v":"Bezahlter Urlaub"},0,null,null,null,null,null,null,null,null,null,null,null,null,null,null,null,null,null,null,null,null,null,null,null,null,null,null,null,null,null,null,null,0,{"$f":"ROUND(A28+C28-AI28,2)","v":0}]
[null,{"$f":"B_NebenB","v":"Nebenbeschäftigung"},0,null,null,null,null,null,null,null,null,null,null,null,null,null,null,null,null,null,null,null,null,null,null,null,null,null,null,null,null,null,null,null,0,0]
[null,{"$f":"B_DAG","v":"D A G"},0,null,null,null,null,null,null,null,null,null,null,null,null,null,null,null,null,null,null,null,null,null,null,null,null,null,null,null,null,null,null,null,0,0]
[null,{"$f":"B_Divers","v":"Diverses"},0,null,null,null,null,null,null,null,null,null,null,null,null,null,null,null,null,null,null,null,null,null,null,null,null,null,null,null,null,null,null,null,0,0,"Summen"]
[null,{"$f":"B_FamPersErg","v":"Fam./pers. Ereignisse"},0,null,null,null,null,null,null,null,null,null,null,null,null,null,null,null,null,null,null,null,null,null,null,null,null,null,null,null,null,null,null,null,0,0]
[null,{"$f":"B_FZ1","v":"freie Zeile 1"},0,null,null,null,null,null,null,null,null,null,null,null,null,null,null,null,null,null,null,null,null,null,null,null,null,null,null,null,null,null,null,null,0,0]
[null,{"$f":"B_FZ2","v":"freie Zeile 2"},0,null,null,null,null,null,null,null,null,null,null,null,null,null,null,null,null,null,null,null,null,null,null,null,null,null,null,null,null,null,null,null,0,0]
[null,{"$f":"B_WB","v":"Weiterbildung"},0,null,null,null,null,null,null,null,null,null,null,null,null,null,null,null,null,null,null,null,null,null,null,null,null,null,null,null,null,null,null,null,0,0]
[null,{"$f":"B_FEL","v":"frei einsetzbare Lekt."},0,null,null,null,null,null,null,null,null,null,null,null,null,null,null,null,null,null,null,null,null,null,null,null,null,null,null,null,null,null,null,null,{"$f":"SUM(D36:AH36)","v":0},{"$f":"ROUND(C36-AI36,0)","v":0}]
[null,null,null,{"$f":"IF(AND((D13 - D15)+SUM(D20,D22:D34)>0.00001,SUM(D20,D22:D34)>0),\"I\",\"\")","v":""},"","","","","","","","","","","","","","","","","","","","","","","","","","","","","",""]
[null,null,"Visum","Identität:",null,null,null,null,"Datum:",null,"Status:"]
[null,null,"SL"]
[null,null,"VG"]
[null,null,null,1,2,3,4,5,6,7,8,9,10,11,12,13,14,15,16,17,18,19,20,21,22,23,24,25,26,27,28,29,30,31]
[null,null,null,{"$f":"IF(D3=\"\",4,VLOOKUP(D3,VSA_Kalender,18))","v":1},{"$f":"IF(E3=\"\",4,VLOOKUP(E3,VSA_Kalender,18))","v":0},0,0,0,1,1,0,0,0,0,0,1,1,0,0,0,0,0,1,1,0,0,0,0,0,1,1,0,0,4]
[]
[null,null,null,{"$f":"IF(D19>0,VLOOKUP(D3,KalFeiertage,6,FALSE),\"\")","v":"Ostermontag"},"","","","","","","","","","","","","","","","","","","","","","","","","","","","","",""]
[null,null,null,"FT=WENN(D13+D35>=D15;D13+D35;MIN(D13+D35+SUMME(D20;D22;D23;D24;D25;D26;D27;D28;D29;D30;D31;D32;D33;D34);WENN(D15<0;0;D15)))*D82","FT=WENN(E13+E35>=E15;E13+E35;MIN(E13+E35+SUMME(E20;E22;E23;E24;E25;E26;E27;E28;E29;E30;E31;E32;E33;E34);WENN(E15<0;0;E15)))*E82","FT=WENN(F13+F35>=F15;F13+F35;MIN(F13+F35+SUMME(F20;F22;F23;F24;F25;F26;F27;F28;F29;F30;F31;F32;F33;F34);WENN(F15<0;0;F15)))*F82","FT=WENN(G13+G35>=G15;G13+G35;MIN(G13+G35+SUMME(G20;G22;G23;G24;G25;G26;G27;G28;G29;G30;G31;G32;G33;G34);WENN(G15<0;0;G15)))*G82","FT=WENN(H13+H35>=H15;H13+H35;MIN(H13+H35+SUMME(H20;H22;H23;H24;H25;H26;H27;H28;H29;H30;H31;H32;H33;H34);WENN(H15<0;0;H15)))*H82","FT=WENN(I13+I35>=I15;I13+I35;MIN(I13+I35+SUMME(I20;I22;I23;I24;I25;I26;I27;I28;I29;I30;I31;I32;I33;I34);WENN(I15<0;0;I15)))*I82","FT=WENN(J13+J35>=J15;J13+J35;MIN(J13+J35+SUMME(J20;J22;J23;J24;J25;J26;J27;J28;J29;J30;J31;J32;J33;J34);WENN(J15<0;0;J15)))*J82","FT=WENN(K13+K35>=K15;K13+K35;MIN(K13+K35+SUMME(K20;K22;K23;K24;K25;K26;K27;K28;K29;K30;K31;K32;K33;K34);WENN(K15<0;0;K15)))*K82","FT=WENN(L13+L35>=L15;L13+L35;MIN(L13+L35+SUMME(L20;L22;L23;L24;L25;L26;L27;L28;L29;L30;L31;L32;L33;L34);WENN(L15<0;0;L15)))*L82","FT=WENN(M13+M35>=M15;M13+M35;MIN(M13+M35+SUMME(M20;M22;M23;M24;M25;M26;M27;M28;M29;M30;M31;M32;M33;M34);WENN(M15<0;0;M15)))*M82","FT=WENN(N13+N35>=N15;N13+N35;MIN(N13+N35+SUMME(N20;N22;N23;N24;N25;N26;N27;N28;N29;N30;N31;N32;N33;N34);WENN(N15<0;0;N15)))*N82","FT=WENN(O13+O35>=O15;O13+O35;MIN(O13+O35+SUMME(O20;O22;O23;O24;O25;O26;O27;O28;O29;O30;O31;O32;O33;O34);WENN(O15<0;0;O15)))*O82","FT=WENN(P13+P35>=P15;P13+P35;MIN(P13+P35+SUMME(P20;P22;P23;P24;P25;P26;P27;P28;P29;P30;P31;P32;P33;P34);WENN(P15<0;0;P15)))*P82","FT=WENN(Q13+Q35>=Q15;Q13+Q35;MIN(Q13+Q35+SUMME(Q20;Q22;Q23;Q24;Q25;Q26;Q27;Q28;Q29;Q30;Q31;Q32;Q33;Q34);WENN(Q15<0;0;Q15)))*Q82","FT=WENN(R13+R35>=R15;R13+R35;MIN(R13+R35+SUMME(R20;R22;R23;R24;R25;R26;R27;R28;R29;R30;R31;R32;R33;R34);WENN(R15<0;0;R15)))*R82","FT=WENN(S13+S35>=S15;S13+S35;MIN(S13+S35+SUMME(S20;S22;S23;S24;S25;S26;S27;S28;S29;S30;S31;S32;S33;S34);WENN(S15<0;0;S15)))*S82","FT=WENN(T13+T35>=T15;T13+T35;MIN(T13+T35+SUMME(T20;T22;T23;T24;T25;T26;T27;T28;T29;T30;T31;T32;T33;T34);WENN(T15<0;0;T15)))*T82","FT=WENN(U13+U35>=U15;U13+U35;MIN(U13+U35+SUMME(U20;U22;U23;U24;U25;U26;U27;U28;U29;U30;U31;U32;U33;U34);WENN(U15<0;0;U15)))*U82","FT=WENN(V13+V35>=V15;V13+V35;MIN(V13+V35+SUMME(V20;V22;V23;V24;V25;V26;V27;V28;V29;V30;V31;V32;V33;V34);WENN(V15<0;0;V15)))*V82","FT=WENN(W13+W35>=W15;W13+W35;MIN(W13+W35+SUMME(W20;W22;W23;W24;W25;W26;W27;W28;W29;W30;W31;W32;W33;W34);WENN(W15<0;0;W15)))*W82","FT=WENN(X13+X35>=X15;X13+X35;MIN(X13+X35+SUMME(X20;X22;X23;X24;X25;X26;X27;X28;X29;X30;X31;X32;X33;X34);WENN(X15<0;0;X15)))*X82","FT=WENN(Y13+Y35>=Y15;Y13+Y35;MIN(Y13+Y35+SUMME(Y20;Y22;Y23;Y24;Y25;Y26;Y27;Y28;Y29;Y30;Y31;Y32;Y33;Y34);WENN(Y15<0;0;Y15)))*Y82","FT=WENN(Z13+Z35>=Z15;Z13+Z35;MIN(Z13+Z35+SUMME(Z20;Z22;Z23;Z24;Z25;Z26;Z27;Z28;Z29;Z30;Z31;Z32;Z33;Z34);WENN(Z15<0;0;Z15)))*Z82","FT=WENN(AA13+AA35>=AA15;AA13+AA35;MIN(AA13+AA35+SUMME(AA20;AA22;AA23;AA24;AA25;AA26;AA27;AA28;AA29;AA30;AA31;AA32;AA33;AA34);WENN(AA15<0;0;AA15)))*AA82","FT=WENN(AB13+AB35>=AB15;AB13+AB35;MIN(AB13+AB35+SUMME(AB20;AB22;AB23;AB24;AB25;AB26;AB27;AB28;AB29;AB30;AB31;AB32;AB33;AB34);WENN(AB15<0;0;AB15)))*AB82","FT=WENN(AC13+AC35>=AC15;AC13+AC35;MIN(AC13+AC35+SUMME(AC20;AC22;AC23;AC24;AC25;AC26;AC27;AC28;AC29;AC30;AC31;AC32;AC33;AC34);WENN(AC15<0;0;AC15)))*AC82","FT=WENN(AD13+AD35>=AD15;AD13+AD35;MIN(AD13+AD35+SUMME(AD20;AD22;AD23;AD24;AD25;AD26;AD27;AD28;AD29;AD30;AD31;AD32;AD33;AD34);WENN(AD15<0;0;AD15)))*AD82","FT=WENN(AE13+AE35>=AE15;AE13+AE35;MIN(AE13+AE35+SUMME(AE20;AE22;AE23;AE24;AE25;AE26;AE27;AE28;AE29;AE30;AE31;AE32;AE33;AE34);WENN(AE15<0;0;AE15)))*AE82","FT=WENN(AF13+AF35>=AF15;AF13+AF35;MIN(AF13+AF35+SUMME(AF20;AF22;AF23;AF24;AF25;AF26;AF27;AF28;AF29;AF30;AF31;AF32;AF33;AF34);WENN(AF15<0;0;AF15)))*AF82","FT=WENN(AG13+AG35>=AG15;AG13+AG35;MIN(AG13+AG35+SUMME(AG20;AG22;AG23;AG24;AG25;AG26;AG27;AG28;AG29;AG30;AG31;AG32;AG33;AG34);WENN(AG15<0;0;AG15)))*AG82","FT=WENN(AH13+AH35>=AH15;AH13+AH35;MIN(AH13+AH35+SUMME(AH20;AH22;AH23;AH24;AH25;AH26;AH27;AH28;AH29;AH30;AH31;AH32;AH33;AH34);WENN(AH15<0;0;AH15)))*AH82"]
[null,null,null,"FT=24*(D6-D5+D8-D7+D10-D9+D12-D11)*D88","FT=24*(E6-E5+E8-E7+E10-E9+E12-E11)*E88","FT=24*(F6-F5+F8-F7+F10-F9+F12-F11)*F88","FT=24*(G6-G5+G8-G7+G10-G9+G12-G11)*G88","FT=24*(H6-H5+H8-H7+H10-H9+H12-H11)*H88","FT=24*(I6-I5+I8-I7+I10-I9+I12-I11)*I88","FT=24*(J6-J5+J8-J7+J10-J9+J12-J11)*J88","FT=24*(K6-K5+K8-K7+K10-K9+K12-K11)*K88","FT=24*(L6-L5+L8-L7+L10-L9+L12-L11)*L88","FT=24*(M6-M5+M8-M7+M10-M9+M12-M11)*M88","FT=24*(N6-N5+N8-N7+N10-N9+N12-N11)*N88","FT=24*(O6-O5+O8-O7+O10-O9+O12-O11)*O88","FT=24*(P6-P5+P8-P7+P10-P9+P12-P11)*P88","FT=24*(Q6-Q5+Q8-Q7+Q10-Q9+Q12-Q11)*Q88","FT=24*(R6-R5+R8-R7+R10-R9+R12-R11)*R88","FT=24*(S6-S5+S8-S7+S10-S9+S12-S11)*S88","FT=24*(T6-T5+T8-T7+T10-T9+T12-T11)*T88","FT=24*(U6-U5+U8-U7+U10-U9+U12-U11)*U88","FT=24*(V6-V5+V8-V7+V10-V9+V12-V11)*V88","FT=24*(W6-W5+W8-W7+W10-W9+W12-W11)*W88","FT=24*(X6-X5+X8-X7+X10-X9+X12-X11)*X88","FT=24*(Y6-Y5+Y8-Y7+Y10-Y9+Y12-Y11)*Y88","FT=24*(Z6-Z5+Z8-Z7+Z10-Z9+Z12-Z11)*Z88","FT=24*(AA6-AA5+AA8-AA7+AA10-AA9+AA12-AA11)*AA88","FT=24*(AB6-AB5+AB8-AB7+AB10-AB9+AB12-AB11)*AB88","FT=24*(AC6-AC5+AC8-AC7+AC10-AC9+AC12-AC11)*AC88","FT=24*(AD6-AD5+AD8-AD7+AD10-AD9+AD12-AD11)*AD88","FT=24*(AE6-AE5+AE8-AE7+AE10-AE9+AE12-AE11)*AE88","FT=24*(AF6-AF5+AF8-AF7+AF10-AF9+AF12-AF11)*AF88","FT=24*(AG6-AG5+AG8-AG7+AG10-AG9+AG12-AG11)*AG88","FT=24*(AH6-AH5+AH8-AH7+AH10-AH9+AH12-AH11)*AH88"]
[null,null,null,"FT=ODER(D14>0;D21>0)*1","FT=ODER(E14>0;E21>0)*1","FT=ODER(F14>0;F21>0)*1","FT=ODER(G14>0;G21>0)*1","FT=ODER(H14>0;H21>0)*1","FT=ODER(I14>0;I21>0)*1","FT=ODER(J14>0;J21>0)*1","FT=ODER(K14>0;K21>0)*1","FT=ODER(L14>0;L21>0)*1","FT=ODER(M14>0;M21>0)*1","FT=ODER(N14>0;N21>0)*1","FT=ODER(O14>0;O21>0)*1","FT=ODER(P14>0;P21>0)*1","FT=ODER(Q14>0;Q21>0)*1","FT=ODER(R14>0;R21>0)*1","FT=ODER(S14>0;S21>0)*1","FT=ODER(T14>0;T21>0)*1","FT=ODER(U14>0;U21>0)*1","FT=ODER(V14>0;V21>0)*1","FT=ODER(W14>0;W21>0)*1","FT=ODER(X14>0;X21>0)*1","FT=ODER(Y14>0;Y21>0)*1","FT=ODER(Z14>0;Z21>0)*1","FT=ODER(AA14>0;AA21>0)*1","FT=ODER(AB14>0;AB21>0)*1","FT=ODER(AC14>0;AC21>0)*1","FT=ODER(AD14>0;AD21>0)*1","FT=ODER(AE14>0;AE21>0)*1","FT=ODER(AF14>0;AF21>0)*1","FT=ODER(AG14>0;AG21>0)*1","FT=ODER(AH14>0;AH21>0)*1"]
[null,null,null,{"$f":"ABS(\"FT\"&_xlfn.FORMULATEXT(D14)<>D45)","v":0},{"$f":"ABS(\"FT\"&_xlfn.FORMULATEXT(E14)<>E45)","v":0},0,0,0,0,0,0,0,0,0,0,0,0,0,0,0,0,0,0,0,0,0,0,0,0,0,0,0,0,0]
[null,null,null,{"$f":"ABS(\"FT\"&_xlfn.FORMULATEXT(D13)<>D46)","v":0},{"$f":"ABS(\"FT\"&_xlfn.FORMULATEXT(E13)<>E46)","v":0},0,0,0,0,0,0,0,0,0,0,0,0,0,0,0,0,0,0,0,0,0,0,0,0,0,0,0,0,0]
[null,null,null,{"$f":"ABS(\"FT\"&_xlfn.FORMULATEXT(D80)<>D47)","v":0},{"$f":"ABS(\"FT\"&_xlfn.FORMULATEXT(E80)<>E47)","v":0},0,0,0,0,0,0,0,0,0,0,0,0,0,0,0,0,0,0,0,0,0,0,0,0,0,0,0,0,0]
[null,null,null,{"$f":"ABS(ISERROR(D37))","v":0},{"$f":"ABS(ISERROR(E37))","v":0},0,0,0,0,0,0,0,0,0,0,0,0,0,0,0,0,0,0,0,0,0,0,0,0,0,0,0,0,0]
[null,null,null,{"$f":"SUM(D48:D51)","v":0},{"$f":"SUM(E48:E51)","v":0},0,0,0,0,0,0,0,0,0,0,0,0,0,0,0,0,0,0,0,0,0,0,0,0,0,0,0,0,0,null,null,null,null,"Formel defekt",{"$f":"SUM(D52:AH52)","v":0}]
[]
[]
[]
[]
[]
[]
[]
[]
[]
[]
[]
[]
[]
[]
[]
[]
[]
[]
[]
[]
[]
[]
[]
[]
[null,"HT_Naz-Kopie",{"$f":"HT_NAZ","v":8.4}]
[null,"Heute:",{"$f":"SL_BisDatum","v":"2024-02-02"}]
[null,null,"Reguläre Tage ausgefüllt",{"$f":"((D80*D81)=1)*1","v":0},{"$f":"((E80*E81)=1)*1","v":0},0,0,0,0,0,0,0,0,0,0,0,0,0,0,0,0,0,0,0,0,0,0,0,0,0,0,0,0,0]
[null,null,"Arbeitstage ausgefüllt",{"$f":"OR(D14>0,D21>0)*1","v":0},{"$f":"OR(E14>0,E21>0)*1","v":0},0,0,0,0,0,0,0,0,0,0,0,0,0,0,0,0,0,0,0,0,0,0,0,0,0,0,0,0,0]
[null,null,"Arbeitstage wenn BG>0%",{"$f":"IFERROR(VLOOKUP(D3,VSA_Kalender,22),0)","v":0},0,0,0,0,0,0,0,0,0,0,0,0,0,0,0,0,0,0,0,0,0,0,0,0,0,0,0,0,0,0]
[null,null,"Der BG beträgt mehr als 0%",{"$f":"IF(D4=\"\",0,ABS(VLOOKUP(D3,VSA_Kalender,13,FALSE)>0))","v":1},1,1,1,1,1,1,1,1,1,1,1,1,1,1,1,1,1,1,1,1,1,1,1,1,1,1,1,1,1,0]
[null,null,"(Ja: 1, Nein: 0)",{"$f":"SUM(D81:AH81)","v":0},"Total Tage bei BG>0%",null,null,{"$f":"SUM(D80:AH80)","v":0},"Total Tage ausgefüllt",null,null,{"$f":"SUM(D79:AH79)","v":0},"Total reguläre Tage ausgefüllt"]
[]
[null,null,"Tag des Monats",{"$f":"D4","v":1},2,3,4,5,6,7,8,9,10,11,12,13,14,15,16,17,18,19,20,21,22,23,24,25,26,27,28,29,30,""]
[null,null,"Ist Arbeitsbereich",{"$f":"IFERROR(ABS(WEEKDAY(D3,2)<6),0)","v":1},1,1,1,1,0,0,1,1,1,1,1,0,0,1,1,1,1,1,0,0,1,1,1,1,1,0,0,1,1,0]
[null,null,"Maximaler Fehler",{"$f":"MAX(D100:D107,D98,D134)","v":0},{"$f":"MAX(E100:E107,E98,E134)","v":0},0,0,0,0,0,0,0,0,0,0,0,0,0,0,0,0,0,0,0,0,0,0,0,0,0,0,0,0,0]
[null,null,"Wird die Präsenzzeit angezeigt?",{"$f":"IF(D87=0,1,0)","v":1},{"$f":"IF(E87=0,1,0)","v":1},1,1,1,1,1,1,1,1,1,1,1,1,1,1,1,1,1,1,1,1,1,1,1,1,1,1,1,1,1]
[]
[null,null,"Gruppenfehler 1",{"$f":"IF(AND(D6-D5=0,COUNTA(D7:D12)>0),1,0)","v":0},0,0,0,0,0,0,0,0,0,0,0,0,0,0,0,0,0,0,0,0,0,0,0,0,0,0,0,0,0,0]
[null,"Gruppenfehler","(aus)",{"$f":"D90","v":0},0,0,0,0,0,0,0,0,0,0,0,0,0,0,0,0,0,0,0,0,0,0,0,0,0,0,0,0,0,0]
[null,null,"Gruppenfehler 2",{"$f":"IF(AND(D8-D7=0,COUNTA(D9:D12)>0),1,0)","v":0},0,0,0,0,0,0,0,0,0,0,0,0,0,0,0,0,0,0,0,0,0,0,0,0,0,0,0,0,0,0]
[null,null,"(aus)",{"$f":"D92","v":0},0,0,0,0,0,0,0,0,0,0,0,0,0,0,0,0,0,0,0,0,0,0,0,0,0,0,0,0,0,0]
[null,null,"Gruppenfehler 3",{"$f":"IF(AND(D10-D9=0,COUNTA(D11:D12)>0),1,0)","v":0},0,0,0,0,0,0,0,0,0,0,0,0,0,0,0,0,0,0,0,0,0,0,0,0,0,0,0,0,0,0]
[null,null,"(aus)",{"$f":"D94","v":0},0,0,0,0,0,0,0,0,0,0,0,0,0,0,0,0,0,0,0,0,0,0,0,0,0,0,0,0,0,0]
[null,null,"leer"]
[null,null,"leer"]
[null,null,"Genereller Gruppenfehler",{"$f":"MAX(D90:D95)","v":0},0,0,0,0,0,0,0,0,0,0,0,0,0,0,0,0,0,0,0,0,0,0,0,0,0,0,0,0,0,0]
[]
[null,null,"Ein1",{"$f":"IF(AND(D109=0,D110>0),1,0)","v":0},{"$f":"IF(AND(E109=0,E110>0),1,0)","v":0},0,0,0,0,0,0,0,0,0,0,0,0,0,0,0,0,0,0,0,0,0,0,0,0,0,0,0,0,0]
[null,null,"Aus1",{"$f":"IF(AND(D110>0,D110<D109),3,IF(AND(D109>0,D110=0),1,0))*D$86","v":0},{"$f":"IF(AND(E110>0,E110<E109),3,IF(AND(E109>0,E110=0),1,0))*E$86","v":0},0,0,0,0,0,0,0,0,0,0,0,0,0,0,0,0,0,0,0,0,0,0,0,0,0,0,0,0,0]
[null,null,"Ein2",{"$f":"IF(AND(D111>0,D111<D110),3,IF(AND(D111=0,D112>0),1,0))*D$86","v":0},0,0,0,0,0,0,0,0,0,0,0,0,0,0,0,0,0,0,0,0,0,0,0,0,0,0,0,0,0,0]
[null,null,"Aus2",{"$f":"IF(AND(D112>0,D112<D111),3,IF(AND(D111>0,D112=0),1,0))*D$86","v":0},{"$f":"IF(AND(E112>0,E112<E111),3,IF(AND(E111>0,E112=0),1,0))*E$86","v":0},0,0,0,0,0,0,0,0,0,0,0,0,0,0,0,0,0,0,0,0,0,0,0,0,0,0,0,0,0]
[null,"Zellenfehler","Ein3",{"$f":"IF(AND(D113>0,D113<D112),3,IF(AND(D113=0,D114>0),1,0))*D$86","v":0},{"$f":"IF(AND(E113>0,E113<E112),3,IF(AND(E113=0,E114>0),1,0))*E$86","v":0},0,0,0,0,0,0,0,0,0,0,0,0,0,0,0,0,0,0,0,0,0,0,0,0,0,0,0,0,0]
[null,null,"Aus3",{"$f":"IF(AND(D114>0,D114<D113),3,IF(AND(D113>0,D114=0),1,0))*D$86","v":0},{"$f":"IF(AND(E114>0,E114<E113),3,IF(AND(E113>0,E114=0),1,0))*E$86","v":0},0,0,0,0,0,0,0,0,0,0,0,0,0,0,0,0,0,0,0,0,0,0,0,0,0,0,0,0,0]
[null,null,"Ein4",{"$f":"IF(AND(D115>0,D115<D114),3,IF(AND(D115=0,D116>0),1,0))*D$86","v":0},{"$f":"IF(AND(E115>0,E115<E114),3,IF(AND(E115=0,E116>0),1,0))*E$86","v":0},0,0,0,0,0,0,0,0,0,0,0,0,0,0,0,0,0,0,0,0,0,0,0,0,0,0,0,0,0]
[null,null,"Aus4",{"$f":"IF(AND(D116>0,D116<D115),3,IF(AND(D115>0,D116=0),1,0))*D$86","v":0},{"$f":"IF(AND(E116>0,E116<E115),3,IF(AND(E115>0,E116=0),1,0))*E$86","v":0},0,0,0,0,0,0,0,0,0,0,0,0,0,0,0,0,0,0,0,0,0,0,0,0,0,0,0,0,0]
[]
[null,null,"Ein1",{"$f":"ROUND(D5*24,2)","v":0},0,0,0,0,0,0,0,0,0,0,0,0,0,0,0,0,0,0,0,0,0,0,0,0,0,0,0,0,0,0]
[null,null,"Aus1",0,0,0,0,0,0,0,0,0,0,0,0,0,0,0,0,0,0,0,0,0,0,0,0,0,0,0,0,0,0,0]
[null,"Zeiten dezimal gewandelt","Ein2",0,0,0,0,0,0,0,0,0,0,0,0,0,0,0,0,0,0,0,0,0,0,0,0,0,0,0,0,0,0,0]
[null,null,"Aus2",0,0,0,0,0,0,0,0,0,0,0,0,0,0,0,0,0,0,0,0,0,0,0,0,0,0,0,0,0,0,0]
[null,null,"Ein3",0,0,0,0,0,0,0,0,0,0,0,0,0,0,0,0,0,0,0,0,0,0,0,0,0,0,0,0,0,0,0]
[null,null,"Aus3",0,0,0,0,0,0,0,0,0,0,0,0,0,0,0,0,0,0,0,0,0,0,0,0,0,0,0,0,0,0,0]
[null,null,"Ein4",0,0,0,0,0,0,0,0,0,0,0,0,0,0,0,0,0,0,0,0,0,0,0,0,0,0,0,0,0,0,0]
[null,null,"Aus4",0,0,0,0,0,0,0,0,0,0,0,0,0,0,0,0,0,0,0,0,0,0,0,0,0,0,0,0,0,0,0]
[]
[null,"Pausenfehler","Gruppe1",{"$f":"IF(OR(D109=\"\",D110=\"\"),0,D110-D109)","v":0},{"$f":"IF(OR(E109=\"\",E110=\"\"),0,E110-E109)","v":0},0,0,0,0,0,0,0,0,0,0,0,0,0,0,0,{"$f":"IF(OR(U109=\"\",U110=\"\"),0,U110-U109)","v":0},{"$f":"IF(OR(V109=\"\",V110=\"\"),0,V110-V109)","v":0},0,0,0,0,0,0,0,0,0,0,0,0]
[null,null,"Gruppe2",{"$f":"IF(OR(D111=\"\",D112=\"\"),0,D112-D111)","v":0},{"$f":"IF(OR(E111=\"\",E112=\"\"),0,E112-E111)","v":0},0,0,0,0,0,0,0,0,0,0,0,0,0,0,0,{"$f":"IF(OR(U111=\"\",U112=\"\"),0,U112-U111)","v":0},{"$f":"IF(OR(V111=\"\",V112=\"\"),0,V112-V111)","v":0},0,0,0,0,0,0,0,0,0,0,0,0]
[null,null,"Gruppe3",{"$f":"IF(OR(D113=\"\",D114=\"\"),0,D114-D113)","v":0},{"$f":"IF(OR(E113=\"\",E114=\"\"),0,E114-E113)","v":0},0,0,0,0,0,0,0,0,0,0,0,0,0,0,0,{"$f":"IF(OR(U113=\"\",U114=\"\"),0,U114-U113)","v":0},{"$f":"IF(OR(V113=\"\",V114=\"\"),0,V114-V113)","v":0},0,0,0,0,0,0,0,0,0,0,0,0]
[null,null,"Gruppe4",{"$f":"IF(OR(D115=\"\",D116=\"\"),0,D116-D115)","v":0},{"$f":"IF(OR(E115=\"\",E116=\"\"),0,E116-E115)","v":0},0,0,0,0,0,0,0,0,0,0,0,0,0,0,0,{"$f":"IF(OR(U115=\"\",U116=\"\"),0,U116-U115)","v":0},{"$f":"IF(OR(V115=\"\",V116=\"\"),0,V116-V115)","v":0},0,0,0,0,0,0,0,0,0,0,0,0]
[]
[null,null,"Pause12",{"$f":"IF(OR(D110=\"\",D111=\"\"),0,D111-D110)","v":0},{"$f":"IF(OR(E110=\"\",E111=\"\"),0,E111-E110)","v":0},0,0,0,0,0,0,0,0,0,0,0,0,0,0,0,{"$f":"IF(OR(U110=\"\",U111=\"\"),0,U111-U110)","v":0},{"$f":"IF(OR(V110=\"\",V111=\"\"),0,V111-V110)","v":0},0,0,0,0,0,0,0,0,0,0,0,0]
[null,null,"Pause23",{"$f":"IF(OR(D112=\"\",D113=\"\"),0,D113-D112)","v":0},{"$f":"IF(OR(E112=\"\",E113=\"\"),0,E113-E112)","v":0},0,0,0,0,0,0,0,0,0,0,0,0,0,0,0,{"$f":"IF(OR(U112=\"\",U113=\"\"),0,U113-U112)","v":0},{"$f":"IF(OR(V112=\"\",V113=\"\"),0,V113-V112)","v":0},0,0,0,0,0,0,0,0,0,0,0,0]
[null,null,"Pause34",{"$f":"IF(OR(D114=\"\",D115=\"\"),0,D115-D114)","v":0},{"$f":"IF(OR(E114=\"\",E115=\"\"),0,E115-E114)","v":0},0,0,0,0,0,0,0,0,0,0,0,0,0,0,0,{"$f":"IF(OR(U114=\"\",U115=\"\"),0,U115-U114)","v":0},{"$f":"IF(OR(V114=\"\",V115=\"\"),0,V115-V114)","v":0},0,0,0,0,0,0,0,0,0,0,0,0]
[]
[null,null,"Kum12",{"$f":"IF(D123>=0.5,0,D118+D119)","v":0},{"$f":"IF(E123>=0.5,0,E118+E119)","v":0},0,0,0,0,0,0,0,0,0,0,0,0,0,0,0,{"$f":"IF(U123>=0.5,0,U118+U119)","v":0},{"$f":"IF(V123>=0.5,0,V118+V119)","v":0},0,0,0,0,0,0,0,0,0,0,0,0]
[null,null,"Kum123",{"$f":"IF(OR(D123>=0.5,D124>=0.5),0,D118+D119+D120)","v":0},{"$f":"IF(OR(E123>=0.5,E124>=0.5),0,E118+E119+E120)","v":0},0,0,0,0,0,0,0,0,0,0,0,0,0,0,0,{"$f":"IF(OR(U123>=0.5,U124>=0.5),0,U118+U119+U120)","v":0},{"$f":"IF(OR(V123>=0.5,V124>=0.5),0,V118+V119+V120)","v":0},0,0,0,0,0,0,0,0,0,0,0,0]
[null,null,"Kum1234",{"$f":"IF(OR(D123>=0.5,D124>=0.5,D125>=0.5),0,D118+D119+D120+D121)","v":0},{"$f":"IF(OR(E123>=0.5,E124>=0.5,E125>=0.5),0,E118+E119+E120+E121)","v":0},0,0,0,0,0,0,0,0,0,0,0,0,0,0,0,{"$f":"IF(OR(U123>=0.5,U124>=0.5,U125>=0.5),0,U118+U119+U120+U121)","v":0},{"$f":"IF(OR(V123>=0.5,V124>=0.5,V125>=0.5),0,V118+V119+V120+V121)","v":0},0,0,0,0,0,0,0,0,0,0,0,0]
[null,null,"Kum23",{"$f":"IF(D124>=0.5,0,D119+D120)","v":0},{"$f":"IF(E124>=0.5,0,E119+E120)","v":0},0,0,0,0,0,0,0,0,0,0,0,0,0,0,0,{"$f":"IF(U124>=0.5,0,U119+U120)","v":0},{"$f":"IF(V124>=0.5,0,V119+V120)","v":0},0,0,0,0,0,0,0,0,0,0,0,0]
[null,null,"Kum234",{"$f":"IF(OR(D124>=0.5,D125>=0.5),0,D119+D120+D121)","v":0},{"$f":"IF(OR(E124>=0.5,E125>=0.5),0,E119+E120+E121)","v":0},0,0,0,0,0,0,0,0,0,0,0,0,0,0,0,{"$f":"IF(OR(U124>=0.5,U125>=0.5),0,U119+U120+U121)","v":0},{"$f":"IF(OR(V124>=0.5,V125>=0.5),0,V119+V120+V121)","v":0},0,0,0,0,0,0,0,0,0,0,0,0]
[null,null,"Kum34",{"$f":"IF(D125>=0.5,0,D120+D121)","v":0},{"$f":"IF(E125>=0.5,0,E120+E121)","v":0},0,0,0,0,0,0,0,0,0,0,0,0,0,0,0,{"$f":"IF(U125>=0.5,0,U120+U121)","v":0},{"$f":"IF(V125>=0.5,0,V120+V121)","v":0},0,0,0,0,0,0,0,0,0,0,0,0]
[]
[null,null,"Pausenfehler-Code",{"$f":"IF(MAX(D118:D121,D127:D132)>6,2,0)","v":0},{"$f":"IF(MAX(E118:E121,E127:E132)>6,2,0)","v":0},0,0,0,0,0,0,0,0,0,0,0,0,0,0,0,0,0,0,0,0,0,0,0,0,0,0,0,0,0]

{"sheet":"Mai","index":10,"n_rows":134,"n_cols":45,"rows_kept":134,"cut":false,"hidden":true,"merged":[[11,34,12,35]]}
[5,{"$f":"DATEVALUE(\"1.\"&A1&\".\"&SL_Jahr)","v":"2024-05-01"},{"$f":"SL_Jahr","v":2024},{"$f":"B_Gde","v":"Gde:"},{"$f":"SL_Gemeinde","v":0},null,null,null,null,null,null,null,null,null,null,null,null,null,null,{"$f":"B_Schule","v":"Schule:"},{"$f":"SL_Schule","v":0},null,null,null,null,null,null,null,null,null,null,null,null,null,null,null,null,null,"Abschluss-Teilbedingungen:"]
[{"$f":"VLOOKUP(A1,Monatsenden,2)","v":45443},{"$f":"B_Bg","v":"BG:"},{"$f":"VLOOKUP(B1,VSA_Kalender,13)","v":1},{"$f":"B_Name","v":"Name:"},{"$f":"SL_Name","v":0},null,null,null,null,null,null,null,null,null,null,null,null,null,null,null,null,null,null,null,null,null,null,null,null,null,null,null,null,null,null,null,null,null,"Regel ok",{"$f":"(AN14>=AN15)","v":false},"Nicht Relevant",{"$f":"D83=0","v":true},-1,{"$f":"IF(AP2=TRUE,AQ2,0)","v":-1},"Nicht Relevant"]
[null,{"$f":"Zerf_Version & \" \" & Zerf_T","v":"Version VSA 1.06 "},null,{"$f":"DATE($C$1,MONTH($B$1),D$4)","v":"2024-05-01"},{"$f":"DATE($C$1,MONTH($B$1),E$4)","v":"2024-05-02"},"2024-05-03","2024-05-04","2024-05-05","2024-05-06","2024-05-07","2024-05-08","2024-05-09","2024-05-10","2024-05-11","2024-05-12","2024-05-13","2024-05-14","2024-05-15","2024-05-16","2024-05-17","2024-05-18","2024-05-19","2024-05-20","2024-05-21","2024-05-22","2024-05-23","2024-05-24","2024-05-25","2024-05-26","2024-05-27","2024-05-28",{"$f":"IF(MONTH(DATE($C$1,MONTH($B$1),AF$41))>MONTH($B$1),\"\",DATE($C$1,MONTH($B$1),AF$4))","v":"2024-05-29"},{"$f":"IF(MONTH(DATE($C$1,MONTH($B$1),AG$41))>MONTH($B$1),\"\",DATE($C$1,MONTH($B$1),AG$4))","v":"2024-05-30"},{"$f":"IF(MONTH(DATE($C$1,MONTH($B$1),AH$41))>MONTH($B$1),\"\",DATE($C$1,MONTH($B$1),AH$4))","v":"2024-05-31"},null,null,null,null,"Spalten ok",{"$f":"(L83>=D83)","v":true},"Entsperrt",false,1,{"$f":"AP3*AQ3","v":0},"Entsperrt"]
[null,{"$f":"IF(VSATestModus=TRUE(),\"VSA-Modus!\",\"\")","v":""},{"$f":"IF(AN52>0,\"DEFEKT\",\"\")","v":""},{"$f":"IF(MONTH(DATE($C$1,MONTH($B$1),D$41))>MONTH($B$1),\"\",D41)","v":1},2,3,4,5,6,7,8,9,10,11,12,13,14,15,16,17,18,19,20,21,22,23,24,25,26,27,28,{"$f":"IF(MONTH(DATE($C$1,MONTH($B$1),AF$41))>MONTH($B$1),\"\",AF41)","v":29},{"$f":"IF(MONTH(DATE($C$1,MONTH($B$1),AG$41))>MONTH($B$1),\"\",AG41)","v":30},{"$f":"IF(MONTH(DATE($C$1,MONTH($B$1),AH$41))>MONTH($B$1),\"\",AH41)","v":31},null,null,null,null,"Keine Fehler",{"$f":"(SUM(D87:AH87)=0)","v":true},"Geändert",false,2,{"$f":"AP4*AQ4","v":0},"Geändert"]
[null,"     Ein   >>>",null,null,null,null,null,null,null,null,null,null,null,null,null,null,null,null,null,null,null,null,null,null,null,null,null,null,null,null,null,null,null,null,null,null,null,null,"Keine Hand",{"$f":"(AI12=\"\")","v":true},"Sperre",{"$f":"AS11=2","v":false},3,{"$f":"NOT(AP6)*AQ5","v":3},"Eingaben vornehmen"]
[null,"<<<   Aus     ",null,null,null,null,null,null,null,null,null,null,null,null,null,null,null,null,null,null,null,null,null,null,null,null,null,null,null,null,null,null,null,null,null,null,null,null,null,null,"Abschliessbar 1",{"$f":"AND(OR(AN2,AN3),AN4,AN5,NOT(AP7),NOT(AP2))","v":false},4,{"$f":"AND(NOT(OR(AP3,AP4)),AP6)*AQ6","v":0},"Abschliessbar 1"]
[null,"     Ein   >>>",null,null,null,null,null,null,null,null,null,null,null,null,null,null,null,null,null,null,null,null,null,null,null,null,null,null,null,null,null,null,null,null,null,null,null,null,null,null,"Abgeschlossen",false,5,{"$f":"AND(NOT(OR(AP3,AP4)),AP7)*AQ7","v":0},"Abgeschlossen"]
[null,"<<<   Aus     ",null,null,null,null,null,null,null,null,null,null,null,null,null,null,null,null,null,null,null,null,null,null,null,null,null,null,null,null,null,null,null,null,null,null,null,null,null,null,"Für Jahr OK",{"$f":"AND(OR(AP2,AP7),NOT(AP3))","v":true}]
[null,"     Ein   >>>"]
[null,"<<<   Aus     ",null,null,null,null,null,null,null,null,null,null,null,null,null,null,null,null,null,null,null,null,null,null,null,null,null,null,null,null,null,null,null,null,null,null,null,null,null,null,"Statusnummer:",{"$f":"IF(AR2=AQ2,AQ2,MAX(AR2:AR7))","v":-1}]
[null,"     Ein   >>>",null,null,null,null,null,null,null,null,null,null,null,null,null,null,null,null,null,null,null,null,null,null,null,null,null,null,null,null,null,null,null,null,null,null,null,null,"HatDaten:",{"$f":"AND(AP2=FALSE,OR(AP10<>3,COUNTA(D5:AH12,D20:AH35,D39:L40)>0))","v":false},"Statustext:",{"$f":"IFERROR(VLOOKUP(AP10,AR2:AS7,2,FALSE),\"unbekannt\")","v":"Nicht Relevant"},null,null,1]
[null,"<<<   Aus     ",null,null,null,null,null,null,null,null,null,null,null,null,null,null,null,null,null,null,null,null,null,null,null,null,null,null,null,null,null,null,null,null,{"$f":"IF(COUNTIF(D37:AH37,\"I\")>0,\"I\",\"\")","v":""}]
[null,{"$f":"B_PrZeit","v":"Präsenzzeit"},null,{"$f":"24*(D6-D5+D8-D7+D10-D9+D12-D11)*D88","v":0},{"$f":"24*(E6-E5+E8-E7+E10-E9+E12-E11)*E88","v":0},0,0,0,0,0,0,0,0,0,0,0,0,0,0,0,0,0,0,0,0,0,0,0,0,0,0,0,0,0,null,null,null,null,"Anzahl Regeltage:",{"$f":"D83","v":0}]
[null,{"$f":"B_TotalAZist","v":"Total Arbeitszeit (IST)"},null,{"$f":"IF(D13+D35>=D15,D13+D35,MIN(D13+D35+SUM(D20,D22,D23,D24,D25,D26,D27,D28,D29,D30,D31,D32,D33,D34),IF(D15<0,0,D15)))*D82","v":0},0,0,0,0,0,0,0,0,0,0,0,0,0,{"$f":"IF(R13+R35>=R15,R13+R35,MIN(R13+R35+SUM(R20,R22,R23,R24,R25,R26,R27,R28,R29,R30,R31,R32,R33,R34),IF(R15<0,0,R15)))*R82","v":0},{"$f":"IF(S13+S35>=S15,S13+S35,MIN(S13+S35+SUM(S20,S22,S23,S24,S25,S26,S27,S28,S29,S30,S31,S32,S33,S34),IF(S15<0,0,S15)))*S82","v":0},{"$f":"IF(T13+T35>=T15,T13+T35,MIN(T13+T35+SUM(T20,T22,T23,T24,T25,T26,T27,T28,T29,T30,T31,T32,T33,T34),IF(T15<0,0,T15)))*T82","v":0},{"$f":"IF(U13+U35>=U15,U13+U35,MIN(U13+U35+SUM(U20,U22,U23,U24,U25,U26,U27,U28,U29,U30,U31,U32,U33,U34),IF(U15<0,0,U15)))*U82","v":0},0,0,0,0,0,0,0,0,0,0,0,0,0,{"$f":"SUMIF($D$82:$AH$82,1,D14:AH14)","v":0},{"$f":"AI14-AI15","v":27.6},null,null,"Erfasste Regeltage",{"$f":"L83","v":0},{"$f":"AN13-AN14","v":0},"Fehlende Regeltage"]
[null,{"$f":"B_NettoSollAZ","v":"Netto-SOLL-Arbeitszeit"},null,{"$f":"ROUND(D16-D19,2)","v":-8.4},{"$f":"ROUND(E16-E19,2)","v":0},0,0,0,0,0,-2.4,-8.4,0,0,0,0,0,0,0,0,0,0,-8.4,0,0,0,0,0,0,0,0,{"$f":"IF(AF$42=4,0,ROUND(AF16-AF19,2))","v":0},{"$f":"IF(AG$42=4,0,ROUND(AG16-AG19,2))","v":0},0,{"$f":"SUMIF($D$82:$AH$82,1,D15:AH15)","v":-27.6},null,null,null,"Minimum Regeltage",{"$f":"MinRegeltage","v":1},"Ist als Konstante im Blatt \"Intern\" hinterlegt"]
[null,{"$f":"B_BruttoSollAZ","v":"Brutto-SOLL-Arb.zeit"},null,{"$f":"VLOOKUP(D3,VSA_Kalender,16)","v":0},0,0,0,0,0,0,0,0,0,0,0,0,0,0,0,0,0,0,0,0,0,0,0,0,0,0,0,{"$f":"IF(AF$42=4,0,VLOOKUP(AF3,VSA_Kalender,16))","v":0},{"$f":"IF(AG$42=4,0,VLOOKUP(AG3,VSA_Kalender,16))","v":0},{"$f":"IF(AH$42=4,0,VLOOKUP(AH3,VSA_Kalender,16))","v":0},null,null,null,null,"Regel ok","Mind. eigetr. Regeltage erfüllt"]
[null,{"$f":"B_MehrMinder","v":"Mehr-/Minderleistung"},null,{"$f":"(SL_BisDatum>=D3)*ROUND(D14-D15,2)","v":0},0,0,0,0,0,0,0,0,0,0,0,0,0,0,0,0,0,0,0,0,0,0,0,0,0,0,0,0,0,0,{"$f":"B_Total","v":"Total"},{"$f":"B_Vortrag","v":"Vortrag"},null,null,"Spalten ok:","Alle Einträge an Regeltagen ok"]
[null,{"$f":"B_AZSaldo","v":"AZ - Saldo"},{"$f":"VLOOKUP(ROW(),VSA_Uebertrag,$A$1+3)","v":16.8},{"$f":"IFERROR((C18+D17)*(D3<=SL_BisDatum)*VLOOKUP(D3,VSA_Kalender,21,FALSE),0)","v":0},0,0,{"$f":"IFERROR((F18+G17)*(G3<=SL_BisDatum)*VLOOKUP(G3,VSA_Kalender,21,FALSE),0)","v":0},0,0,0,0,0,0,0,0,0,0,0,0,0,0,0,0,0,0,0,0,0,0,0,0,0,0,0,null,{"$f":"SUMIF($D$82:$AH$82,1,D17:AH17)+C18","v":16.8}]
[null,{"$f":"B_FTA","v":"Feiertagsanspruch"},0,{"$f":"VLOOKUP(D3,VSA_Kalender,14)","v":8.4},0,0,0,0,0,0,2.4,8.4,0,0,0,0,0,0,0,0,0,0,8.4,0,0,0,0,0,0,0,0,{"$f":"IF(AF$42=4,0,VLOOKUP(AF3,VSA_Kalender,14))","v":0},{"$f":"IF(AG$42=4,0,VLOOKUP(AG3,VSA_Kalender,14))","v":0},{"$f":"IF(AH$42=4,0,VLOOKUP(AH3,VSA_Kalender,14))","v":0},{"$f":"SUM(D19:AH19)","v":27.6}]
[null,{"$f":"B_Ferien","v":"Ferien"},{"$f":"VLOOKUP(ROW(),VSA_Uebertrag,$A$1+3)","v":0},null,null,null,null,null,null,null,null,null,null,null,null,null,null,null,null,null,null,null,null,null,null,null,null,null,null,null,null,null,null,null,{"$f":"SUMIF($D$82:$AH$82,1,D20:AH20)","v":0},{"$f":"ROUND(C20-AI20,2)","v":0},"Rest"]
[null,{"$f":"B_KompAZ","v":"Kompensation Arbeitstage"},0,null,null,null,null,null,null,null,null,null,null,null,null,null,null,null,null,null,null,null,null,null,null,null,null,null,null,null,null,null,null,null,0,{"$f":"ROUND(A21+C21-AI21,0)","v":0}]
[null,{"$f":"B_Arzt","v":"Arztbesuch"},0,null,null,null,null,null,null,null,null,null,null,null,null,null,null,null,null,null,null,null,null,null,null,null,null,null,null,null,null,null,null,null,0,{"$f":"ROUND(A22+C22+AI22,2)","v":0},"Summen"]
[null,{"$f":"B_Krank","v":"Krankheit"},0,null,null,null,null,null,null,null,null,null,null,null,null,null,null,null,null,null,null,null,null,null,null,null,null,null,null,null,null,null,null,null,0,{"$f":"ROUND(A23+C23+AI23,2)","v":0}]
[null,{"$f":"B_BU","v":"Berufsunfall"},0,null,null,null,null,null,null,null,null,null,null,null,null,null,null,null,null,null,null,null,null,null,null,null,null,null,null,null,null,null,null,null,0,0]
[null,{"$f":"B_NBU","v":"Nichtberufsunfall"},0,null,null,null,null,null,null,null,null,null,null,null,null,null,null,null,null,null,null,null,null,null,null,null,null,null,null,null,null,null,null,null,0,0]
[null,{"$f":"B_MilZiv","v":"Militär / Zivilschutz"},0,null,null,null,null,null,null,null,null,null,null,null,null,null,null,null,null,null,null,null,null,null,null,null,null,null,null,null,null,null,null,null,0,0]
[null,{"$f":"B_UUB","v":"Unbezahlter Urlaub"},0,null,null,null,null,null,null,null,null,null,null,null,null,null,null,null,null,null,null,null,null,null,null,null,null,null,null,null,null,null,null,null,0,{"$f":"ROUND(A27+C27-AI27,2)","v":0},"Rest"]
[null,{"$f":"B_UB","v":"Bezahlter Urlaub"},0,null,null,null,null,null,null,null,null,null,null,null,null,null,null,null,null,null,null,null,null,null,null,null,null,null,null,null,null,null,null,null,0,{"$f":"ROUND(A28+C28-AI28,2)","v":0}]
[null,{"$f":"B_NebenB","v":"Nebenbeschäftigung"},0,null,null,null,null,null,null,null,null,null,null,null,null,null,null,null,null,null,null,null,null,null,null,null,null,null,null,null,null,null,null,null,0,0]
[null,{"$f":"B_DAG","v":"D A G"},0,null,null,null,null,null,null,null,null,null,null,null,null,null,null,null,null,null,null,null,null,null,null,null,null,null,null,null,null,null,null,null,0,0]
[null,{"$f":"B_Divers","v":"Diverses"},0,null,null,null,null,null,null,null,null,null,null,null,null,null,null,null,null,null,null,null,null,null,null,null,null,null,null,null,null,null,null,null,0,0,"Summen"]
[null,{"$f":"B_FamPersErg","v":"Fam./pers. Ereignisse"},0,null,null,null,null,null,null,null,null,null,null,null,null,null,null,null,null,null,null,null,null,null,null,null,null,null,null,null,null,null,null,null,0,0]
[null,{"$f":"B_FZ1","v":"freie Zeile 1"},0,null,null,null,null,null,null,null,null,null,null,null,null,null,null,null,null,null,null,null,null,null,null,null,null,null,null,null,null,null,null,null,0,0]
[null,{"$f":"B_FZ2","v":"freie Zeile 2"},0,null,null,null,null,null,null,null,null,null,null,null,null,null,null,null,null,null,null,null,null,null,null,null,null,null,null,null,null,null,null,null,0,0]
[null,{"$f":"B_WB","v":"Weiterbildung"},0,null,null,null,null,null,null,null,null,null,null,null,null,null,null,null,null,null,null,null,null,null,null,null,null,null,null,null,null,null,null,null,0,0]
[null,{"$f":"B_FEL","v":"frei einsetzbare Lekt."},0,null,null,null,null,null,null,null,null,null,null,null,null,null,null,null,null,null,null,null,null,null,null,null,null,null,null,null,null,null,null,null,{"$f":"SUM(D36:AH36)","v":0},{"$f":"ROUND(C36-AI36,0)","v":0}]
[null,null,null,{"$f":"IF(AND((D13 - D15)+SUM(D20,D22:D34)>0.00001,SUM(D20,D22:D34)>0),\"I\",\"\")","v":""},"","","","","","","","","","","","","","","","","","","","","","","","","","","","","",""]
[null,null,"Visum","Identität:",null,null,null,null,"Datum:",null,"Status:"]
[null,null,"SL"]
[null,null,"VG"]
[null,null,null,1,2,3,4,5,6,7,8,9,10,11,12,13,14,15,16,17,18,19,20,21,22,23,24,25,26,27,28,29,30,31]
[null,null,null,{"$f":"IF(D3=\"\",4,VLOOKUP(D3,VSA_Kalender,18))","v":1},0,0,1,1,0,0,0,1,0,1,1,0,0,0,0,0,1,1,1,0,0,0,0,1,1,0,0,0,0,0]
[]
[null,null,null,{"$f":"IF(D19>0,VLOOKUP(D3,KalFeiertage,6,FALSE),\"\")","v":"Tag der Arbeit"},"","","","","","","Mittwoch vor Auffahrt","Auffahrt","","","","","","","","","","","Pfingstmontag","","","","","","","","","","",""]
[null,null,null,"FT=WENN(D13+D35>=D15;D13+D35;MIN(D13+D35+SUMME(D20;D22;D23;D24;D25;D26;D27;D28;D29;D30;D31;D32;D33;D34);WENN(D15<0;0;D15)))*D82","FT=WENN(E13+E35>=E15;E13+E35;MIN(E13+E35+SUMME(E20;E22;E23;E24;E25;E26;E27;E28;E29;E30;E31;E32;E33;E34);WENN(E15<0;0;E15)))*E82","FT=WENN(F13+F35>=F15;F13+F35;MIN(F13+F35+SUMME(F20;F22;F23;F24;F25;F26;F27;F28;F29;F30;F31;F32;F33;F34);WENN(F15<0;0;F15)))*F82","FT=WENN(G13+G35>=G15;G13+G35;MIN(G13+G35+SUMME(G20;G22;G23;G24;G25;G26;G27;G28;G29;G30;G31;G32;G33;G34);WENN(G15<0;0;G15)))*G82","FT=WENN(H13+H35>=H15;H13+H35;MIN(H13+H35+SUMME(H20;H22;H23;H24;H25;H26;H27;H28;H29;H30;H31;H32;H33;H34);WENN(H15<0;0;H15)))*H82","FT=WENN(I13+I35>=I15;I13+I35;MIN(I13+I35+SUMME(I20;I22;I23;I24;I25;I26;I27;I28;I29;I30;I31;I32;I33;I34);WENN(I15<0;0;I15)))*I82","FT=WENN(J13+J35>=J15;J13+J35;MIN(J13+J35+SUMME(J20;J22;J23;J24;J25;J26;J27;J28;J29;J30;J31;J32;J33;J34);WENN(J15<0;0;J15)))*J82","FT=WENN(K13+K35>=K15;K13+K35;MIN(K13+K35+SUMME(K20;K22;K23;K24;K25;K26;K27;K28;K29;K30;K31;K32;K33;K34);WENN(K15<0;0;K15)))*K82","FT=WENN(L13+L35>=L15;L13+L35;MIN(L13+L35+SUMME(L20;L22;L23;L24;L25;L26;L27;L28;L29;L30;L31;L32;L33;L34);WENN(L15<0;0;L15)))*L82","FT=WENN(M13+M35>=M15;M13+M35;MIN(M13+M35+SUMME(M20;M22;M23;M24;M25;M26;M27;M28;M29;M30;M31;M32;M33;M34);WENN(M15<0;0;M15)))*M82","FT=WENN(N13+N35>=N15;N13+N35;MIN(N13+N35+SUMME(N20;N22;N23;N24;N25;N26;N27;N28;N29;N30;N31;N32;N33;N34);WENN(N15<0;0;N15)))*N82","FT=WENN(O13+O35>=O15;O13+O35;MIN(O13+O35+SUMME(O20;O22;O23;O24;O25;O26;O27;O28;O29;O30;O31;O32;O33;O34);WENN(O15<0;0;O15)))*O82","FT=WENN(P13+P35>=P15;P13+P35;MIN(P13+P35+SUMME(P20;P22;P23;P24;P25;P26;P27;P28;P29;P30;P31;P32;P33;P34);WENN(P15<0;0;P15)))*P82","FT=WENN(Q13+Q35>=Q15;Q13+Q35;MIN(Q13+Q35+SUMME(Q20;Q22;Q23;Q24;Q25;Q26;Q27;Q28;Q29;Q30;Q31;Q32;Q33;Q34);WENN(Q15<0;0;Q15)))*Q82","FT=WENN(R13+R35>=R15;R13+R35;MIN(R13+R35+SUMME(R20;R22;R23;R24;R25;R26;R27;R28;R29;R30;R31;R32;R33;R34);WENN(R15<0;0;R15)))*R82","FT=WENN(S13+S35>=S15;S13+S35;MIN(S13+S35+SUMME(S20;S22;S23;S24;S25;S26;S27;S28;S29;S30;S31;S32;S33;S34);WENN(S15<0;0;S15)))*S82","FT=WENN(T13+T35>=T15;T13+T35;MIN(T13+T35+SUMME(T20;T22;T23;T24;T25;T26;T27;T28;T29;T30;T31;T32;T33;T34);WENN(T15<0;0;T15)))*T82","FT=WENN(U13+U35>=U15;U13+U35;MIN(U13+U35+SUMME(U20;U22;U23;U24;U25;U26;U27;U28;U29;U30;U31;U32;U33;U34);WENN(U15<0;0;U15)))*U82","FT=WENN(V13+V35>=V15;V13+V35;MIN(V13+V35+SUMME(V20;V22;V23;V24;V25;V26;V27;V28;V29;V30;V31;V32;V33;V34);WENN(V15<0;0;V15)))*V82","FT=WENN(W13+W35>=W15;W13+W35;MIN(W13+W35+SUMME(W20;W22;W23;W24;W25;W26;W27;W28;W29;W30;W31;W32;W33;W34);WENN(W15<0;0;W15)))*W82","FT=WENN(X13+X35>=X15;X13+X35;MIN(X13+X35+SUMME(X20;X22;X23;X24;X25;X26;X27;X28;X29;X30;X31;X32;X33;X34);WENN(X15<0;0;X15)))*X82","FT=WENN(Y13+Y35>=Y15;Y13+Y35;MIN(Y13+Y35+SUMME(Y20;Y22;Y23;Y24;Y25;Y26;Y27;Y28;Y29;Y30;Y31;Y32;Y33;Y34);WENN(Y15<0;0;Y15)))*Y82","FT=WENN(Z13+Z35>=Z15;Z13+Z35;MIN(Z13+Z35+SUMME(Z20;Z22;Z23;Z24;Z25;Z26;Z27;Z28;Z29;Z30;Z31;Z32;Z33;Z34);WENN(Z15<0;0;Z15)))*Z82","FT=WENN(AA13+AA35>=AA15;AA13+AA35;MIN(AA13+AA35+SUMME(AA20;AA22;AA23;AA24;AA25;AA26;AA27;AA28;AA29;AA30;AA31;AA32;AA33;AA34);WENN(AA15<0;0;AA15)))*AA82","FT=WENN(AB13+AB35>=AB15;AB13+AB35;MIN(AB13+AB35+SUMME(AB20;AB22;AB23;AB24;AB25;AB26;AB27;AB28;AB29;AB30;AB31;AB32;AB33;AB34);WENN(AB15<0;0;AB15)))*AB82","FT=WENN(AC13+AC35>=AC15;AC13+AC35;MIN(AC13+AC35+SUMME(AC20;AC22;AC23;AC24;AC25;AC26;AC27;AC28;AC29;AC30;AC31;AC32;AC33;AC34);WENN(AC15<0;0;AC15)))*AC82","FT=WENN(AD13+AD35>=AD15;AD13+AD35;MIN(AD13+AD35+SUMME(AD20;AD22;AD23;AD24;AD25;AD26;AD27;AD28;AD29;AD30;AD31;AD32;AD33;AD34);WENN(AD15<0;0;AD15)))*AD82","FT=WENN(AE13+AE35>=AE15;AE13+AE35;MIN(AE13+AE35+SUMME(AE20;AE22;AE23;AE24;AE25;AE26;AE27;AE28;AE29;AE30;AE31;AE32;AE33;AE34);WENN(AE15<0;0;AE15)))*AE82","FT=WENN(AF13+AF35>=AF15;AF13+AF35;MIN(AF13+AF35+SUMME(AF20;AF22;AF23;AF24;AF25;AF26;AF27;AF28;AF29;AF30;AF31;AF32;AF33;AF34);WENN(AF15<0;0;AF15)))*AF82","FT=WENN(AG13+AG35>=AG15;AG13+AG35;MIN(AG13+AG35+SUMME(AG20;AG22;AG23;AG24;AG25;AG26;AG27;AG28;AG29;AG30;AG31;AG32;AG33;AG34);WENN(AG15<0;0;AG15)))*AG82","FT=WENN(AH13+AH35>=AH15;AH13+AH35;MIN(AH13+AH35+SUMME(AH20;AH22;AH23;AH24;AH25;AH26;AH27;AH28;AH29;AH30;AH31;AH32;AH33;AH34);WENN(AH15<0;0;AH15)))*AH82"]
[null,null,null,"FT=24*(D6-D5+D8-D7+D10-D9+D12-D11)*D88","FT=24*(E6-E5+E8-E7+E10-E9+E12-E11)*E88","FT=24*(F6-F5+F8-F7+F10-F9+F12-F11)*F88","FT=24*(G6-G5+G8-G7+G10-G9+G12-G11)*G88","FT=24*(H6-H5+H8-H7+H10-H9+H12-H11)*H88","FT=24*(I6-I5+I8-I7+I10-I9+I12-I11)*I88","FT=24*(J6-J5+J8-J7+J10-J9+J12-J11)*J88","FT=24*(K6-K5+K8-K7+K10-K9+K12-K11)*K88","FT=24*(L6-L5+L8-L7+L10-L9+L12-L11)*L88","FT=24*(M6-M5+M8-M7+M10-M9+M12-M11)*M88","FT=24*(N6-N5+N8-N7+N10-N9+N12-N11)*N88","FT=24*(O6-O5+O8-O7+O10-O9+O12-O11)*O88","FT=24*(P6-P5+P8-P7+P10-P9+P12-P11)*P88","FT=24*(Q6-Q5+Q8-Q7+Q10-Q9+Q12-Q11)*Q88","FT=24*(R6-R5+R8-R7+R10-R9+R12-R11)*R88","FT=24*(S6-S5+S8-S7+S10-S9+S12-S11)*S88","FT=24*(T6-T5+T8-T7+T10-T9+T12-T11)*T88","FT=24*(U6-U5+U8-U7+U10-U9+U12-U11)*U88","FT=24*(V6-V5+V8-V7+V10-V9+V12-V11)*V88","FT=24*(W6-W5+W8-W7+W10-W9+W12-W11)*W88","FT=24*(X6-X5+X8-X7+X10-X9+X12-X11)*X88","FT=24*(Y6-Y5+Y8-Y7+Y10-Y9+Y12-Y11)*Y88","FT=24*(Z6-Z5+Z8-Z7+Z10-Z9+Z12-Z11)*Z88","FT=24*(AA6-AA5+AA8-AA7+AA10-AA9+AA12-AA11)*AA88","FT=24*(AB6-AB5+AB8-AB7+AB10-AB9+AB12-AB11)*AB88","FT=24*(AC6-AC5+AC8-AC7+AC10-AC9+AC12-AC11)*AC88","FT=24*(AD6-AD5+AD8-AD7+AD10-AD9+AD12-AD11)*AD88","FT=24*(AE6-AE5+AE8-AE7+AE10-AE9+AE12-AE11)*AE88","FT=24*(AF6-AF5+AF8-AF7+AF10-AF9+AF12-AF11)*AF88","FT=24*(AG6-AG5+AG8-AG7+AG10-AG9+AG12-AG11)*AG88","FT=24*(AH6-AH5+AH8-AH7+AH10-AH9+AH12-AH11)*AH88"]
[null,null,null,"FT=ODER(D14>0;D21>0)*1","FT=ODER(E14>0;E21>0)*1","FT=ODER(F14>0;F21>0)*1","FT=ODER(G14>0;G21>0)*1","FT=ODER(H14>0;H21>0)*1","FT=ODER(I14>0;I21>0)*1","FT=ODER(J14>0;J21>0)*1","FT=ODER(K14>0;K21>0)*1","FT=ODER(L14>0;L21>0)*1","FT=ODER(M14>0;M21>0)*1","FT=ODER(N14>0;N21>0)*1","FT=ODER(O14>0;O21>0)*1","FT=ODER(P14>0;P21>0)*1","FT=ODER(Q14>0;Q21>0)*1","FT=ODER(R14>0;R21>0)*1","FT=ODER(S14>0;S21>0)*1","FT=ODER(T14>0;T21>0)*1","FT=ODER(U14>0;U21>0)*1","FT=ODER(V14>0;V21>0)*1","FT=ODER(W14>0;W21>0)*1","FT=ODER(X14>0;X21>0)*1","FT=ODER(Y14>0;Y21>0)*1","FT=ODER(Z14>0;Z21>0)*1","FT=ODER(AA14>0;AA21>0)*1","FT=ODER(AB14>0;AB21>0)*1","FT=ODER(AC14>0;AC21>0)*1","FT=ODER(AD14>0;AD21>0)*1","FT=ODER(AE14>0;AE21>0)*1","FT=ODER(AF14>0;AF21>0)*1","FT=ODER(AG14>0;AG21>0)*1","FT=ODER(AH14>0;AH21>0)*1"]
[null,null,null,{"$f":"ABS(\"FT\"&_xlfn.FORMULATEXT(D14)<>D45)","v":0},{"$f":"ABS(\"FT\"&_xlfn.FORMULATEXT(E14)<>E45)","v":0},0,0,0,0,0,0,0,0,0,0,0,0,0,0,0,0,0,0,0,0,0,0,0,0,0,0,0,0,0]
[null,null,null,{"$f":"ABS(\"FT\"&_xlfn.FORMULATEXT(D13)<>D46)","v":0},{"$f":"ABS(\"FT\"&_xlfn.FORMULATEXT(E13)<>E46)","v":0},0,0,0,0,0,0,0,0,0,0,0,0,0,0,0,0,0,0,0,0,0,0,0,0,0,0,0,0,0]
[null,null,null,{"$f":"ABS(\"FT\"&_xlfn.FORMULATEXT(D80)<>D47)","v":0},{"$f":"ABS(\"FT\"&_xlfn.FORMULATEXT(E80)<>E47)","v":0},0,0,0,0,0,0,0,0,0,0,0,0,0,0,0,0,0,0,0,0,0,0,0,0,0,0,0,0,0]
[null,null,null,{"$f":"ABS(ISERROR(D37))","v":0},{"$f":"ABS(ISERROR(E37))","v":0},0,0,0,0,0,0,0,0,0,0,0,0,0,0,0,0,0,0,0,0,0,0,0,0,0,0,0,0,0]
[null,null,null,{"$f":"SUM(D48:D51)","v":0},{"$f":"SUM(E48:E51)","v":0},0,0,0,0,0,0,0,0,0,0,0,0,0,0,0,0,0,0,0,0,0,0,0,0,0,0,0,0,0,null,null,null,null,"Formel defekt",{"$f":"SUM(D52:AH52)","v":0}]
[]
[]
[]
[]
[]
[]
[]
[]
[]
[]
[]
[]
[]
[]
[]
[]
[]
[]
[]
[]
[]
[]
[]
[]
[null,"HT_Naz-Kopie",{"$f":"HT_NAZ","v":8.4}]
[null,"Heute:",{"$f":"SL_BisDatum","v":"2024-02-02"}]
[null,null,"Reguläre Tage ausgefüllt",{"$f":"((D80*D81)=1)*1","v":0},{"$f":"((E80*E81)=1)*1","v":0},0,0,0,0,0,0,0,0,0,0,0,0,0,0,0,0,0,0,0,0,0,0,0,0,0,0,0,0,0]
[null,null,"Arbeitstage ausgefüllt",{"$f":"OR(D14>0,D21>0)*1","v":0},{"$f":"OR(E14>0,E21>0)*1","v":0},0,0,0,0,0,0,0,0,0,0,0,0,0,0,0,0,0,0,0,0,0,0,0,0,0,0,0,0,0]
[null,null,"Arbeitstage wenn BG>0%",{"$f":"IFERROR(VLOOKUP(D3,VSA_Kalender,22),0)","v":0},0,0,0,0,0,0,0,0,0,0,0,0,0,0,0,0,0,0,0,0,0,0,0,0,0,0,0,0,0,0]
[null,null,"Der BG beträgt mehr als 0%",{"$f":"IF(D4=\"\",0,ABS(VLOOKUP(D3,VSA_Kalender,13,FALSE)>0))","v":1},1,1,1,1,1,1,1,1,1,1,1,1,1,1,1,1,1,1,1,1,1,1,1,1,1,1,1,1,1,1]
[null,null,"(Ja: 1, Nein: 0)",{"$f":"SUM(D81:AH81)","v":0},"Total Tage bei BG>0%",null,null,{"$f":"SUM(D80:AH80)","v":0},"Total Tage ausgefüllt",null,null,{"$f":"SUM(D79:AH79)","v":0},"Total reguläre Tage ausgefüllt"]
[]
[null,null,"Tag des Monats",{"$f":"D4","v":1},2,3,4,5,6,7,8,9,10,11,12,13,14,15,16,17,18,19,20,21,22,23,24,25,26,27,28,29,30,31]
[null,null,"Ist Arbeitsbereich",{"$f":"IFERROR(ABS(WEEKDAY(D3,2)<6),0)","v":1},1,1,0,0,1,1,1,1,1,0,0,1,1,1,1,1,0,0,1,1,1,1,1,0,0,1,1,1,1,1]
[null,null,"Maximaler Fehler",{"$f":"MAX(D100:D107,D98,D134)","v":0},{"$f":"MAX(E100:E107,E98,E134)","v":0},0,0,0,0,0,0,0,0,0,0,0,0,0,0,0,0,0,0,0,0,0,0,0,0,0,0,0,0,0]
[null,null,"Wird die Präsenzzeit angezeigt?",{"$f":"IF(D87=0,1,0)","v":1},{"$f":"IF(E87=0,1,0)","v":1},1,1,1,1,1,1,1,1,1,1,1,1,1,1,1,1,1,1,1,1,1,1,1,1,1,1,1,1,1]
[]
[null,null,"Gruppenfehler 1",{"$f":"IF(AND(D6-D5=0,COUNTA(D7:D12)>0),1,0)","v":0},0,0,0,0,0,0,0,0,0,0,0,0,0,0,0,0,0,0,0,0,0,0,0,0,0,0,0,0,0,0]
[null,"Gruppenfehler","(aus)",{"$f":"D90","v":0},0,0,0,0,0,0,0,0,0,0,0,0,0,0,0,0,0,0,0,0,0,0,0,0,0,0,0,0,0,0]
[null,null,"Gruppenfehler 2",{"$f":"IF(AND(D8-D7=0,COUNTA(D9:D12)>0),1,0)","v":0},0,0,0,0,0,0,0,0,0,0,0,0,0,0,0,0,0,0,0,0,0,0,0,0,0,0,0,0,0,0]
[null,null,"(aus)",{"$f":"D92","v":0},0,0,0,0,0,0,0,0,0,0,0,0,0,0,0,0,0,0,0,0,0,0,0,0,0,0,0,0,0,0]
[null,null,"Gruppenfehler 3",{"$f":"IF(AND(D10-D9=0,COUNTA(D11:D12)>0),1,0)","v":0},0,0,0,0,0,0,0,0,0,0,0,0,0,0,0,0,0,0,0,0,0,0,0,0,0,0,0,0,0,0]
[null,null,"(aus)",{"$f":"D94","v":0},0,0,0,0,0,0,0,0,0,0,0,0,0,0,0,0,0,0,0,0,0,0,0,0,0,0,0,0,0,0]
[null,null,"leer"]
[null,null,"leer"]
[null,null,"Genereller Gruppenfehler",{"$f":"MAX(D90:D95)","v":0},0,0,0,0,0,0,0,0,0,0,0,0,0,0,0,0,0,0,0,0,0,0,0,0,0,0,0,0,0,0]
[]
[null,null,"Ein1",{"$f":"IF(AND(D109=0,D110>0),1,0)","v":0},{"$f":"IF(AND(E109=0,E110>0),1,0)","v":0},0,0,0,0,0,0,0,0,0,0,0,0,0,0,0,0,0,0,0,0,0,0,0,0,0,0,0,0,0]
[null,null,"Aus1",{"$f":"IF(AND(D110>0,D110<D109),3,IF(AND(D109>0,D110=0),1,0))*D$86","v":0},{"$f":"IF(AND(E110>0,E110<E109),3,IF(AND(E109>0,E110=0),1,0))*E$86","v":0},0,0,0,0,0,0,0,0,0,0,0,0,0,0,0,0,0,0,0,0,0,0,0,0,0,0,0,0,0]
[null,null,"Ein2",{"$f":"IF(AND(D111>0,D111<D110),3,IF(AND(D111=0,D112>0),1,0))*D$86","v":0},0,0,0,0,0,0,0,0,0,0,0,0,0,0,0,0,0,0,0,0,0,0,0,0,0,0,0,0,0,0]
[null,null,"Aus2",{"$f":"IF(AND(D112>0,D112<D111),3,IF(AND(D111>0,D112=0),1,0))*D$86","v":0},{"$f":"IF(AND(E112>0,E112<E111),3,IF(AND(E111>0,E112=0),1,0))*E$86","v":0},0,0,0,0,0,0,0,0,0,0,0,0,0,0,0,0,0,0,0,0,0,0,0,0,0,0,0,0,0]
[null,"Zellenfehler","Ein3",{"$f":"IF(AND(D113>0,D113<D112),3,IF(AND(D113=0,D114>0),1,0))*D$86","v":0},{"$f":"IF(AND(E113>0,E113<E112),3,IF(AND(E113=0,E114>0),1,0))*E$86","v":0},0,0,0,0,0,0,0,0,0,0,0,0,0,0,0,0,0,0,0,0,0,0,0,0,0,0,0,0,0]
[null,null,"Aus3",{"$f":"IF(AND(D114>0,D114<D113),3,IF(AND(D113>0,D114=0),1,0))*D$86","v":0},{"$f":"IF(AND(E114>0,E114<E113),3,IF(AND(E113>0,E114=0),1,0))*E$86","v":0},0,0,0,0,0,0,0,0,0,0,0,0,0,0,0,0,0,0,0,0,0,0,0,0,0,0,0,0,0]
[null,null,"Ein4",{"$f":"IF(AND(D115>0,D115<D114),3,IF(AND(D115=0,D116>0),1,0))*D$86","v":0},{"$f":"IF(AND(E115>0,E115<E114),3,IF(AND(E115=0,E116>0),1,0))*E$86","v":0},0,0,0,0,0,0,0,0,0,0,0,0,0,0,0,0,0,0,0,0,0,0,0,0,0,0,0,0,0]
[null,null,"Aus4",{"$f":"IF(AND(D116>0,D116<D115),3,IF(AND(D115>0,D116=0),1,0))*D$86","v":0},{"$f":"IF(AND(E116>0,E116<E115),3,IF(AND(E115>0,E116=0),1,0))*E$86","v":0},0,0,0,0,0,0,0,0,0,0,0,0,0,0,0,0,0,0,0,0,0,0,0,0,0,0,0,0,0]
[]
[null,null,"Ein1",{"$f":"ROUND(D5*24,2)","v":0},0,0,0,0,0,0,0,0,0,0,0,0,0,0,0,0,0,0,0,0,0,0,0,0,0,0,0,0,0,0]
[null,null,"Aus1",0,0,0,0,0,0,0,0,0,0,0,0,0,0,0,0,0,0,0,0,0,0,0,0,0,0,0,0,0,0,0]
[null,"Zeiten dezimal gewandelt","Ein2",0,0,0,0,0,0,0,0,0,0,0,0,0,0,0,0,0,0,0,0,0,0,0,0,0,0,0,0,0,0,0]
[null,null,"Aus2",0,0,0,0,0,0,0,0,0,0,0,0,0,0,0,0,0,0,0,0,0,0,0,0,0,0,0,0,0,0,0]
[null,null,"Ein3",0,0,0,0,0,0,0,0,0,0,0,0,0,0,0,0,0,0,0,0,0,0,0,0,0,0,0,0,0,0,0]
[null,null,"Aus3",0,0,0,0,0,0,0,0,0,0,0,0,0,0,0,0,0,0,0,0,0,0,0,0,0,0,0,0,0,0,0]
[null,null,"Ein4",0,0,0,0,0,0,0,0,0,0,0,0,0,0,0,0,0,0,0,0,0,0,0,0,0,0,0,0,0,0,0]
[null,null,"Aus4",0,0,0,0,0,0,0,0,0,0,0,0,0,0,0,0,0,0,0,0,0,0,0,0,0,0,0,0,0,0,0]
[]
[null,"Pausenfehler","Gruppe1",{"$f":"IF(OR(D109=\"\",D110=\"\"),0,D110-D109)","v":0},{"$f":"IF(OR(E109=\"\",E110=\"\"),0,E110-E109)","v":0},0,0,0,0,0,0,0,0,0,0,0,0,0,0,0,{"$f":"IF(OR(U109=\"\",U110=\"\"),0,U110-U109)","v":0},{"$f":"IF(OR(V109=\"\",V110=\"\"),0,V110-V109)","v":0},0,0,0,0,0,0,0,0,0,0,0,0]
[null,null,"Gruppe2",{"$f":"IF(OR(D111=\"\",D112=\"\"),0,D112-D111)","v":0},{"$f":"IF(OR(E111=\"\",E112=\"\"),0,E112-E111)","v":0},0,0,0,0,0,0,0,0,0,0,0,0,0,0,0,{"$f":"IF(OR(U111=\"\",U112=\"\"),0,U112-U111)","v":0},{"$f":"IF(OR(V111=\"\",V112=\"\"),0,V112-V111)","v":0},0,0,0,0,0,0,0,0,0,0,0,0]
[null,null,"Gruppe3",{"$f":"IF(OR(D113=\"\",D114=\"\"),0,D114-D113)","v":0},{"$f":"IF(OR(E113=\"\",E114=\"\"),0,E114-E113)","v":0},0,0,0,0,0,0,0,0,0,0,0,0,0,0,0,{"$f":"IF(OR(U113=\"\",U114=\"\"),0,U114-U113)","v":0},{"$f":"IF(OR(V113=\"\",V114=\"\"),0,V114-V113)","v":0},0,0,0,0,0,0,0,0,0,0,0,0]
[null,null,"Gruppe4",{"$f":"IF(OR(D115=\"\",D116=\"\"),0,D116-D115)","v":0},{"$f":"IF(OR(E115=\"\",E116=\"\"),0,E116-E115)","v":0},0,0,0,0,0,0,0,0,0,0,0,0,0,0,0,{"$f":"IF(OR(U115=\"\",U116=\"\"),0,U116-U115)","v":0},{"$f":"IF(OR(V115=\"\",V116=\"\"),0,V116-V115)","v":0},0,0,0,0,0,0,0,0,0,0,0,0]
[]
[null,null,"Pause12",{"$f":"IF(OR(D110=\"\",D111=\"\"),0,D111-D110)","v":0},{"$f":"IF(OR(E110=\"\",E111=\"\"),0,E111-E110)","v":0},0,0,0,0,0,0,0,0,0,0,0,0,0,0,0,{"$f":"IF(OR(U110=\"\",U111=\"\"),0,U111-U110)","v":0},{"$f":"IF(OR(V110=\"\",V111=\"\"),0,V111-V110)","v":0},0,0,0,0,0,0,0,0,0,0,0,0]
[null,null,"Pause23",{"$f":"IF(OR(D112=\"\",D113=\"\"),0,D113-D112)","v":0},{"$f":"IF(OR(E112=\"\",E113=\"\"),0,E113-E112)","v":0},0,0,0,0,0,0,0,0,0,0,0,0,0,0,0,{"$f":"IF(OR(U112=\"\",U113=\"\"),0,U113-U112)","v":0},{"$f":"IF(OR(V112=\"\",V113=\"\"),0,V113-V112)","v":0},0,0,0,0,0,0,0,0,0,0,0,0]
[null,null,"Pause34",{"$f":"IF(OR(D114=\"\",D115=\"\"),0,D115-D114)","v":0},{"$f":"IF(OR(E114=\"\",E115=\"\"),0,E115-E114)","v":0},0,0,0,0,0,0,0,0,0,0,0,0,0,0,0,{"$f":"IF(OR(U114=\"\",U115=\"\"),0,U115-U114)","v":0},{"$f":"IF(OR(V114=\"\",V115=\"\"),0,V115-V114)","v":0},0,0,0,0,0,0,0,0,0,0,0,0]
[]
[null,null,"Kum12",{"$f":"IF(D123>=0.5,0,D118+D119)","v":0},{"$f":"IF(E123>=0.5,0,E118+E119)","v":0},0,0,0,0,0,0,0,0,0,0,0,0,0,0,0,{"$f":"IF(U123>=0.5,0,U118+U119)","v":0},{"$f":"IF(V123>=0.5,0,V118+V119)","v":0},0,0,0,0,0,0,0,0,0,0,0,0]
[null,null,"Kum123",{"$f":"IF(OR(D123>=0.5,D124>=0.5),0,D118+D119+D120)","v":0},{"$f":"IF(OR(E123>=0.5,E124>=0.5),0,E118+E119+E120)","v":0},0,0,0,0,0,0,0,0,0,0,0,0,0,0,0,{"$f":"IF(OR(U123>=0.5,U124>=0.5),0,U118+U119+U120)","v":0},{"$f":"IF(OR(V123>=0.5,V124>=0.5),0,V118+V119+V120)","v":0},0,0,0,0,0,0,0,0,0,0,0,0]
[null,null,"Kum1234",{"$f":"IF(OR(D123>=0.5,D124>=0.5,D125>=0.5),0,D118+D119+D120+D121)","v":0},{"$f":"IF(OR(E123>=0.5,E124>=0.5,E125>=0.5),0,E118+E119+E120+E121)","v":0},0,0,0,0,0,0,0,0,0,0,0,0,0,0,0,{"$f":"IF(OR(U123>=0.5,U124>=0.5,U125>=0.5),0,U118+U119+U120+U121)","v":0},{"$f":"IF(OR(V123>=0.5,V124>=0.5,V125>=0.5),0,V118+V119+V120+V121)","v":0},0,0,0,0,0,0,0,0,0,0,0,0]
[null,null,"Kum23",{"$f":"IF(D124>=0.5,0,D119+D120)","v":0},{"$f":"IF(E124>=0.5,0,E119+E120)","v":0},0,0,0,0,0,0,0,0,0,0,0,0,0,0,0,{"$f":"IF(U124>=0.5,0,U119+U120)","v":0},{"$f":"IF(V124>=0.5,0,V119+V120)","v":0},0,0,0,0,0,0,0,0,0,0,0,0]
[null,null,"Kum234",{"$f":"IF(OR(D124>=0.5,D125>=0.5),0,D119+D120+D121)","v":0},{"$f":"IF(OR(E124>=0.5,E125>=0.5),0,E119+E120+E121)","v":0},0,0,0,0,0,0,0,0,0,0,0,0,0,0,0,{"$f":"IF(OR(U124>=0.5,U125>=0.5),0,U119+U120+U121)","v":0},{"$f":"IF(OR(V124>=0.5,V125>=0.5),0,V119+V120+V121)","v":0},0,0,0,0,0,0,0,0,0,0,0,0]
[null,null,"Kum34",{"$f":"IF(D125>=0.5,0,D120+D121)","v":0},{"$f":"IF(E125>=0.5,0,E120+E121)","v":0},0,0,0,0,0,0,0,0,0,0,0,0,0,0,0,{"$f":"IF(U125>=0.5,0,U120+U121)","v":0},{"$f":"IF(V125>=0.5,0,V120+V121)","v":0},0,0,0,0,0,0,0,0,0,0,0,0]
[]
[null,null,"Pausenfehler-Code",{"$f":"IF(MAX(D118:D121,D127:D132)>6,2,0)","v":0},{"$f":"IF(MAX(E118:E121,E127:E132)>6,2,0)","v":0},0,0,0,0,0,0,0,0,0,0,0,0,0,0,0,0,0,0,0,0,0,0,0,0,0,0,0,0,0]

{"sheet":"Juni","index":11,"n_rows":134,"n_cols":45,"rows_kept":134,"cut":false,"hidden":true,"merged":[[11,34,12,35]]}
[6,{"$f":"DATEVALUE(\"1.\"&A1&\".\"&SL_Jahr)","v":"2024-06-01"},{"$f":"SL_Jahr","v":2024},{"$f":"B_Gde","v":"Gde:"},{"$f":"SL_Gemeinde","v":0},null,null,null,null,null,null,null,null,null,null,null,null,null,null,{"$f":"B_Schule","v":"Schule:"},{"$f":"SL_Schule","v":0},null,null,null,null,null,null,null,null,null,null,null,null,null,null,null,null,null,"Abschluss-Teilbedingungen:"]
[{"$f":"VLOOKUP(A1,Monatsenden,2)","v":45473},{"$f":"B_Bg","v":"BG:"},{"$f":"VLOOKUP(B1,VSA_Kalender,13)","v":1},{"$f":"B_Name","v":"Name:"},{"$f":"SL_Name","v":0},null,null,null,null,null,null,null,null,null,null,null,null,null,null,null,null,null,null,null,null,null,null,null,null,null,null,null,null,null,null,null,null,null,"Regel ok",{"$f":"(AN14>=AN15)","v":false},"Nicht Relevant",{"$f":"D83=0","v":true},-1,{"$f":"IF(AP2=TRUE,AQ2,0)","v":-1},"Nicht Relevant"]
[null,{"$f":"Zerf_Version & \" \" & Zerf_T","v":"Version VSA 1.06 "},null,{"$f":"DATE($C$1,MONTH($B$1),D$4)","v":"2024-06-01"},{"$f":"DATE($C$1,MONTH($B$1),E$4)","v":"2024-06-02"},"2024-06-03","2024-06-04","2024-06-05","2024-06-06","2024-06-07","2024-06-08","2024-06-09","2024-06-10","2024-06-11","2024-06-12","2024-06-13","2024-06-14","2024-06-15","2024-06-16","2024-06-17","2024-06-18","2024-06-19","2024-06-20","2024-06-21","2024-06-22","2024-06-23","2024-06-24","2024-06-25","2024-06-26","2024-06-27","2024-06-28",{"$f":"IF(MONTH(DATE($C$1,MONTH($B$1),AF$41))>MONTH($B$1),\"\",DATE($C$1,MONTH($B$1),AF$4))","v":"2024-06-29"},{"$f":"IF(MONTH(DATE($C$1,MONTH($B$1),AG$41))>MONTH($B$1),\"\",DATE($C$1,MONTH($B$1),AG$4))","v":"2024-06-30"},{"$f":"IF(MONTH(DATE($C$1,MONTH($B$1),AH$41))>MONTH($B$1),\"\",DATE($C$1,MONTH($B$1),AH$4))","v":""},null,null,null,null,"Spalten ok",{"$f":"(L83>=D83)","v":true},"Entsperrt",false,1,{"$f":"AP3*AQ3","v":0},"Entsperrt"]
[null,{"$f":"IF(VSATestModus=TRUE(),\"VSA-Modus!\",\"\")","v":""},{"$f":"IF(AN52>0,\"DEFEKT\",\"\")","v":""},{"$f":"IF(MONTH(DATE($C$1,MONTH($B$1),D$41))>MONTH($B$1),\"\",D41)","v":1},2,3,4,5,6,7,8,9,10,11,12,13,14,15,16,17,18,19,20,21,22,23,24,25,26,27,28,{"$f":"IF(MONTH(DATE($C$1,MONTH($B$1),AF$41))>MONTH($B$1),\"\",AF41)","v":29},{"$f":"IF(MONTH(DATE($C$1,MONTH($B$1),AG$41))>MONTH($B$1),\"\",AG41)","v":30},{"$f":"IF(MONTH(DATE($C$1,MONTH($B$1),AH$41))>MONTH($B$1),\"\",AH41)","v":""},null,null,null,null,"Keine Fehler",{"$f":"(SUM(D87:AH87)=0)","v":true},"Geändert",false,2,{"$f":"AP4*AQ4","v":0},"Geändert"]
[null,"     Ein   >>>",null,null,null,null,null,null,null,null,null,null,null,null,null,null,null,null,null,null,null,null,null,null,null,null,null,null,null,null,null,null,null,null,null,null,null,null,"Keine Hand",{"$f":"(AI12=\"\")","v":true},"Sperre",{"$f":"AS11=2","v":false},3,{"$f":"NOT(AP6)*AQ5","v":3},"Eingaben vornehmen"]
[null,"<<<   Aus     ",null,null,null,null,null,null,null,null,null,null,null,null,null,null,null,null,null,null,null,null,null,null,null,null,null,null,null,null,null,null,null,null,null,null,null,null,null,null,"Abschliessbar 1",{"$f":"AND(OR(AN2,AN3),AN4,AN5,NOT(AP7),NOT(AP2))","v":false},4,{"$f":"AND(NOT(OR(AP3,AP4)),AP6)*AQ6","v":0},"Abschliessbar 1"]
[null,"     Ein   >>>",null,null,null,null,null,null,null,null,null,null,null,null,null,null,null,null,null,null,null,null,null,null,null,null,null,null,null,null,null,null,null,null,null,null,null,null,null,null,"Abgeschlossen",false,5,{"$f":"AND(NOT(OR(AP3,AP4)),AP7)*AQ7","v":0},"Abgeschlossen"]
[null,"<<<   Aus     ",null,null,null,null,null,null,null,null,null,null,null,null,null,null,null,null,null,null,null,null,null,null,null,null,null,null,null,null,null,null,null,null,null,null,null,null,null,null,"Für Jahr OK",{"$f":"AND(OR(AP2,AP7),NOT(AP3))","v":true}]
[null,"     Ein   >>>"]
[null,"<<<   Aus     ",null,null,null,null,null,null,null,null,null,null,null,null,null,null,null,null,null,null,null,null,null,null,null,null,null,null,null,null,null,null,null,null,null,null,null,null,null,null,"Statusnummer:",{"$f":"IF(AR2=AQ2,AQ2,MAX(AR2:AR7))","v":-1}]
[null,"     Ein   >>>",null,null,null,null,null,null,null,null,null,null,null,null,null,null,null,null,null,null,null,null,null,null,null,null,null,null,null,null,null,null,null,null,null,null,null,null,"HatDaten:",{"$f":"AND(AP2=FALSE,OR(AP10<>3,COUNTA(D5:AH12,D20:AH35,D39:L40)>0))","v":false},"Statustext:",{"$f":"IFERROR(VLOOKUP(AP10,AR2:AS7,2,FALSE),\"unbekannt\")","v":"Nicht Relevant"},null,null,1]
[null,"<<<   Aus     ",null,null,null,null,null,null,null,null,null,null,null,null,null,null,null,null,null,null,null,null,null,null,null,null,null,null,null,null,null,null,null,null,{"$f":"IF(COUNTIF(D37:AH37,\"I\")>0,\"I\",\"\")","v":""}]
[null,{"$f":"B_PrZeit","v":"Präsenzzeit"},null,{"$f":"24*(D6-D5+D8-D7+D10-D9+D12-D11)*D88","v":0},{"$f":"24*(E6-E5+E8-E7+E10-E9+E12-E11)*E88","v":0},0,0,0,0,0,0,0,0,0,0,0,0,0,0,0,0,0,0,0,0,0,0,0,0,0,0,0,0,0,null,null,null,null,"Anzahl Regeltage:",{"$f":"D83","v":0}]
[null,{"$f":"B_TotalAZist","v":"Total Arbeitszeit (IST)"},null,{"$f":"IF(D13+D35>=D15,D13+D35,MIN(D13+D35+SUM(D20,D22,D23,D24,D25,D26,D27,D28,D29,D30,D31,D32,D33,D34),IF(D15<0,0,D15)))*D82","v":0},0,0,0,0,0,0,0,0,0,0,0,0,0,{"$f":"IF(R13+R35>=R15,R13+R35,MIN(R13+R35+SUM(R20,R22,R23,R24,R25,R26,R27,R28,R29,R30,R31,R32,R33,R34),IF(R15<0,0,R15)))*R82","v":0},{"$f":"IF(S13+S35>=S15,S13+S35,MIN(S13+S35+SUM(S20,S22,S23,S24,S25,S26,S27,S28,S29,S30,S31,S32,S33,S34),IF(S15<0,0,S15)))*S82","v":0},{"$f":"IF(T13+T35>=T15,T13+T35,MIN(T13+T35+SUM(T20,T22,T23,T24,T25,T26,T27,T28,T29,T30,T31,T32,T33,T34),IF(T15<0,0,T15)))*T82","v":0},{"$f":"IF(U13+U35>=U15,U13+U35,MIN(U13+U35+SUM(U20,U22,U23,U24,U25,U26,U27,U28,U29,U30,U31,U32,U33,U34),IF(U15<0,0,U15)))*U82","v":0},0,0,0,0,0,0,0,0,0,0,0,0,0,{"$f":"SUMIF($D$82:$AH$82,1,D14:AH14)","v":0},{"$f":"AI14-AI15","v":0},null,null,"Erfasste Regeltage",{"$f":"L83","v":0},{"$f":"AN13-AN14","v":0},"Fehlende Regeltage"]
[null,{"$f":"B_NettoSollAZ","v":"Netto-SOLL-Arbeitszeit"},null,{"$f":"ROUND(D16-D19,2)","v":0},{"$f":"ROUND(E16-E19,2)","v":0},0,0,0,0,0,0,0,0,0,0,0,0,0,0,0,0,0,0,0,0,0,0,0,0,0,0,{"$f":"IF(AF$42=4,0,ROUND(AF16-AF19,2))","v":0},{"$f":"IF(AG$42=4,0,ROUND(AG16-AG19,2))","v":0},0,{"$f":"SUMIF($D$82:$AH$82,1,D15:AH15)","v":0},null,null,null,"Minimum Regeltage",{"$f":"MinRegeltage","v":1},"Ist als Konstante im Blatt \"Intern\" hinterlegt"]
[null,{"$f":"B_BruttoSollAZ","v":"Brutto-SOLL-Arb.zeit"},null,{"$f":"VLOOKUP(D3,VSA_Kalender,16)","v":0},0,0,0,0,0,0,0,0,0,0,0,0,0,0,0,0,0,0,0,0,0,0,0,0,0,0,0,{"$f":"IF(AF$42=4,0,VLOOKUP(AF3,VSA_Kalender,16))","v":0},{"$f":"IF(AG$42=4,0,VLOOKUP(AG3,VSA_Kalender,16))","v":0},{"$f":"IF(AH$42=4,0,VLOOKUP(AH3,VSA_Kalender,16))","v":0},null,null,null,null,"Regel ok","Mind. eigetr. Regeltage erfüllt"]
[null,{"$f":"B_MehrMinder","v":"Mehr-/Minderleistung"},null,{"$f":"(SL_BisDatum>=D3)*ROUND(D14-D15,2)","v":0},0,0,0,0,0,0,0,0,0,0,0,0,0,0,0,0,0,0,0,0,0,0,0,0,0,0,0,0,0,0,{"$f":"B_Total","v":"Total"},{"$f":"B_Vortrag","v":"Vortrag"},null,null,"Spalten ok:","Alle Einträge an Regeltagen ok"]
[null,{"$f":"B_AZSaldo","v":"AZ - Saldo"},{"$f":"VLOOKUP(ROW(),VSA_Uebertrag,$A$1+3)","v":16.8},{"$f":"IFERROR((C18+D17)*(D3<=SL_BisDatum)*VLOOKUP(D3,VSA_Kalender,21,FALSE),0)","v":0},0,0,{"$f":"IFERROR((F18+G17)*(G3<=SL_BisDatum)*VLOOKUP(G3,VSA_Kalender,21,FALSE),0)","v":0},0,0,0,0,0,0,0,0,0,0,0,0,0,0,0,0,0,0,0,0,0,0,0,0,0,0,0,null,{"$f":"SUMIF($D$82:$AH$82,1,D17:AH17)+C18","v":16.8}]
[null,{"$f":"B_FTA","v":"Feiertagsanspruch"},0,{"$f":"VLOOKUP(D3,VSA_Kalender,14)","v":0},0,0,0,0,0,0,0,0,0,0,0,0,0,0,0,0,0,0,0,0,0,0,0,0,0,0,0,{"$f":"IF(AF$42=4,0,VLOOKUP(AF3,VSA_Kalender,14))","v":0},{"$f":"IF(AG$42=4,0,VLOOKUP(AG3,VSA_Kalender,14))","v":0},{"$f":"IF(AH$42=4,0,VLOOKUP(AH3,VSA_Kalender,14))","v":0},{"$f":"SUM(D19:AH19)","v":0}]
[null,{"$f":"B_Ferien","v":"Ferien"},{"$f":"VLOOKUP(ROW(),VSA_Uebertrag,$A$1+3)","v":0},null,null,null,null,null,null,null,null,null,null,null,null,null,null,null,null,null,null,null,null,null,null,null,null,null,null,null,null,null,null,null,{"$f":"SUMIF($D$82:$AH$82,1,D20:AH20)","v":0},{"$f":"ROUND(C20-AI20,2)","v":0},"Rest"]
[null,{"$f":"B_KompAZ","v":"Kompensation Arbeitstage"},0,null,null,null,null,null,null,null,null,null,null,null,null,null,null,null,null,null,null,null,null,null,null,null,null,null,null,null,null,null,null,null,0,{"$f":"ROUND(A21+C21-AI21,0)","v":0}]
[null,{"$f":"B_Arzt","v":"Arztbesuch"},0,null,null,null,null,null,null,null,null,null,null,null,null,null,null,null,null,null,null,null,null,null,null,null,null,null,null,null,null,null,null,null,0,{"$f":"ROUND(A22+C22+AI22,2)","v":0},"Summen"]
[null,{"$f":"B_Krank","v":"Krankheit"},0,null,null,null,null,null,null,null,null,null,null,null,null,null,null,null,null,null,null,null,null,null,null,null,null,null,null,null,null,null,null,null,0,{"$f":"ROUND(A23+C23+AI23,2)","v":0}]
[null,{"$f":"B_BU","v":"Berufsunfall"},0,null,null,null,null,null,null,null,null,null,null,null,null,null,null,null,null,null,null,null,null,null,null,null,null,null,null,null,null,null,null,null,0,0]
[null,{"$f":"B_NBU","v":"Nichtberufsunfall"},0,null,null,null,null,null,null,null,null,null,null,null,null,null,null,null,null,null,null,null,null,null,null,null,null,null,null,null,null,null,null,null,0,0]
[null,{"$f":"B_MilZiv","v":"Militär / Zivilschutz"},0,null,null,null,null,null,null,null,null,null,null,null,null,null,null,null,null,null,null,null,null,null,null,null,null,null,null,null,null,null,null,null,0,0]
[null,{"$f":"B_UUB","v":"Unbezahlter Urlaub"},0,null,null,null,null,null,null,null,null,null,null,null,null,null,null,null,null,null,null,null,null,null,null,null,null,null,null,null,null,null,null,null,0,{"$f":"ROUND(A27+C27-AI27,2)","v":0},"Rest"]
[null,{"$f":"B_UB","v":"Bezahlter Urlaub"},0,null,null,null,null,null,null,null,null,null,null,null,null,null,null,null,null,null,null,null,null,null,null,null,null,null,null,null,null,null,null,null,0,{"$f":"ROUND(A28+C28-AI28,2)","v":0}]
[null,{"$f":"B_NebenB","v":"Nebenbeschäftigung"},0,null,null,null,null,null,null,null,null,null,null,null,null,null,null,null,null,null,null,null,null,null,null,null,null,null,null,null,null,null,null,null,0,0]
[null,{"$f":"B_DAG","v":"D A G"},0,null,null,null,null,null,null,null,null,null,null,null,null,null,null,null,null,null,null,null,null,null,null,null,null,null,null,null,null,null,null,null,0,0]
[null,{"$f":"B_Divers","v":"Diverses"},0,null,null,null,null,null,null,null,null,null,null,null,null,null,null,null,null,null,null,null,null,null,null,null,null,null,null,null,null,null,null,null,0,0,"Summen"]
[null,{"$f":"B_FamPersErg","v":"Fam./pers. Ereignisse"},0,null,null,null,null,null,null,null,null,null,null,null,null,null,null,null,null,null,null,null,null,null,null,null,null,null,null,null,null,null,null,null,0,0]
[null,{"$f":"B_FZ1","v":"freie Zeile 1"},0,null,null,null,null,null,null,null,null,null,null,null,null,null,null,null,null,null,null,null,null,null,null,null,null,null,null,null,null,null,null,null,0,0]
[null,{"$f":"B_FZ2","v":"freie Zeile 2"},0,null,null,null,null,null,null,null,null,null,null,null,null,null,null,null,null,null,null,null,null,null,null,null,null,null,null,null,null,null,null,null,0,0]
[null,{"$f":"B_WB","v":"Weiterbildung"},0,null,null,null,null,null,null,null,null,null,null,null,null,null,null,null,null,null,null,null,null,null,null,null,null,null,null,null,null,null,null,null,0,0]
[null,{"$f":"B_FEL","v":"frei einsetzbare Lekt."},0,null,null,null,null,null,null,null,null,null,null,null,null,null,null,null,null,null,null,null,null,null,null,null,null,null,null,null,null,null,null,null,{"$f":"SUM(D36:AH36)","v":0},{"$f":"ROUND(C36-AI36,0)","v":0}]
[null,null,null,{"$f":"IF(AND((D13 - D15)+SUM(D20,D22:D34)>0.00001,SUM(D20,D22:D34)>0),\"I\",\"\")","v":""},"","","","","","","","","","","","","","","","","","","","","","","","","","","","","",""]
[null,null,"Visum","Identität:",null,null,null,null,"Datum:",null,"Status:"]
[null,null,"SL"]
[null,null,"VG"]
[null,null,null,1,2,3,4,5,6,7,8,9,10,11,12,13,14,15,16,17,18,19,20,21,22,23,24,25,26,27,28,29,30,31]
[null,null,null,{"$f":"IF(D3=\"\",4,VLOOKUP(D3,VSA_Kalender,18))","v":1},1,0,0,0,0,0,1,1,0,0,0,0,0,1,1,0,0,0,0,0,1,1,0,0,0,0,0,1,1,4]
[]
[null,null,null,{"$f":"IF(D19>0,VLOOKUP(D3,KalFeiertage,6,FALSE),\"\")","v":""},"","","","","","","","","","","","","","","","","","","","","","","","","","","","","",""]
[null,null,null,"FT=WENN(D13+D35>=D15;D13+D35;MIN(D13+D35+SUMME(D20;D22;D23;D24;D25;D26;D27;D28;D29;D30;D31;D32;D33;D34);WENN(D15<0;0;D15)))*D82","FT=WENN(E13+E35>=E15;E13+E35;MIN(E13+E35+SUMME(E20;E22;E23;E24;E25;E26;E27;E28;E29;E30;E31;E32;E33;E34);WENN(E15<0;0;E15)))*E82","FT=WENN(F13+F35>=F15;F13+F35;MIN(F13+F35+SUMME(F20;F22;F23;F24;F25;F26;F27;F28;F29;F30;F31;F32;F33;F34);WENN(F15<0;0;F15)))*F82","FT=WENN(G13+G35>=G15;G13+G35;MIN(G13+G35+SUMME(G20;G22;G23;G24;G25;G26;G27;G28;G29;G30;G31;G32;G33;G34);WENN(G15<0;0;G15)))*G82","FT=WENN(H13+H35>=H15;H13+H35;MIN(H13+H35+SUMME(H20;H22;H23;H24;H25;H26;H27;H28;H29;H30;H31;H32;H33;H34);WENN(H15<0;0;H15)))*H82","FT=WENN(I13+I35>=I15;I13+I35;MIN(I13+I35+SUMME(I20;I22;I23;I24;I25;I26;I27;I28;I29;I30;I31;I32;I33;I34);WENN(I15<0;0;I15)))*I82","FT=WENN(J13+J35>=J15;J13+J35;MIN(J13+J35+SUMME(J20;J22;J23;J24;J25;J26;J27;J28;J29;J30;J31;J32;J33;J34);WENN(J15<0;0;J15)))*J82","FT=WENN(K13+K35>=K15;K13+K35;MIN(K13+K35+SUMME(K20;K22;K23;K24;K25;K26;K27;K28;K29;K30;K31;K32;K33;K34);WENN(K15<0;0;K15)))*K82","FT=WENN(L13+L35>=L15;L13+L35;MIN(L13+L35+SUMME(L20;L22;L23;L24;L25;L26;L27;L28;L29;L30;L31;L32;L33;L34);WENN(L15<0;0;L15)))*L82","FT=WENN(M13+M35>=M15;M13+M35;MIN(M13+M35+SUMME(M20;M22;M23;M24;M25;M26;M27;M28;M29;M30;M31;M32;M33;M34);WENN(M15<0;0;M15)))*M82","FT=WENN(N13+N35>=N15;N13+N35;MIN(N13+N35+SUMME(N20;N22;N23;N24;N25;N26;N27;N28;N29;N30;N31;N32;N33;N34);WENN(N15<0;0;N15)))*N82","FT=WENN(O13+O35>=O15;O13+O35;MIN(O13+O35+SUMME(O20;O22;O23;O24;O25;O26;O27;O28;O29;O30;O31;O32;O33;O34);WENN(O15<0;0;O15)))*O82","FT=WENN(P13+P35>=P15;P13+P35;MIN(P13+P35+SUMME(P20;P22;P23;P24;P25;P26;P27;P28;P29;P30;P31;P32;P33;P34);WENN(P15<0;0;P15)))*P82","FT=WENN(Q13+Q35>=Q15;Q13+Q35;MIN(Q13+Q35+SUMME(Q20;Q22;Q23;Q24;Q25;Q26;Q27;Q28;Q29;Q30;Q31;Q32;Q33;Q34);WENN(Q15<0;0;Q15)))*Q82","FT=WENN(R13+R35>=R15;R13+R35;MIN(R13+R35+SUMME(R20;R22;R23;R24;R25;R26;R27;R28;R29;R30;R31;R32;R33;R34);WENN(R15<0;0;R15)))*R82","FT=WENN(S13+S35>=S15;S13+S35;MIN(S13+S35+SUMME(S20;S22;S23;S24;S25;S26;S27;S28;S29;S30;S31;S32;S33;S34);WENN(S15<0;0;S15)))*S82","FT=WENN(T13+T35>=T15;T13+T35;MIN(T13+T35+SUMME(T20;T22;T23;T24;T25;T26;T27;T28;T29;T30;T31;T32;T33;T34);WENN(T15<0;0;T15)))*T82","FT=WENN(U13+U35>=U15;U13+U35;MIN(U13+U35+SUMME(U20;U22;U23;U24;U25;U26;U27;U28;U29;U30;U31;U32;U33;U34);WENN(U15<0;0;U15)))*U82","FT=WENN(V13+V35>=V15;V13+V35;MIN(V13+V35+SUMME(V20;V22;V23;V24;V25;V26;V27;V28;V29;V30;V31;V32;V33;V34);WENN(V15<0;0;V15)))*V82","FT=WENN(W13+W35>=W15;W13+W35;MIN(W13+W35+SUMME(W20;W22;W23;W24;W25;W26;W27;W28;W29;W30;W31;W32;W33;W34);WENN(W15<0;0;W15)))*W82","FT=WENN(X13+X35>=X15;X13+X35;MIN(X13+X35+SUMME(X20;X22;X23;X24;X25;X26;X27;X28;X29;X30;X31;X32;X33;X34);WENN(X15<0;0;X15)))*X82","FT=WENN(Y13+Y35>=Y15;Y13+Y35;MIN(Y13+Y35+SUMME(Y20;Y22;Y23;Y24;Y25;Y26;Y27;Y28;Y29;Y30;Y31;Y32;Y33;Y34);WENN(Y15<0;0;Y15)))*Y82","FT=WENN(Z13+Z35>=Z15;Z13+Z35;MIN(Z13+Z35+SUMME(Z20;Z22;Z23;Z24;Z25;Z26;Z27;Z28;Z29;Z30;Z31;Z32;Z33;Z34);WENN(Z15<0;0;Z15)))*Z82","FT=WENN(AA13+AA35>=AA15;AA13+AA35;MIN(AA13+AA35+SUMME(AA20;AA22;AA23;AA24;AA25;AA26;AA27;AA28;AA29;AA30;AA31;AA32;AA33;AA34);WENN(AA15<0;0;AA15)))*AA82","FT=WENN(AB13+AB35>=AB15;AB13+AB35;MIN(AB13+AB35+SUMME(AB20;AB22;AB23;AB24;AB25;AB26;AB27;AB28;AB29;AB30;AB31;AB32;AB33;AB34);WENN(AB15<0;0;AB15)))*AB82","FT=WENN(AC13+AC35>=AC15;AC13+AC35;MIN(AC13+AC35+SUMME(AC20;AC22;AC23;AC24;AC25;AC26;AC27;AC28;AC29;AC30;AC31;AC32;AC33;AC34);WENN(AC15<0;0;AC15)))*AC82","FT=WENN(AD13+AD35>=AD15;AD13+AD35;MIN(AD13+AD35+SUMME(AD20;AD22;AD23;AD24;AD25;AD26;AD27;AD28;AD29;AD30;AD31;AD32;AD33;AD34);WENN(AD15<0;0;AD15)))*AD82","FT=WENN(AE13+AE35>=AE15;AE13+AE35;MIN(AE13+AE35+SUMME(AE20;AE22;AE23;AE24;AE25;AE26;AE27;AE28;AE29;AE30;AE31;AE32;AE33;AE34);WENN(AE15<0;0;AE15)))*AE82","FT=WENN(AF13+AF35>=AF15;AF13+AF35;MIN(AF13+AF35+SUMME(AF20;AF22;AF23;AF24;AF25;AF26;AF27;AF28;AF29;AF30;AF31;AF32;AF33;AF34);WENN(AF15<0;0;AF15)))*AF82","FT=WENN(AG13+AG35>=AG15;AG13+AG35;MIN(AG13+AG35+SUMME(AG20;AG22;AG23;AG24;AG25;AG26;AG27;AG28;AG29;AG30;AG31;AG32;AG33;AG34);WENN(AG15<0;0;AG15)))*AG82","FT=WENN(AH13+AH35>=AH15;AH13+AH35;MIN(AH13+AH35+SUMME(AH20;AH22;AH23;AH24;AH25;AH26;AH27;AH28;AH29;AH30;AH31;AH32;AH33;AH34);WENN(AH15<0;0;AH15)))*AH82"]
[null,null,null,"FT=24*(D6-D5+D8-D7+D10-D9+D12-D11)*D88","FT=24*(E6-E5+E8-E7+E10-E9+E12-E11)*E88","FT=24*(F6-F5+F8-F7+F10-F9+F12-F11)*F88","FT=24*(G6-G5+G8-G7+G10-G9+G12-G11)*G88","FT=24*(H6-H5+H8-H7+H10-H9+H12-H11)*H88","FT=24*(I6-I5+I8-I7+I10-I9+I12-I11)*I88","FT=24*(J6-J5+J8-J7+J10-J9+J12-J11)*J88","FT=24*(K6-K5+K8-K7+K10-K9+K12-K11)*K88","FT=24*(L6-L5+L8-L7+L10-L9+L12-L11)*L88","FT=24*(M6-M5+M8-M7+M10-M9+M12-M11)*M88","FT=24*(N6-N5+N8-N7+N10-N9+N12-N11)*N88","FT=24*(O6-O5+O8-O7+O10-O9+O12-O11)*O88","FT=24*(P6-P5+P8-P7+P10-P9+P12-P11)*P88","FT=24*(Q6-Q5+Q8-Q7+Q10-Q9+Q12-Q11)*Q88","FT=24*(R6-R5+R8-R7+R10-R9+R12-R11)*R88","FT=24*(S6-S5+S8-S7+S10-S9+S12-S11)*S88","FT=24*(T6-T5+T8-T7+T10-T9+T12-T11)*T88","FT=24*(U6-U5+U8-U7+U10-U9+U12-U11)*U88","FT=24*(V6-V5+V8-V7+V10-V9+V12-V11)*V88","FT=24*(W6-W5+W8-W7+W10-W9+W12-W11)*W88","FT=24*(X6-X5+X8-X7+X10-X9+X12-X11)*X88","FT=24*(Y6-Y5+Y8-Y7+Y10-Y9+Y12-Y11)*Y88","FT=24*(Z6-Z5+Z8-Z7+Z10-Z9+Z12-Z11)*Z88","FT=24*(AA6-AA5+AA8-AA7+AA10-AA9+AA12-AA11)*AA88","FT=24*(AB6-AB5+AB8-AB7+AB10-AB9+AB12-AB11)*AB88","FT=24*(AC6-AC5+AC8-AC7+AC10-AC9+AC12-AC11)*AC88","FT=24*(AD6-AD5+AD8-AD7+AD10-AD9+AD12-AD11)*AD88","FT=24*(AE6-AE5+AE8-AE7+AE10-AE9+AE12-AE11)*AE88","FT=24*(AF6-AF5+AF8-AF7+AF10-AF9+AF12-AF11)*AF88","FT=24*(AG6-AG5+AG8-AG7+AG10-AG9+AG12-AG11)*AG88","FT=24*(AH6-AH5+AH8-AH7+AH10-AH9+AH12-AH11)*AH88"]
[null,null,null,"FT=ODER(D14>0;D21>0)*1","FT=ODER(E14>0;E21>0)*1","FT=ODER(F14>0;F21>0)*1","FT=ODER(G14>0;G21>0)*1","FT=ODER(H14>0;H21>0)*1","FT=ODER(I14>0;I21>0)*1","FT=ODER(J14>0;J21>0)*1","FT=ODER(K14>0;K21>0)*1","FT=ODER(L14>0;L21>0)*1","FT=ODER(M14>0;M21>0)*1","FT=ODER(N14>0;N21>0)*1","FT=ODER(O14>0;O21>0)*1","FT=ODER(P14>0;P21>0)*1","FT=ODER(Q14>0;Q21>0)*1","FT=ODER(R14>0;R21>0)*1","FT=ODER(S14>0;S21>0)*1","FT=ODER(T14>0;T21>0)*1","FT=ODER(U14>0;U21>0)*1","FT=ODER(V14>0;V21>0)*1","FT=ODER(W14>0;W21>0)*1","FT=ODER(X14>0;X21>0)*1","FT=ODER(Y14>0;Y21>0)*1","FT=ODER(Z14>0;Z21>0)*1","FT=ODER(AA14>0;AA21>0)*1","FT=ODER(AB14>0;AB21>0)*1","FT=ODER(AC14>0;AC21>0)*1","FT=ODER(AD14>0;AD21>0)*1","FT=ODER(AE14>0;AE21>0)*1","FT=ODER(AF14>0;AF21>0)*1","FT=ODER(AG14>0;AG21>0)*1","FT=ODER(AH14>0;AH21>0)*1"]
[null,null,null,{"$f":"ABS(\"FT\"&_xlfn.FORMULATEXT(D14)<>D45)","v":0},{"$f":"ABS(\"FT\"&_xlfn.FORMULATEXT(E14)<>E45)","v":0},0,0,0,0,0,0,0,0,0,0,0,0,0,0,0,0,0,0,0,0,0,0,0,0,0,0,0,0,0]
[null,null,null,{"$f":"ABS(\"FT\"&_xlfn.FORMULATEXT(D13)<>D46)","v":0},{"$f":"ABS(\"FT\"&_xlfn.FORMULATEXT(E13)<>E46)","v":0},0,0,0,0,0,0,0,0,0,0,0,0,0,0,0,0,0,0,0,0,0,0,0,0,0,0,0,0,0]
[null,null,null,{"$f":"ABS(\"FT\"&_xlfn.FORMULATEXT(D80)<>D47)","v":0},{"$f":"ABS(\"FT\"&_xlfn.FORMULATEXT(E80)<>E47)","v":0},0,0,0,0,0,0,0,0,0,0,0,0,0,0,0,0,0,0,0,0,0,0,0,0,0,0,0,0,0]
[null,null,null,{"$f":"ABS(ISERROR(D37))","v":0},{"$f":"ABS(ISERROR(E37))","v":0},0,0,0,0,0,0,0,0,0,0,0,0,0,0,0,0,0,0,0,0,0,0,0,0,0,0,0,0,0]
[null,null,null,{"$f":"SUM(D48:D51)","v":0},{"$f":"SUM(E48:E51)","v":0},0,0,0,0,0,0,0,0,0,0,0,0,0,0,0,0,0,0,0,0,0,0,0,0,0,0,0,0,0,null,null,null,null,"Formel defekt",{"$f":"SUM(D52:AH52)","v":0}]
[]
[]
[]
[]
[]
[]
[]
[]
[]
[]
[]
[]
[]
[]
[]
[]
[]
[]
[]
[]
[]
[]
[]
[]
[null,"HT_Naz-Kopie",{"$f":"HT_NAZ","v":8.4}]
[null,"Heute:",{"$f":"SL_BisDatum","v":"2024-02-02"}]
[null,null,"Reguläre Tage ausgefüllt",{"$f":"((D80*D81)=1)*1","v":0},{"$f":"((E80*E81)=1)*1","v":0},0,0,0,0,0,0,0,0,0,0,0,0,0,0,0,0,0,0,0,0,0,0,0,0,0,0,0,0,0]
[null,null,"Arbeitstage ausgefüllt",{"$f":"OR(D14>0,D21>0)*1","v":0},{"$f":"OR(E14>0,E21>0)*1","v":0},0,0,0,0,0,0,0,0,0,0,0,0,0,0,0,0,0,0,0,0,0,0,0,0,0,0,0,0,0]
[null,null,"Arbeitstage wenn BG>0%",{"$f":"IFERROR(VLOOKUP(D3,VSA_Kalender,22),0)","v":0},0,0,0,0,0,0,0,0,0,0,0,0,0,0,0,0,0,0,0,0,0,0,0,0,0,0,0,0,0,0]
[null,null,"Der BG beträgt mehr als 0%",{"$f":"IF(D4=\"\",0,ABS(VLOOKUP(D3,VSA_Kalender,13,FALSE)>0))","v":1},1,1,1,1,1,1,1,1,1,1,1,1,1,1,1,1,1,1,1,1,1,1,1,1,1,1,1,1,1,0]
[null,null,"(Ja: 1, Nein: 0)",{"$f":"SUM(D81:AH81)","v":0},"Total Tage bei BG>0%",null,null,{"$f":"SUM(D80:AH80)","v":0},"Total Tage ausgefüllt",null,null,{"$f":"SUM(D79:AH79)","v":0},"Total reguläre Tage ausgefüllt"]
[]
[null,null,"Tag des Monats",{"$f":"D4","v":1},2,3,4,5,6,7,8,9,10,11,12,13,14,15,16,17,18,19,20,21,22,23,24,25,26,27,28,29,30,""]
[null,null,"Ist Arbeitsbereich",{"$f":"IFERROR(ABS(WEEKDAY(D3,2)<6),0)","v":0},0,1,1,1,1,1,0,0,1,1,1,1,1,0,0,1,1,1,1,1,0,0,1,1,1,1,1,0,0,0]
[null,null,"Maximaler Fehler",{"$f":"MAX(D100:D107,D98,D134)","v":0},{"$f":"MAX(E100:E107,E98,E134)","v":0},0,0,0,0,0,0,0,0,0,0,0,0,0,0,0,0,0,0,0,0,0,0,0,0,0,0,0,0,0]
[null,null,"Wird die Präsenzzeit angezeigt?",{"$f":"IF(D87=0,1,0)","v":1},{"$f":"IF(E87=0,1,0)","v":1},1,1,1,1,1,1,1,1,1,1,1,1,1,1,1,1,1,1,1,1,1,1,1,1,1,1,1,1,1]
[]
[null,null,"Gruppenfehler 1",{"$f":"IF(AND(D6-D5=0,COUNTA(D7:D12)>0),1,0)","v":0},0,0,0,0,0,0,0,0,0,0,0,0,0,0,0,0,0,0,0,0,0,0,0,0,0,0,0,0,0,0]
[null,"Gruppenfehler","(aus)",{"$f":"D90","v":0},0,0,0,0,0,0,0,0,0,0,0,0,0,0,0,0,0,0,0,0,0,0,0,0,0,0,0,0,0,0]
[null,null,"Gruppenfehler 2",{"$f":"IF(AND(D8-D7=0,COUNTA(D9:D12)>0),1,0)","v":0},0,0,0,0,0,0,0,0,0,0,0,0,0,0,0,0,0,0,0,0,0,0,0,0,0,0,0,0,0,0]
[null,null,"(aus)",{"$f":"D92","v":0},0,0,0,0,0,0,0,0,0,0,0,0,0,0,0,0,0,0,0,0,0,0,0,0,0,0,0,0,0,0]
[null,null,"Gruppenfehler 3",{"$f":"IF(AND(D10-D9=0,COUNTA(D11:D12)>0),1,0)","v":0},0,0,0,0,0,0,0,0,0,0,0,0,0,0,0,0,0,0,0,0,0,0,0,0,0,0,0,0,0,0]
[null,null,"(aus)",{"$f":"D94","v":0},0,0,0,0,0,0,0,0,0,0,0,0,0,0,0,0,0,0,0,0,0,0,0,0,0,0,0,0,0,0]
[null,null,"leer"]
[null,null,"leer"]
[null,null,"Genereller Gruppenfehler",{"$f":"MAX(D90:D95)","v":0},0,0,0,0,0,0,0,0,0,0,0,0,0,0,0,0,0,0,0,0,0,0,0,0,0,0,0,0,0,0]
[]
[null,null,"Ein1",{"$f":"IF(AND(D109=0,D110>0),1,0)","v":0},{"$f":"IF(AND(E109=0,E110>0),1,0)","v":0},0,0,0,0,0,0,0,0,0,0,0,0,0,0,0,0,0,0,0,0,0,0,0,0,0,0,0,0,0]
[null,null,"Aus1",{"$f":"IF(AND(D110>0,D110<D109),3,IF(AND(D109>0,D110=0),1,0))*D$86","v":0},{"$f":"IF(AND(E110>0,E110<E109),3,IF(AND(E109>0,E110=0),1,0))*E$86","v":0},0,0,0,0,0,0,0,0,0,0,0,0,0,0,0,0,0,0,0,0,0,0,0,0,0,0,0,0,0]
[null,null,"Ein2",{"$f":"IF(AND(D111>0,D111<D110),3,IF(AND(D111=0,D112>0),1,0))*D$86","v":0},0,0,0,0,0,0,0,0,0,0,0,0,0,0,0,0,0,0,0,0,0,0,0,0,0,0,0,0,0,0]
[null,null,"Aus2",{"$f":"IF(AND(D112>0,D112<D111),3,IF(AND(D111>0,D112=0),1,0))*D$86","v":0},{"$f":"IF(AND(E112>0,E112<E111),3,IF(AND(E111>0,E112=0),1,0))*E$86","v":0},0,0,0,0,0,0,0,0,0,0,0,0,0,0,0,0,0,0,0,0,0,0,0,0,0,0,0,0,0]
[null,"Zellenfehler","Ein3",{"$f":"IF(AND(D113>0,D113<D112),3,IF(AND(D113=0,D114>0),1,0))*D$86","v":0},{"$f":"IF(AND(E113>0,E113<E112),3,IF(AND(E113=0,E114>0),1,0))*E$86","v":0},0,0,0,0,0,0,0,0,0,0,0,0,0,0,0,0,0,0,0,0,0,0,0,0,0,0,0,0,0]
[null,null,"Aus3",{"$f":"IF(AND(D114>0,D114<D113),3,IF(AND(D113>0,D114=0),1,0))*D$86","v":0},{"$f":"IF(AND(E114>0,E114<E113),3,IF(AND(E113>0,E114=0),1,0))*E$86","v":0},0,0,0,0,0,0,0,0,0,0,0,0,0,0,0,0,0,0,0,0,0,0,0,0,0,0,0,0,0]
[null,null,"Ein4",{"$f":"IF(AND(D115>0,D115<D114),3,IF(AND(D115=0,D116>0),1,0))*D$86","v":0},{"$f":"IF(AND(E115>0,E115<E114),3,IF(AND(E115=0,E116>0),1,0))*E$86","v":0},0,0,0,0,0,0,0,0,0,0,0,0,0,0,0,0,0,0,0,0,0,0,0,0,0,0,0,0,0]
[null,null,"Aus4",{"$f":"IF(AND(D116>0,D116<D115),3,IF(AND(D115>0,D116=0),1,0))*D$86","v":0},{"$f":"IF(AND(E116>0,E116<E115),3,IF(AND(E115>0,E116=0),1,0))*E$86","v":0},0,0,0,0,0,0,0,0,0,0,0,0,0,0,0,0,0,0,0,0,0,0,0,0,0,0,0,0,0]
[]
[null,null,"Ein1",{"$f":"ROUND(D5*24,2)","v":0},0,0,0,0,0,0,0,0,0,0,0,0,0,0,0,0,0,0,0,0,0,0,0,0,0,0,0,0,0,0]
[null,null,"Aus1",0,0,0,0,0,0,0,0,0,0,0,0,0,0,0,0,0,0,0,0,0,0,0,0,0,0,0,0,0,0,0]
[null,"Zeiten dezimal gewandelt","Ein2",0,0,0,0,0,0,0,0,0,0,0,0,0,0,0,0,0,0,0,0,0,0,0,0,0,0,0,0,0,0,0]
[null,null,"Aus2",0,0,0,0,0,0,0,0,0,0,0,0,0,0,0,0,0,0,0,0,0,0,0,0,0,0,0,0,0,0,0]
[null,null,"Ein3",0,0,0,0,0,0,0,0,0,0,0,0,0,0,0,0,0,0,0,0,0,0,0,0,0,0,0,0,0,0,0]
[null,null,"Aus3",0,0,0,0,0,0,0,0,0,0,0,0,0,0,0,0,0,0,0,0,0,0,0,0,0,0,0,0,0,0,0]
[null,null,"Ein4",0,0,0,0,0,0,0,0,0,0,0,0,0,0,0,0,0,0,0,0,0,0,0,0,0,0,0,0,0,0,0]
[null,null,"Aus4",0,0,0,0,0,0,0,0,0,0,0,0,0,0,0,0,0,0,0,0,0,0,0,0,0,0,0,0,0,0,0]
[]
[null,"Pausenfehler","Gruppe1",{"$f":"IF(OR(D109=\"\",D110=\"\"),0,D110-D109)","v":0},{"$f":"IF(OR(E109=\"\",E110=\"\"),0,E110-E109)","v":0},0,0,0,0,0,0,0,0,0,0,0,0,0,0,0,{"$f":"IF(OR(U109=\"\",U110=\"\"),0,U110-U109)","v":0},{"$f":"IF(OR(V109=\"\",V110=\"\"),0,V110-V109)","v":0},0,0,0,0,0,0,0,0,0,0,0,0]
[null,null,"Gruppe2",{"$f":"IF(OR(D111=\"\",D112=\"\"),0,D112-D111)","v":0},{"$f":"IF(OR(E111=\"\",E112=\"\"),0,E112-E111)","v":0},0,0,0,0,0,0,0,0,0,0,0,0,0,0,0,{"$f":"IF(OR(U111=\"\",U112=\"\"),0,U112-U111)","v":0},{"$f":"IF(OR(V111=\"\",V112=\"\"),0,V112-V111)","v":0},0,0,0,0,0,0,0,0,0,0,0,0]
[null,null,"Gruppe3",{"$f":"IF(OR(D113=\"\",D114=\"\"),0,D114-D113)","v":0},{"$f":"IF(OR(E113=\"\",E114=\"\"),0,E114-E113)","v":0},0,0,0,0,0,0,0,0,0,0,0,0,0,0,0,{"$f":"IF(OR(U113=\"\",U114=\"\"),0,U114-U113)","v":0},{"$f":"IF(OR(V113=\"\",V114=\"\"),0,V114-V113)","v":0},0,0,0,0,0,0,0,0,0,0,0,0]
[null,null,"Gruppe4",{"$f":"IF(OR(D115=\"\",D116=\"\"),0,D116-D115)","v":0},{"$f":"IF(OR(E115=\"\",E116=\"\"),0,E116-E115)","v":0},0,0,0,0,0,0,0,0,0,0,0,0,0,0,0,{"$f":"IF(OR(U115=\"\",U116=\"\"),0,U116-U115)","v":0},{"$f":"IF(OR(V115=\"\",V116=\"\"),0,V116-V115)","v":0},0,0,0,0,0,0,0,0,0,0,0,0]
[]
[null,null,"Pause12",{"$f":"IF(OR(D110=\"\",D111=\"\"),0,D111-D110)","v":0},{"$f":"IF(OR(E110=\"\",E111=\"\"),0,E111-E110)","v":0},0,0,0,0,0,0,0,0,0,0,0,0,0,0,0,{"$f":"IF(OR(U110=\"\",U111=\"\"),0,U111-U110)","v":0},{"$f":"IF(OR(V110=\"\",V111=\"\"),0,V111-V110)","v":0},0,0,0,0,0,0,0,0,0,0,0,0]
[null,null,"Pause23",{"$f":"IF(OR(D112=\"\",D113=\"\"),0,D113-D112)","v":0},{"$f":"IF(OR(E112=\"\",E113=\"\"),0,E113-E112)","v":0},0,0,0,0,0,0,0,0,0,0,0,0,0,0,0,{"$f":"IF(OR(U112=\"\",U113=\"\"),0,U113-U112)","v":0},{"$f":"IF(OR(V112=\"\",V113=\"\"),0,V113-V112)","v":0},0,0,0,0,0,0,0,0,0,0,0,0]
[null,null,"Pause34",{"$f":"IF(OR(D114=\"\",D115=\"\"),0,D115-D114)","v":0},{"$f":"IF(OR(E114=\"\",E115=\"\"),0,E115-E114)","v":0},0,0,0,0,0,0,0,0,0,0,0,0,0,0,0,{"$f":"IF(OR(U114=\"\",U115=\"\"),0,U115-U114)","v":0},{"$f":"IF(OR(V114=\"\",V115=\"\"),0,V115-V114)","v":0},0,0,0,0,0,0,0,0,0,0,0,0]
[]
[null,null,"Kum12",{"$f":"IF(D123>=0.5,0,D118+D119)","v":0},{"$f":"IF(E123>=0.5,0,E118+E119)","v":0},0,0,0,0,0,0,0,0,0,0,0,0,0,0,0,{"$f":"IF(U123>=0.5,0,U118+U119)","v":0},{"$f":"IF(V123>=0.5,0,V118+V119)","v":0},0,0,0,0,0,0,0,0,0,0,0,0]
[null,null,"Kum123",{"$f":"IF(OR(D123>=0.5,D124>=0.5),0,D118+D119+D120)","v":0},{"$f":"IF(OR(E123>=0.5,E124>=0.5),0,E118+E119+E120)","v":0},0,0,0,0,0,0,0,0,0,0,0,0,0,0,0,{"$f":"IF(OR(U123>=0.5,U124>=0.5),0,U118+U119+U120)","v":0},{"$f":"IF(OR(V123>=0.5,V124>=0.5),0,V118+V119+V120)","v":0},0,0,0,0,0,0,0,0,0,0,0,0]
[null,null,"Kum1234",{"$f":"IF(OR(D123>=0.5,D124>=0.5,D125>=0.5),0,D118+D119+D120+D121)","v":0},{"$f":"IF(OR(E123>=0.5,E124>=0.5,E125>=0.5),0,E118+E119+E120+E121)","v":0},0,0,0,0,0,0,0,0,0,0,0,0,0,0,0,{"$f":"IF(OR(U123>=0.5,U124>=0.5,U125>=0.5),0,U118+U119+U120+U121)","v":0},{"$f":"IF(OR(V123>=0.5,V124>=0.5,V125>=0.5),0,V118+V119+V120+V121)","v":0},0,0,0,0,0,0,0,0,0,0,0,0]
[null,null,"Kum23",{"$f":"IF(D124>=0.5,0,D119+D120)","v":0},{"$f":"IF(E124>=0.5,0,E119+E120)","v":0},0,0,0,0,0,0,0,0,0,0,0,0,0,0,0,{"$f":"IF(U124>=0.5,0,U119+U120)","v":0},{"$f":"IF(V124>=0.5,0,V119+V120)","v":0},0,0,0,0,0,0,0,0,0,0,0,0]
[null,null,"Kum234",{"$f":"IF(OR(D124>=0.5,D125>=0.5),0,D119+D120+D121)","v":0},{"$f":"IF(OR(E124>=0.5,E125>=0.5),0,E119+E120+E121)","v":0},0,0,0,0,0,0,0,0,0,0,0,0,0,0,0,{"$f":"IF(OR(U124>=0.5,U125>=0.5),0,U119+U120+U121)","v":0},{"$f":"IF(OR(V124>=0.5,V125>=0.5),0,V119+V120+V121)","v":0},0,0,0,0,0,0,0,0,0,0,0,0]
[null,null,"Kum34",{"$f":"IF(D125>=0.5,0,D120+D121)","v":0},{"$f":"IF(E125>=0.5,0,E120+E121)","v":0},0,0,0,0,0,0,0,0,0,0,0,0,0,0,0,{"$f":"IF(U125>=0.5,0,U120+U121)","v":0},{"$f":"IF(V125>=0.5,0,V120+V121)","v":0},0,0,0,0,0,0,0,0,0,0,0,0]
[]
[null,null,"Pausenfehler-Code",{"$f":"IF(MAX(D118:D121,D127:D132)>6,2,0)","v":0},{"$f":"IF(MAX(E118:E121,E127:E132)>6,2,0)","v":0},0,0,0,0,0,0,0,0,0,0,0,0,0,0,0,0,0,0,0,0,0,0,0,0,0,0,0,0,0]

{"sheet":"Juli","index":12,"n_rows":134,"n_cols":45,"rows_kept":134,"cut":false,"hidden":true,"merged":[[11,34,12,35]]}
[7,{"$f":"DATEVALUE(\"1.\"&A1&\".\"&SL_Jahr)","v":"2024-07-01"},{"$f":"SL_Jahr","v":2024},{"$f":"B_Gde","v":"Gde:"},{"$f":"SL_Gemeinde","v":0},null,null,null,null,null,null,null,null,null,null,null,null,null,null,{"$f":"B_Schule","v":"Schule:"},{"$f":"SL_Schule","v":0},null,null,null,null,null,null,null,null,null,null,null,null,null,null,null,null,null,"Abschluss-Teilbedingungen:"]
[{"$f":"VLOOKUP(A1,Monatsenden,2)","v":45504},{"$f":"B_Bg","v":"BG:"},{"$f":"VLOOKUP(B1,VSA_Kalender,13)","v":1},{"$f":"B_Name","v":"Name:"},{"$f":"SL_Name","v":0},null,null,null,null,null,null,null,null,null,null,null,null,null,null,null,null,null,null,null,null,null,null,null,null,null,null,null,null,null,null,null,null,null,"Regel ok",{"$f":"(AN14>=AN15)","v":false},"Nicht Relevant",{"$f":"D83=0","v":true},-1,{"$f":"IF(AP2=TRUE,AQ2,0)","v":-1},"Nicht Relevant"]
[null,{"$f":"Zerf_Version & \" \" & Zerf_T","v":"Version VSA 1.06 "},null,{"$f":"DATE($C$1,MONTH($B$1),D$4)","v":"2024-07-01"},{"$f":"DATE($C$1,MONTH($B$1),E$4)","v":"2024-07-02"},"2024-07-03","2024-07-04","2024-07-05","2024-07-06","2024-07-07","2024-07-08","2024-07-09","2024-07-10","2024-07-11","2024-07-12","2024-07-13","2024-07-14","2024-07-15","2024-07-16","2024-07-17","2024-07-18","2024-07-19","2024-07-20","2024-07-21","2024-07-22","2024-07-23","2024-07-24","2024-07-25","2024-07-26","2024-07-27","2024-07-28",{"$f":"IF(MONTH(DATE($C$1,MONTH($B$1),AF$41))>MONTH($B$1),\"\",DATE($C$1,MONTH($B$1),AF$4))","v":"2024-07-29"},{"$f":"IF(MONTH(DATE($C$1,MONTH($B$1),AG$41))>MONTH($B$1),\"\",DATE($C$1,MONTH($B$1),AG$4))","v":"2024-07-30"},{"$f":"IF(MONTH(DATE($C$1,MONTH($B$1),AH$41))>MONTH($B$1),\"\",DATE($C$1,MONTH($B$1),AH$4))","v":"2024-07-31"},null,null,null,null,"Spalten ok",{"$f":"(L83>=D83)","v":true},"Entsperrt",false,1,{"$f":"AP3*AQ3","v":0},"Entsperrt"]
[null,{"$f":"IF(VSATestModus=TRUE(),\"VSA-Modus!\",\"\")","v":""},{"$f":"IF(AN52>0,\"DEFEKT\",\"\")","v":""},{"$f":"IF(MONTH(DATE($C$1,MONTH($B$1),D$41))>MONTH($B$1),\"\",D41)","v":1},2,3,4,5,6,7,8,9,10,11,12,13,14,15,16,17,18,19,20,21,22,23,24,25,26,27,28,{"$f":"IF(MONTH(DATE($C$1,MONTH($B$1),AF$41))>MONTH($B$1),\"\",AF41)","v":29},{"$f":"IF(MONTH(DATE($C$1,MONTH($B$1),AG$41))>MONTH($B$1),\"\",AG41)","v":30},{"$f":"IF(MONTH(DATE($C$1,MONTH($B$1),AH$41))>MONTH($B$1),\"\",AH41)","v":31},null,null,null,null,"Keine Fehler",{"$f":"(SUM(D87:AH87)=0)","v":true},"Geändert",false,2,{"$f":"AP4*AQ4","v":0},"Geändert"]
[null,"     Ein   >>>",null,null,null,null,null,null,null,null,null,null,null,null,null,null,null,null,null,null,null,null,null,null,null,null,null,null,null,null,null,null,null,null,null,null,null,null,"Keine Hand",{"$f":"(AI12=\"\")","v":true},"Sperre",{"$f":"AS11=2","v":false},3,{"$f":"NOT(AP6)*AQ5","v":3},"Eingaben vornehmen"]
[null,"<<<   Aus     ",null,null,null,null,null,null,null,null,null,null,null,null,null,null,null,null,null,null,null,null,null,null,null,null,null,null,null,null,null,null,null,null,null,null,null,null,null,null,"Abschliessbar 1",{"$f":"AND(OR(AN2,AN3),AN4,AN5,NOT(AP7),NOT(AP2))","v":false},4,{"$f":"AND(NOT(OR(AP3,AP4)),AP6)*AQ6","v":0},"Abschliessbar 1"]
[null,"     Ein   >>>",null,null,null,null,null,null,null,null,null,null,null,null,null,null,null,null,null,null,null,null,null,null,null,null,null,null,null,null,null,null,null,null,null,null,null,null,null,null,"Abgeschlossen",false,5,{"$f":"AND(NOT(OR(AP3,AP4)),AP7)*AQ7","v":0},"Abgeschlossen"]
[null,"<<<   Aus     ",null,null,null,null,null,null,null,null,null,null,null,null,null,null,null,null,null,null,null,null,null,null,null,null,null,null,null,null,null,null,null,null,null,null,null,null,null,null,"Für Jahr OK",{"$f":"AND(OR(AP2,AP7),NOT(AP3))","v":true}]
[null,"     Ein   >>>"]
[null,"<<<   Aus     ",null,null,null,null,null,null,null,null,null,null,null,null,null,null,null,null,null,null,null,null,null,null,null,null,null,null,null,null,null,null,null,null,null,null,null,null,null,null,"Statusnummer:",{"$f":"IF(AR2=AQ2,AQ2,MAX(AR2:AR7))","v":-1}]
[null,"     Ein   >>>",null,null,null,null,null,null,null,null,null,null,null,null,null,null,null,null,null,null,null,null,null,null,null,null,null,null,null,null,null,null,null,null,null,null,null,null,"HatDaten:",{"$f":"AND(AP2=FALSE,OR(AP10<>3,COUNTA(D5:AH12,D20:AH35,D39:L40)>0))","v":false},"Statustext:",{"$f":"IFERROR(VLOOKUP(AP10,AR2:AS7,2,FALSE),\"unbekannt\")","v":"Nicht Relevant"},null,null,1]
[null,"<<<   Aus     ",null,null,null,null,null,null,null,null,null,null,null,null,null,null,null,null,null,null,null,null,null,null,null,null,null,null,null,null,null,null,null,null,{"$f":"IF(COUNTIF(D37:AH37,\"I\")>0,\"I\",\"\")","v":""}]
[null,{"$f":"B_PrZeit","v":"Präsenzzeit"},null,{"$f":"24*(D6-D5+D8-D7+D10-D9+D12-D11)*D88","v":0},{"$f":"24*(E6-E5+E8-E7+E10-E9+E12-E11)*E88","v":0},0,0,0,0,0,0,0,0,0,0,0,0,0,0,0,0,0,0,0,0,0,0,0,0,0,0,0,0,0,null,null,null,null,"Anzahl Regeltage:",{"$f":"D83","v":0}]
[null,{"$f":"B_TotalAZist","v":"Total Arbeitszeit (IST)"},null,{"$f":"IF(D13+D35>=D15,D13+D35,MIN(D13+D35+SUM(D20,D22,D23,D24,D25,D26,D27,D28,D29,D30,D31,D32,D33,D34),IF(D15<0,0,D15)))*D82","v":0},0,0,0,0,0,0,0,0,0,0,0,0,0,{"$f":"IF(R13+R35>=R15,R13+R35,MIN(R13+R35+SUM(R20,R22,R23,R24,R25,R26,R27,R28,R29,R30,R31,R32,R33,R34),IF(R15<0,0,R15)))*R82","v":0},{"$f":"IF(S13+S35>=S15,S13+S35,MIN(S13+S35+SUM(S20,S22,S23,S24,S25,S26,S27,S28,S29,S30,S31,S32,S33,S34),IF(S15<0,0,S15)))*S82","v":0},{"$f":"IF(T13+T35>=T15,T13+T35,MIN(T13+T35+SUM(T20,T22,T23,T24,T25,T26,T27,T28,T29,T30,T31,T32,T33,T34),IF(T15<0,0,T15)))*T82","v":0},{"$f":"IF(U13+U35>=U15,U13+U35,MIN(U13+U35+SUM(U20,U22,U23,U24,U25,U26,U27,U28,U29,U30,U31,U32,U33,U34),IF(U15<0,0,U15)))*U82","v":0},0,0,0,0,0,0,0,0,0,0,0,0,0,{"$f":"SUMIF($D$82:$AH$82,1,D14:AH14)","v":0},{"$f":"AI14-AI15","v":0},null,null,"Erfasste Regeltage",{"$f":"L83","v":0},{"$f":"AN13-AN14","v":0},"Fehlende Regeltage"]
[null,{"$f":"B_NettoSollAZ","v":"Netto-SOLL-Arbeitszeit"},null,{"$f":"ROUND(D16-D19,2)","v":0},{"$f":"ROUND(E16-E19,2)","v":0},0,0,0,0,0,0,0,0,0,0,0,0,0,0,0,0,0,0,0,0,0,0,0,0,0,0,{"$f":"IF(AF$42=4,0,ROUND(AF16-AF19,2))","v":0},{"$f":"IF(AG$42=4,0,ROUND(AG16-AG19,2))","v":0},0,{"$f":"SUMIF($D$82:$AH$82,1,D15:AH15)","v":0},null,null,null,"Minimum Regeltage",{"$f":"MinRegeltage","v":1},"Ist als Konstante im Blatt \"Intern\" hinterlegt"]
[null,{"$f":"B_BruttoSollAZ","v":"Brutto-SOLL-Arb.zeit"},null,{"$f":"VLOOKUP(D3,VSA_Kalender,16)","v":0},0,0,0,0,0,0,0,0,0,0,0,0,0,0,0,0,0,0,0,0,0,0,0,0,0,0,0,{"$f":"IF(AF$42=4,0,VLOOKUP(AF3,VSA_Kalender,16))","v":0},{"$f":"IF(AG$42=4,0,VLOOKUP(AG3,VSA_Kalender,16))","v":0},{"$f":"IF(AH$42=4,0,VLOOKUP(AH3,VSA_Kalender,16))","v":0},null,null,null,null,"Regel ok","Mind. eigetr. Regeltage erfüllt"]
[null,{"$f":"B_MehrMinder","v":"Mehr-/Minderleistung"},null,{"$f":"(SL_BisDatum>=D3)*ROUND(D14-D15,2)","v":0},0,0,0,0,0,0,0,0,0,0,0,0,0,0,0,0,0,0,0,0,0,0,0,0,0,0,0,0,0,0,{"$f":"B_Total","v":"Total"},{"$f":"B_Vortrag","v":"Vortrag"},null,null,"Spalten ok:","Alle Einträge an Regeltagen ok"]
[null,{"$f":"B_AZSaldo","v":"AZ - Saldo"},{"$f":"VLOOKUP(ROW(),VSA_Uebertrag,$A$1+3)","v":16.8},{"$f":"IFERROR((C18+D17)*(D3<=SL_BisDatum)*VLOOKUP(D3,VSA_Kalender,21,FALSE),0)","v":0},0,0,{"$f":"IFERROR((F18+G17)*(G3<=SL_BisDatum)*VLOOKUP(G3,VSA_Kalender,21,FALSE),0)","v":0},0,0,0,0,0,0,0,0,0,0,0,0,0,0,0,0,0,0,0,0,0,0,0,0,0,0,0,null,{"$f":"SUMIF($D$82:$AH$82,1,D17:AH17)+C18","v":16.8}]
[null,{"$f":"B_FTA","v":"Feiertagsanspruch"},0,{"$f":"VLOOKUP(D3,VSA_Kalender,14)","v":0},0,0,0,0,0,0,0,0,0,0,0,0,0,0,0,0,0,0,0,0,0,0,0,0,0,0,0,{"$f":"IF(AF$42=4,0,VLOOKUP(AF3,VSA_Kalender,14))","v":0},{"$f":"IF(AG$42=4,0,VLOOKUP(AG3,VSA_Kalender,14))","v":0},{"$f":"IF(AH$42=4,0,VLOOKUP(AH3,VSA_Kalender,14))","v":0},{"$f":"SUM(D19:AH19)","v":0}]
[null,{"$f":"B_Ferien","v":"Ferien"},{"$f":"VLOOKUP(ROW(),VSA_Uebertrag,$A$1+3)","v":0},null,null,null,null,null,null,null,null,null,null,null,null,null,null,null,null,null,null,null,null,null,null,null,null,null,null,null,null,null,null,null,{"$f":"SUMIF($D$82:$AH$82,1,D20:AH20)","v":0},{"$f":"ROUND(C20-AI20,2)","v":0},"Rest"]
[null,{"$f":"B_KompAZ","v":"Kompensation Arbeitstage"},0,null,null,null,null,null,null,null,null,null,null,null,null,null,null,null,null,null,null,null,null,null,null,null,null,null,null,null,null,null,null,null,0,{"$f":"ROUND(A21+C21-AI21,0)","v":0}]
[null,{"$f":"B_Arzt","v":"Arztbesuch"},0,null,null,null,null,null,null,null,null,null,null,null,null,null,null,null,null,null,null,null,null,null,null,null,null,null,null,null,null,null,null,null,0,{"$f":"ROUND(A22+C22+AI22,2)","v":0},"Summen"]
[null,{"$f":"B_Krank","v":"Krankheit"},0,null,null,null,null,null,null,null,null,null,null,null,null,null,null,null,null,null,null,null,null,null,null,null,null,null,null,null,null,null,null,null,0,{"$f":"ROUND(A23+C23+AI23,2)","v":0}]
[null,{"$f":"B_BU","v":"Berufsunfall"},0,null,null,null,null,null,null,null,null,null,null,null,null,null,null,null,null,null,null,null,null,null,null,null,null,null,null,null,null,null,null,null,0,0]
[null,{"$f":"B_NBU","v":"Nichtberufsunfall"},0,null,null,null,null,null,null,null,null,null,null,null,null,null,null,null,null,null,null,null,null,null,null,null,null,null,null,null,null,null,null,null,0,0]
[null,{"$f":"B_MilZiv","v":"Militär / Zivilschutz"},0,null,null,null,null,null,null,null,null,null,null,null,null,null,null,null,null,null,null,null,null,null,null,null,null,null,null,null,null,null,null,null,0,0]
[null,{"$f":"B_UUB","v":"Unbezahlter Urlaub"},0,null,null,null,null,null,null,null,null,null,null,null,null,null,null,null,null,null,null,null,null,null,null,null,null,null,null,null,null,null,null,null,0,{"$f":"ROUND(A27+C27-AI27,2)","v":0},"Rest"]
[null,{"$f":"B_UB","v":"Bezahlter Urlaub"},0,null,null,null,null,null,null,null,null,null,null,null,null,null,null,null,null,null,null,null,null,null,null,null,null,null,null,null,null,null,null,null,0,{"$f":"ROUND(A28+C28-AI28,2)","v":0}]
[null,{"$f":"B_NebenB","v":"Nebenbeschäftigung"},0,null,null,null,null,null,null,null,null,null,null,null,null,null,null,null,null,null,null,null,null,null,null,null,null,null,null,null,null,null,null,null,0,0]
[null,{"$f":"B_DAG","v":"D A G"},0,null,null,null,null,null,null,null,null,null,null,null,null,null,null,null,null,null,null,null,null,null,null,null,null,null,null,null,null,null,null,null,0,0]
[null,{"$f":"B_Divers","v":"Diverses"},0,null,null,null,null,null,null,null,null,null,null,null,null,null,null,null,null,null,null,null,null,null,null,null,null,null,null,null,null,null,null,null,0,0,"Summen"]
[null,{"$f":"B_FamPersErg","v":"Fam./pers. Ereignisse"},0,null,null,null,null,null,null,null,null,null,null,null,null,null,null,null,null,null,null,null,null,null,null,null,null,null,null,null,null,null,null,null,0,0]
[null,{"$f":"B_FZ1","v":"freie Zeile 1"},0,null,null,null,null,null,null,null,null,null,null,null,null,null,null,null,null,null,null,null,null,null,null,null,null,null,null,null,null,null,null,null,0,0]
[null,{"$f":"B_FZ2","v":"freie Zeile 2"},0,null,null,null,null,null,null,null,null,null,null,null,null,null,null,null,null,null,null,null,null,null,null,null,null,null,null,null,null,null,null,null,0,0]
[null,{"$f":"B_WB","v":"Weiterbildung"},0,null,null,null,null,null,null,null,null,null,null,null,null,null,null,null,null,null,null,null,null,null,null,null,null,null,null,null,null,null,null,null,0,0]
[null,{"$f":"B_FEL","v":"frei einsetzbare Lekt."},0,null,null,null,null,null,null,null,null,null,null,null,null,null,null,null,null,null,null,null,null,null,null,null,null,null,null,null,null,null,null,null,{"$f":"SUM(D36:AH36)","v":0},{"$f":"ROUND(C36-AI36,0)","v":0}]
[null,null,null,{"$f":"IF(AND((D13 - D15)+SUM(D20,D22:D34)>0.00001,SUM(D20,D22:D34)>0),\"I\",\"\")","v":""},"","","","","","","","","","","","","","","","","","","","","","","","","","","","","",""]
[null,null,"Visum","Identität:",null,null,null,null,"Datum:",null,"Status:"]
[null,null,"SL"]
[null,null,"VG"]
[null,null,null,1,2,3,4,5,6,7,8,9,10,11,12,13,14,15,16,17,18,19,20,21,22,23,24,25,26,27,28,29,30,31]
[null,null,null,{"$f":"IF(D3=\"\",4,VLOOKUP(D3,VSA_Kalender,18))","v":0},0,0,0,0,1,1,0,0,0,0,0,1,1,0,0,0,0,0,1,1,0,0,0,0,0,1,1,0,0,0]
[]
[null,null,null,{"$f":"IF(D19>0,VLOOKUP(D3,KalFeiertage,6,FALSE),\"\")","v":""},"","","","","","","","","","","","","","","","","","","","","","","","","","","","","",""]
[null,null,null,"FT=WENN(D13+D35>=D15;D13+D35;MIN(D13+D35+SUMME(D20;D22;D23;D24;D25;D26;D27;D28;D29;D30;D31;D32;D33;D34);WENN(D15<0;0;D15)))*D82","FT=WENN(E13+E35>=E15;E13+E35;MIN(E13+E35+SUMME(E20;E22;E23;E24;E25;E26;E27;E28;E29;E30;E31;E32;E33;E34);WENN(E15<0;0;E15)))*E82","FT=WENN(F13+F35>=F15;F13+F35;MIN(F13+F35+SUMME(F20;F22;F23;F24;F25;F26;F27;F28;F29;F30;F31;F32;F33;F34);WENN(F15<0;0;F15)))*F82","FT=WENN(G13+G35>=G15;G13+G35;MIN(G13+G35+SUMME(G20;G22;G23;G24;G25;G26;G27;G28;G29;G30;G31;G32;G33;G34);WENN(G15<0;0;G15)))*G82","FT=WENN(H13+H35>=H15;H13+H35;MIN(H13+H35+SUMME(H20;H22;H23;H24;H25;H26;H27;H28;H29;H30;H31;H32;H33;H34);WENN(H15<0;0;H15)))*H82","FT=WENN(I13+I35>=I15;I13+I35;MIN(I13+I35+SUMME(I20;I22;I23;I24;I25;I26;I27;I28;I29;I30;I31;I32;I33;I34);WENN(I15<0;0;I15)))*I82","FT=WENN(J13+J35>=J15;J13+J35;MIN(J13+J35+SUMME(J20;J22;J23;J24;J25;J26;J27;J28;J29;J30;J31;J32;J33;J34);WENN(J15<0;0;J15)))*J82","FT=WENN(K13+K35>=K15;K13+K35;MIN(K13+K35+SUMME(K20;K22;K23;K24;K25;K26;K27;K28;K29;K30;K31;K32;K33;K34);WENN(K15<0;0;K15)))*K82","FT=WENN(L13+L35>=L15;L13+L35;MIN(L13+L35+SUMME(L20;L22;L23;L24;L25;L26;L27;L28;L29;L30;L31;L32;L33;L34);WENN(L15<0;0;L15)))*L82","FT=WENN(M13+M35>=M15;M13+M35;MIN(M13+M35+SUMME(M20;M22;M23;M24;M25;M26;M27;M28;M29;M30;M31;M32;M33;M34);WENN(M15<0;0;M15)))*M82","FT=WENN(N13+N35>=N15;N13+N35;MIN(N13+N35+SUMME(N20;N22;N23;N24;N25;N26;N27;N28;N29;N30;N31;N32;N33;N34);WENN(N15<0;0;N15)))*N82","FT=WENN(O13+O35>=O15;O13+O35;MIN(O13+O35+SUMME(O20;O22;O23;O24;O25;O26;O27;O28;O29;O30;O31;O32;O33;O34);WENN(O15<0;0;O15)))*O82","FT=WENN(P13+P35>=P15;P13+P35;MIN(P13+P35+SUMME(P20;P22;P23;P24;P25;P26;P27;P28;P29;P30;P31;P32;P33;P34);WENN(P15<0;0;P15)))*P82","FT=WENN(Q13+Q35>=Q15;Q13+Q35;MIN(Q13+Q35+SUMME(Q20;Q22;Q23;Q24;Q25;Q26;Q27;Q28;Q29;Q30;Q31;Q32;Q33;Q34);WENN(Q15<0;0;Q15)))*Q82","FT=WENN(R13+R35>=R15;R13+R35;MIN(R13+R35+SUMME(R20;R22;R23;R24;R25;R26;R27;R28;R29;R30;R31;R32;R33;R34);WENN(R15<0;0;R15)))*R82","FT=WENN(S13+S35>=S15;S13+S35;MIN(S13+S35+SUMME(S20;S22;S23;S24;S25;S26;S27;S28;S29;S30;S31;S32;S33;S34);WENN(S15<0;0;S15)))*S82","FT=WENN(T13+T35>=T15;T13+T35;MIN(T13+T35+SUMME(T20;T22;T23;T24;T25;T26;T27;T28;T29;T30;T31;T32;T33;T34);WENN(T15<0;0;T15)))*T82","FT=WENN(U13+U35>=U15;U13+U35;MIN(U13+U35+SUMME(U20;U22;U23;U24;U25;U26;U27;U28;U29;U30;U31;U32;U33;U34);WENN(U15<0;0;U15)))*U82","FT=WENN(V13+V35>=V15;V13+V35;MIN(V13+V35+SUMME(V20;V22;V23;V24;V25;V26;V27;V28;V29;V30;V31;V32;V33;V34);WENN(V15<0;0;V15)))*V82","FT=WENN(W13+W35>=W15;W13+W35;MIN(W13+W35+SUMME(W20;W22;W23;W24;W25;W26;W27;W28;W29;W30;W31;W32;W33;W34);WENN(W15<0;0;W15)))*W82","FT=WENN(X13+X35>=X15;X13+X35;MIN(X13+X35+SUMME(X20;X22;X23;X24;X25;X26;X27;X28;X29;X30;X31;X32;X33;X34);WENN(X15<0;0;X15)))*X82","FT=WENN(Y13+Y35>=Y15;Y13+Y35;MIN(Y13+Y35+SUMME(Y20;Y22;Y23;Y24;Y25;Y26;Y27;Y28;Y29;Y30;Y31;Y32;Y33;Y34);WENN(Y15<0;0;Y15)))*Y82","FT=WENN(Z13+Z35>=Z15;Z13+Z35;MIN(Z13+Z35+SUMME(Z20;Z22;Z23;Z24;Z25;Z26;Z27;Z28;Z29;Z30;Z31;Z32;Z33;Z34);WENN(Z15<0;0;Z15)))*Z82","FT=WENN(AA13+AA35>=AA15;AA13+AA35;MIN(AA13+AA35+SUMME(AA20;AA22;AA23;AA24;AA25;AA26;AA27;AA28;AA29;AA30;AA31;AA32;AA33;AA34);WENN(AA15<0;0;AA15)))*AA82","FT=WENN(AB13+AB35>=AB15;AB13+AB35;MIN(AB13+AB35+SUMME(AB20;AB22;AB23;AB24;AB25;AB26;AB27;AB28;AB29;AB30;AB31;AB32;AB33;AB34);WENN(AB15<0;0;AB15)))*AB82","FT=WENN(AC13+AC35>=AC15;AC13+AC35;MIN(AC13+AC35+SUMME(AC20;AC22;AC23;AC24;AC25;AC26;AC27;AC28;AC29;AC30;AC31;AC32;AC33;AC34);WENN(AC15<0;0;AC15)))*AC82","FT=WENN(AD13+AD35>=AD15;AD13+AD35;MIN(AD13+AD35+SUMME(AD20;AD22;AD23;AD24;AD25;AD26;AD27;AD28;AD29;AD30;AD31;AD32;AD33;AD34);WENN(AD15<0;0;AD15)))*AD82","FT=WENN(AE13+AE35>=AE15;AE13+AE35;MIN(AE13+AE35+SUMME(AE20;AE22;AE23;AE24;AE25;AE26;AE27;AE28;AE29;AE30;AE31;AE32;AE33;AE34);WENN(AE15<0;0;AE15)))*AE82","FT=WENN(AF13+AF35>=AF15;AF13+AF35;MIN(AF13+AF35+SUMME(AF20;AF22;AF23;AF24;AF25;AF26;AF27;AF28;AF29;AF30;AF31;AF32;AF33;AF34);WENN(AF15<0;0;AF15)))*AF82","FT=WENN(AG13+AG35>=AG15;AG13+AG35;MIN(AG13+AG35+SUMME(AG20;AG22;AG23;AG24;AG25;AG26;AG27;AG28;AG29;AG30;AG31;AG32;AG33;AG34);WENN(AG15<0;0;AG15)))*AG82","FT=WENN(AH13+AH35>=AH15;AH13+AH35;MIN(AH13+AH35+SUMME(AH20;AH22;AH23;AH24;AH25;AH26;AH27;AH28;AH29;AH30;AH31;AH32;AH33;AH34);WENN(AH15<0;0;AH15)))*AH82"]
[null,null,null,"FT=24*(D6-D5+D8-D7+D10-D9+D12-D11)*D88","FT=24*(E6-E5+E8-E7+E10-E9+E12-E11)*E88","FT=24*(F6-F5+F8-F7+F10-F9+F12-F11)*F88","FT=24*(G6-G5+G8-G7+G10-G9+G12-G11)*G88","FT=24*(H6-H5+H8-H7+H10-H9+H12-H11)*H88","FT=24*(I6-I5+I8-I7+I10-I9+I12-I11)*I88","FT=24*(J6-J5+J8-J7+J10-J9+J12-J11)*J88","FT=24*(K6-K5+K8-K7+K10-K9+K12-K11)*K88","FT=24*(L6-L5+L8-L7+L10-L9+L12-L11)*L88","FT=24*(M6-M5+M8-M7+M10-M9+M12-M11)*M88","FT=24*(N6-N5+N8-N7+N10-N9+N12-N11)*N88","FT=24*(O6-O5+O8-O7+O10-O9+O12-O11)*O88","FT=24*(P6-P5+P8-P7+P10-P9+P12-P11)*P88","FT=24*(Q6-Q5+Q8-Q7+Q10-Q9+Q12-Q11)*Q88","FT=24*(R6-R5+R8-R7+R10-R9+R12-R11)*R88","FT=24*(S6-S5+S8-S7+S10-S9+S12-S11)*S88","FT=24*(T6-T5+T8-T7+T10-T9+T12-T11)*T88","FT=24*(U6-U5+U8-U7+U10-U9+U12-U11)*U88","FT=24*(V6-V5+V8-V7+V10-V9+V12-V11)*V88","FT=24*(W6-W5+W8-W7+W10-W9+W12-W11)*W88","FT=24*(X6-X5+X8-X7+X10-X9+X12-X11)*X88","FT=24*(Y6-Y5+Y8-Y7+Y10-Y9+Y12-Y11)*Y88","FT=24*(Z6-Z5+Z8-Z7+Z10-Z9+Z12-Z11)*Z88","FT=24*(AA6-AA5+AA8-AA7+AA10-AA9+AA12-AA11)*AA88","FT=24*(AB6-AB5+AB8-AB7+AB10-AB9+AB12-AB11)*AB88","FT=24*(AC6-AC5+AC8-AC7+AC10-AC9+AC12-AC11)*AC88","FT=24*(AD6-AD5+AD8-AD7+AD10-AD9+AD12-AD11)*AD88","FT=24*(AE6-AE5+AE8-AE7+AE10-AE9+AE12-AE11)*AE88","FT=24*(AF6-AF5+AF8-AF7+AF10-AF9+AF12-AF11)*AF88","FT=24*(AG6-AG5+AG8-AG7+AG10-AG9+AG12-AG11)*AG88","FT=24*(AH6-AH5+AH8-AH7+AH10-AH9+AH12-AH11)*AH88"]
[null,null,null,"FT=ODER(D14>0;D21>0)*1","FT=ODER(E14>0;E21>0)*1","FT=ODER(F14>0;F21>0)*1","FT=ODER(G14>0;G21>0)*1","FT=ODER(H14>0;H21>0)*1","FT=ODER(I14>0;I21>0)*1","FT=ODER(J14>0;J21>0)*1","FT=ODER(K14>0;K21>0)*1","FT=ODER(L14>0;L21>0)*1","FT=ODER(M14>0;M21>0)*1","FT=ODER(N14>0;N21>0)*1","FT=ODER(O14>0;O21>0)*1","FT=ODER(P14>0;P21>0)*1","FT=ODER(Q14>0;Q21>0)*1","FT=ODER(R14>0;R21>0)*1","FT=ODER(S14>0;S21>0)*1","FT=ODER(T14>0;T21>0)*1","FT=ODER(U14>0;U21>0)*1","FT=ODER(V14>0;V21>0)*1","FT=ODER(W14>0;W21>0)*1","FT=ODER(X14>0;X21>0)*1","FT=ODER(Y14>0;Y21>0)*1","FT=ODER(Z14>0;Z21>0)*1","FT=ODER(AA14>0;AA21>0)*1","FT=ODER(AB14>0;AB21>0)*1","FT=ODER(AC14>0;AC21>0)*1","FT=ODER(AD14>0;AD21>0)*1","FT=ODER(AE14>0;AE21>0)*1","FT=ODER(AF14>0;AF21>0)*1","FT=ODER(AG14>0;AG21>0)*1","FT=ODER(AH14>0;AH21>0)*1"]
[null,null,null,{"$f":"ABS(\"FT\"&_xlfn.FORMULATEXT(D14)<>D45)","v":0},{"$f":"ABS(\"FT\"&_xlfn.FORMULATEXT(E14)<>E45)","v":0},0,0,0,0,0,0,0,0,0,0,0,0,0,0,0,0,0,0,0,0,0,0,0,0,0,0,0,0,0]
[null,null,null,{"$f":"ABS(\"FT\"&_xlfn.FORMULATEXT(D13)<>D46)","v":0},{"$f":"ABS(\"FT\"&_xlfn.FORMULATEXT(E13)<>E46)","v":0},0,0,0,0,0,0,0,0,0,0,0,0,0,0,0,0,0,0,0,0,0,0,0,0,0,0,0,0,0]
[null,null,null,{"$f":"ABS(\"FT\"&_xlfn.FORMULATEXT(D80)<>D47)","v":0},{"$f":"ABS(\"FT\"&_xlfn.FORMULATEXT(E80)<>E47)","v":0},0,0,0,0,0,0,0,0,0,0,0,0,0,0,0,0,0,0,0,0,0,0,0,0,0,0,0,0,0]
[null,null,null,{"$f":"ABS(ISERROR(D37))","v":0},{"$f":"ABS(ISERROR(E37))","v":0},0,0,0,0,0,0,0,0,0,0,0,0,0,0,0,0,0,0,0,0,0,0,0,0,0,0,0,0,0]
[null,null,null,{"$f":"SUM(D48:D51)","v":0},{"$f":"SUM(E48:E51)","v":0},0,0,0,0,0,0,0,0,0,0,0,0,0,0,0,0,0,0,0,0,0,0,0,0,0,0,0,0,0,null,null,null,null,"Formel defekt",{"$f":"SUM(D52:AH52)","v":0}]
[]
[]
[]
[]
[]
[]
[]
[]
[]
[]
[]
[]
[]
[]
[]
[]
[]
[]
[]
[]
[]
[]
[]
[]
[null,"HT_Naz-Kopie",{"$f":"HT_NAZ","v":8.4}]
[null,"Heute:",{"$f":"SL_BisDatum","v":"2024-02-02"}]
[null,null,"Reguläre Tage ausgefüllt",{"$f":"((D80*D81)=1)*1","v":0},{"$f":"((E80*E81)=1)*1","v":0},0,0,0,0,0,0,0,0,0,0,0,0,0,0,0,0,0,0,0,0,0,0,0,0,0,0,0,0,0]
[null,null,"Arbeitstage ausgefüllt",{"$f":"OR(D14>0,D21>0)*1","v":0},{"$f":"OR(E14>0,E21>0)*1","v":0},0,0,0,0,0,0,0,0,0,0,0,0,0,0,0,0,0,0,0,0,0,0,0,0,0,0,0,0,0]
[null,null,"Arbeitstage wenn BG>0%",{"$f":"IFERROR(VLOOKUP(D3,VSA_Kalender,22),0)","v":0},0,0,0,0,0,0,0,0,0,0,0,0,0,0,0,0,0,0,0,0,0,0,0,0,0,0,0,0,0,0]
[null,null,"Der BG beträgt mehr als 0%",{"$f":"IF(D4=\"\",0,ABS(VLOOKUP(D3,VSA_Kalender,13,FALSE)>0))","v":1},1,1,1,1,1,1,1,1,1,1,1,1,1,1,1,1,1,1,1,1,1,1,1,1,1,1,1,1,1,1]
[null,null,"(Ja: 1, Nein: 0)",{"$f":"SUM(D81:AH81)","v":0},"Total Tage bei BG>0%",null,null,{"$f":"SUM(D80:AH80)","v":0},"Total Tage ausgefüllt",null,null,{"$f":"SUM(D79:AH79)","v":0},"Total reguläre Tage ausgefüllt"]
[]
[null,null,"Tag des Monats",{"$f":"D4","v":1},2,3,4,5,6,7,8,9,10,11,12,13,14,15,16,17,18,19,20,21,22,23,24,25,26,27,28,29,30,31]
[null,null,"Ist Arbeitsbereich",{"$f":"IFERROR(ABS(WEEKDAY(D3,2)<6),0)","v":1},1,1,1,1,0,0,1,1,1,1,1,0,0,1,1,1,1,1,0,0,1,1,1,1,1,0,0,1,1,1]
[null,null,"Maximaler Fehler",{"$f":"MAX(D100:D107,D98,D134)","v":0},{"$f":"MAX(E100:E107,E98,E134)","v":0},0,0,0,0,0,0,0,0,0,0,0,0,0,0,0,0,0,0,0,0,0,0,0,0,0,0,0,0,0]
[null,null,"Wird die Präsenzzeit angezeigt?",{"$f":"IF(D87=0,1,0)","v":1},{"$f":"IF(E87=0,1,0)","v":1},1,1,1,1,1,1,1,1,1,1,1,1,1,1,1,1,1,1,1,1,1,1,1,1,1,1,1,1,1]
[]
[null,null,"Gruppenfehler 1",{"$f":"IF(AND(D6-D5=0,COUNTA(D7:D12)>0),1,0)","v":0},0,0,0,0,0,0,0,0,0,0,0,0,0,0,0,0,0,0,0,0,0,0,0,0,0,0,0,0,0,0]
[null,"Gruppenfehler","(aus)",{"$f":"D90","v":0},0,0,0,0,0,0,0,0,0,0,0,0,0,0,0,0,0,0,0,0,0,0,0,0,0,0,0,0,0,0]
[null,null,"Gruppenfehler 2",{"$f":"IF(AND(D8-D7=0,COUNTA(D9:D12)>0),1,0)","v":0},0,0,0,0,0,0,0,0,0,0,0,0,0,0,0,0,0,0,0,0,0,0,0,0,0,0,0,0,0,0]
[null,null,"(aus)",{"$f":"D92","v":0},0,0,0,0,0,0,0,0,0,0,0,0,0,0,0,0,0,0,0,0,0,0,0,0,0,0,0,0,0,0]
[null,null,"Gruppenfehler 3",{"$f":"IF(AND(D10-D9=0,COUNTA(D11:D12)>0),1,0)","v":0},0,0,0,0,0,0,0,0,0,0,0,0,0,0,0,0,0,0,0,0,0,0,0,0,0,0,0,0,0,0]
[null,null,"(aus)",{"$f":"D94","v":0},0,0,0,0,0,0,0,0,0,0,0,0,0,0,0,0,0,0,0,0,0,0,0,0,0,0,0,0,0,0]
[null,null,"leer"]
[null,null,"leer"]
[null,null,"Genereller Gruppenfehler",{"$f":"MAX(D90:D95)","v":0},0,0,0,0,0,0,0,0,0,0,0,0,0,0,0,0,0,0,0,0,0,0,0,0,0,0,0,0,0,0]
[]
[null,null,"Ein1",{"$f":"IF(AND(D109=0,D110>0),1,0)","v":0},{"$f":"IF(AND(E109=0,E110>0),1,0)","v":0},0,0,0,0,0,0,0,0,0,0,0,0,0,0,0,0,0,0,0,0,0,0,0,0,0,0,0,0,0]
[null,null,"Aus1",{"$f":"IF(AND(D110>0,D110<D109),3,IF(AND(D109>0,D110=0),1,0))*D$86","v":0},{"$f":"IF(AND(E110>0,E110<E109),3,IF(AND(E109>0,E110=0),1,0))*E$86","v":0},0,0,0,0,0,0,0,0,0,0,0,0,0,0,0,0,0,0,0,0,0,0,0,0,0,0,0,0,0]
[null,null,"Ein2",{"$f":"IF(AND(D111>0,D111<D110),3,IF(AND(D111=0,D112>0),1,0))*D$86","v":0},0,0,0,0,0,0,0,0,0,0,0,0,0,0,0,0,0,0,0,0,0,0,0,0,0,0,0,0,0,0]
[null,null,"Aus2",{"$f":"IF(AND(D112>0,D112<D111),3,IF(AND(D111>0,D112=0),1,0))*D$86","v":0},{"$f":"IF(AND(E112>0,E112<E111),3,IF(AND(E111>0,E112=0),1,0))*E$86","v":0},0,0,0,0,0,0,0,0,0,0,0,0,0,0,0,0,0,0,0,0,0,0,0,0,0,0,0,0,0]
[null,"Zellenfehler","Ein3",{"$f":"IF(AND(D113>0,D113<D112),3,IF(AND(D113=0,D114>0),1,0))*D$86","v":0},{"$f":"IF(AND(E113>0,E113<E112),3,IF(AND(E113=0,E114>0),1,0))*E$86","v":0},0,0,0,0,0,0,0,0,0,0,0,0,0,0,0,0,0,0,0,0,0,0,0,0,0,0,0,0,0]
[null,null,"Aus3",{"$f":"IF(AND(D114>0,D114<D113),3,IF(AND(D113>0,D114=0),1,0))*D$86","v":0},{"$f":"IF(AND(E114>0,E114<E113),3,IF(AND(E113>0,E114=0),1,0))*E$86","v":0},0,0,0,0,0,0,0,0,0,0,0,0,0,0,0,0,0,0,0,0,0,0,0,0,0,0,0,0,0]
[null,null,"Ein4",{"$f":"IF(AND(D115>0,D115<D114),3,IF(AND(D115=0,D116>0),1,0))*D$86","v":0},{"$f":"IF(AND(E115>0,E115<E114),3,IF(AND(E115=0,E116>0),1,0))*E$86","v":0},0,0,0,0,0,0,0,0,0,0,0,0,0,0,0,0,0,0,0,0,0,0,0,0,0,0,0,0,0]
[null,null,"Aus4",{"$f":"IF(AND(D116>0,D116<D115),3,IF(AND(D115>0,D116=0),1,0))*D$86","v":0},{"$f":"IF(AND(E116>0,E116<E115),3,IF(AND(E115>0,E116=0),1,0))*E$86","v":0},0,0,0,0,0,0,0,0,0,0,0,0,0,0,0,0,0,0,0,0,0,0,0,0,0,0,0,0,0]
[]
[null,null,"Ein1",{"$f":"ROUND(D5*24,2)","v":0},0,0,0,0,0,0,0,0,0,0,0,0,0,0,0,0,0,0,0,0,0,0,0,0,0,0,0,0,0,0]
[null,null,"Aus1",0,0,0,0,0,0,0,0,0,0,0,0,0,0,0,0,0,0,0,0,0,0,0,0,0,0,0,0,0,0,0]
[null,"Zeiten dezimal gewandelt","Ein2",0,0,0,0,0,0,0,0,0,0,0,0,0,0,0,0,0,0,0,0,0,0,0,0,0,0,0,0,0,0,0]
[null,null,"Aus2",0,0,0,0,0,0,0,0,0,0,0,0,0,0,0,0,0,0,0,0,0,0,0,0,0,0,0,0,0,0,0]
[null,null,"Ein3",0,0,0,0,0,0,0,0,0,0,0,0,0,0,0,0,0,0,0,0,0,0,0,0,0,0,0,0,0,0,0]
[null,null,"Aus3",0,0,0,0,0,0,0,0,0,0,0,0,0,0,0,0,0,0,0,0,0,0,0,0,0,0,0,0,0,0,0]
[null,null,"Ein4",0,0,0,0,0,0,0,0,0,0,0,0,0,0,0,0,0,0,0,0,0,0,0,0,0,0,0,0,0,0,0]
[null,null,"Aus4",0,0,0,0,0,0,0,0,0,0,0,0,0,0,0,0,0,0,0,0,0,0,0,0,0,0,0,0,0,0,0]
[]
[null,"Pausenfehler","Gruppe1",{"$f":"IF(OR(D109=\"\",D110=\"\"),0,D110-D109)","v":0},{"$f":"IF(OR(E109=\"\",E110=\"\"),0,E110-E109)","v":0},0,0,0,0,0,0,0,0,0,0,0,0,0,0,0,{"$f":"IF(OR(U109=\"\",U110=\"\"),0,U110-U109)","v":0},{"$f":"IF(OR(V109=\"\",V110=\"\"),0,V110-V109)","v":0},0,0,0,0,0,0,0,0,0,0,0,0]
[null,null,"Gruppe2",{"$f":"IF(OR(D111=\"\",D112=\"\"),0,D112-D111)","v":0},{"$f":"IF(OR(E111=\"\",E112=\"\"),0,E112-E111)","v":0},0,0,0,0,0,0,0,0,0,0,0,0,0,0,0,{"$f":"IF(OR(U111=\"\",U112=\"\"),0,U112-U111)","v":0},{"$f":"IF(OR(V111=\"\",V112=\"\"),0,V112-V111)","v":0},0,0,0,0,0,0,0,0,0,0,0,0]
[null,null,"Gruppe3",{"$f":"IF(OR(D113=\"\",D114=\"\"),0,D114-D113)","v":0},{"$f":"IF(OR(E113=\"\",E114=\"\"),0,E114-E113)","v":0},0,0,0,0,0,0,0,0,0,0,0,0,0,0,0,{"$f":"IF(OR(U113=\"\",U114=\"\"),0,U114-U113)","v":0},{"$f":"IF(OR(V113=\"\",V114=\"\"),0,V114-V113)","v":0},0,0,0,0,0,0,0,0,0,0,0,0]
[null,null,"Gruppe4",{"$f":"IF(OR(D115=\"\",D116=\"\"),0,D116-D115)","v":0},{"$f":"IF(OR(E115=\"\",E116=\"\"),0,E116-E115)","v":0},0,0,0,0,0,0,0,0,0,0,0,0,0,0,0,{"$f":"IF(OR(U115=\"\",U116=\"\"),0,U116-U115)","v":0},{"$f":"IF(OR(V115=\"\",V116=\"\"),0,V116-V115)","v":0},0,0,0,0,0,0,0,0,0,0,0,0]
[]
[null,null,"Pause12",{"$f":"IF(OR(D110=\"\",D111=\"\"),0,D111-D110)","v":0},{"$f":"IF(OR(E110=\"\",E111=\"\"),0,E111-E110)","v":0},0,0,0,0,0,0,0,0,0,0,0,0,0,0,0,{"$f":"IF(OR(U110=\"\",U111=\"\"),0,U111-U110)","v":0},{"$f":"IF(OR(V110=\"\",V111=\"\"),0,V111-V110)","v":0},0,0,0,0,0,0,0,0,0,0,0,0]
[null,null,"Pause23",{"$f":"IF(OR(D112=\"\",D113=\"\"),0,D113-D112)","v":0},{"$f":"IF(OR(E112=\"\",E113=\"\"),0,E113-E112)","v":0},0,0,0,0,0,0,0,0,0,0,0,0,0,0,0,{"$f":"IF(OR(U112=\"\",U113=\"\"),0,U113-U112)","v":0},{"$f":"IF(OR(V112=\"\",V113=\"\"),0,V113-V112)","v":0},0,0,0,0,0,0,0,0,0,0,0,0]
[null,null,"Pause34",{"$f":"IF(OR(D114=\"\",D115=\"\"),0,D115-D114)","v":0},{"$f":"IF(OR(E114=\"\",E115=\"\"),0,E115-E114)","v":0},0,0,0,0,0,0,0,0,0,0,0,0,0,0,0,{"$f":"IF(OR(U114=\"\",U115=\"\"),0,U115-U114)","v":0},{"$f":"IF(OR(V114=\"\",V115=\"\"),0,V115-V114)","v":0},0,0,0,0,0,0,0,0,0,0,0,0]
[]
[null,null,"Kum12",{"$f":"IF(D123>=0.5,0,D118+D119)","v":0},{"$f":"IF(E123>=0.5,0,E118+E119)","v":0},0,0,0,0,0,0,0,0,0,0,0,0,0,0,0,{"$f":"IF(U123>=0.5,0,U118+U119)","v":0},{"$f":"IF(V123>=0.5,0,V118+V119)","v":0},0,0,0,0,0,0,0,0,0,0,0,0]
[null,null,"Kum123",{"$f":"IF(OR(D123>=0.5,D124>=0.5),0,D118+D119+D120)","v":0},{"$f":"IF(OR(E123>=0.5,E124>=0.5),0,E118+E119+E120)","v":0},0,0,0,0,0,0,0,0,0,0,0,0,0,0,0,{"$f":"IF(OR(U123>=0.5,U124>=0.5),0,U118+U119+U120)","v":0},{"$f":"IF(OR(V123>=0.5,V124>=0.5),0,V118+V119+V120)","v":0},0,0,0,0,0,0,0,0,0,0,0,0]
[null,null,"Kum1234",{"$f":"IF(OR(D123>=0.5,D124>=0.5,D125>=0.5),0,D118+D119+D120+D121)","v":0},{"$f":"IF(OR(E123>=0.5,E124>=0.5,E125>=0.5),0,E118+E119+E120+E121)","v":0},0,0,0,0,0,0,0,0,0,0,0,0,0,0,0,{"$f":"IF(OR(U123>=0.5,U124>=0.5,U125>=0.5),0,U118+U119+U120+U121)","v":0},{"$f":"IF(OR(V123>=0.5,V124>=0.5,V125>=0.5),0,V118+V119+V120+V121)","v":0},0,0,0,0,0,0,0,0,0,0,0,0]
[null,null,"Kum23",{"$f":"IF(D124>=0.5,0,D119+D120)","v":0},{"$f":"IF(E124>=0.5,0,E119+E120)","v":0},0,0,0,0,0,0,0,0,0,0,0,0,0,0,0,{"$f":"IF(U124>=0.5,0,U119+U120)","v":0},{"$f":"IF(V124>=0.5,0,V119+V120)","v":0},0,0,0,0,0,0,0,0,0,0,0,0]
[null,null,"Kum234",{"$f":"IF(OR(D124>=0.5,D125>=0.5),0,D119+D120+D121)","v":0},{"$f":"IF(OR(E124>=0.5,E125>=0.5),0,E119+E120+E121)","v":0},0,0,0,0,0,0,0,0,0,0,0,0,0,0,0,{"$f":"IF(OR(U124>=0.5,U125>=0.5),0,U119+U120+U121)","v":0},{"$f":"IF(OR(V124>=0.5,V125>=0.5),0,V119+V120+V121)","v":0},0,0,0,0,0,0,0,0,0,0,0,0]
[null,null,"Kum34",{"$f":"IF(D125>=0.5,0,D120+D121)","v":0},{"$f":"IF(E125>=0.5,0,E120+E121)","v":0},0,0,0,0,0,0,0,0,0,0,0,0,0,0,0,{"$f":"IF(U125>=0.5,0,U120+U121)","v":0},{"$f":"IF(V125>=0.5,0,V120+V121)","v":0},0,0,0,0,0,0,0,0,0,0,0,0]
[]
[null,null,"Pausenfehler-Code",{"$f":"IF(MAX(D118:D121,D127:D132)>6,2,0)","v":0},{"$f":"IF(MAX(E118:E121,E127:E132)>6,2,0)","v":0},0,0,0,0,0,0,0,0,0,0,0,0,0,0,0,0,0,0,0,0,0,0,0,0,0,0,0,0,0]

{"sheet":"August","index":13,"n_rows":134,"n_cols":45,"rows_kept":134,"cut":false,"hidden":true,"merged":[[11,34,12,35]]}
[8,{"$f":"DATEVALUE(\"1.\"&A1&\".\"&SL_Jahr)","v":"2024-08-01"},{"$f":"SL_Jahr","v":2024},{"$f":"B_Gde","v":"Gde:"},{"$f":"SL_Gemeinde","v":0},null,null,null,null,null,null,null,null,null,null,null,null,null,null,{"$f":"B_Schule","v":"Schule:"},{"$f":"SL_Schule","v":0},null,null,null,null,null,null,null,null,null,null,null,null,null,null,null,null,null,"Abschluss-Teilbedingungen:"]
[{"$f":"VLOOKUP(A1,Monatsenden,2)","v":45535},{"$f":"B_Bg","v":"BG:"},{"$f":"VLOOKUP(B1,VSA_Kalender,13)","v":1},{"$f":"B_Name","v":"Name:"},{"$f":"SL_Name","v":0},null,null,null,null,null,null,null,null,null,null,null,null,null,null,null,null,null,null,null,null,null,null,null,null,null,null,null,null,null,null,null,null,null,"Regel ok",{"$f":"(AN14>=AN15)","v":false},"Nicht Relevant",{"$f":"D83=0","v":true},-1,{"$f":"IF(AP2=TRUE,AQ2,0)","v":-1},"Nicht Relevant"]
[null,{"$f":"Zerf_Version & \" \" & Zerf_T","v":"Version VSA 1.06 "},null,{"$f":"DATE($C$1,MONTH($B$1),D$4)","v":"2024-08-01"},{"$f":"DATE($C$1,MONTH($B$1),E$4)","v":"2024-08-02"},"2024-08-03","2024-08-04","2024-08-05","2024-08-06","2024-08-07","2024-08-08","2024-08-09","2024-08-10","2024-08-11","2024-08-12","2024-08-13","2024-08-14","2024-08-15","2024-08-16","2024-08-17","2024-08-18","2024-08-19","2024-08-20","2024-08-21","2024-08-22","2024-08-23","2024-08-24","2024-08-25","2024-08-26","2024-08-27","2024-08-28",{"$f":"IF(MONTH(DATE($C$1,MONTH($B$1),AF$41))>MONTH($B$1),\"\",DATE($C$1,MONTH($B$1),AF$4))","v":"2024-08-29"},{"$f":"IF(MONTH(DATE($C$1,MONTH($B$1),AG$41))>MONTH($B$1),\"\",DATE($C$1,MONTH($B$1),AG$4))","v":"2024-08-30"},{"$f":"IF(MONTH(DATE($C$1,MONTH($B$1),AH$41))>MONTH($B$1),\"\",DATE($C$1,MONTH($B$1),AH$4))","v":"2024-08-31"},null,null,null,null,"Spalten ok",{"$f":"(L83>=D83)","v":true},"Entsperrt",false,1,{"$f":"AP3*AQ3","v":0},"Entsperrt"]
[null,{"$f":"IF(VSATestModus=TRUE(),\"VSA-Modus!\",\"\")","v":""},{"$f":"IF(AN52>0,\"DEFEKT\",\"\")","v":""},{"$f":"IF(MONTH(DATE($C$1,MONTH($B$1),D$41))>MONTH($B$1),\"\",D41)","v":1},2,3,4,5,6,7,8,9,10,11,12,13,14,15,16,17,18,19,20,21,22,23,24,25,26,27,28,{"$f":"IF(MONTH(DATE($C$1,MONTH($B$1),AF$41))>MONTH($B$1),\"\",AF41)","v":29},{"$f":"IF(MONTH(DATE($C$1,MONTH($B$1),AG$41))>MONTH($B$1),\"\",AG41)","v":30},{"$f":"IF(MONTH(DATE($C$1,MONTH($B$1),AH$41))>MONTH($B$1),\"\",AH41)","v":31},null,null,null,null,"Keine Fehler",{"$f":"(SUM(D87:AH87)=0)","v":true},"Geändert",false,2,{"$f":"AP4*AQ4","v":0},"Geändert"]
[null,"     Ein   >>>",null,null,null,null,null,null,null,null,null,null,null,null,null,null,null,null,null,null,null,null,null,null,null,null,null,null,null,null,null,null,null,null,null,null,null,null,"Keine Hand",{"$f":"(AI12=\"\")","v":true},"Sperre",{"$f":"AS11=2","v":false},3,{"$f":"NOT(AP6)*AQ5","v":3},"Eingaben vornehmen"]
[null,"<<<   Aus     ",null,null,null,null,null,null,null,null,null,null,null,null,null,null,null,null,null,null,null,null,null,null,null,null,null,null,null,null,null,null,null,null,null,null,null,null,null,null,"Abschliessbar 1",{"$f":"AND(OR(AN2,AN3),AN4,AN5,NOT(AP7),NOT(AP2))","v":false},4,{"$f":"AND(NOT(OR(AP3,AP4)),AP6)*AQ6","v":0},"Abschliessbar 1"]
[null,"     Ein   >>>",null,null,null,null,null,null,null,null,null,null,null,null,null,null,null,null,null,null,null,null,null,null,null,null,null,null,null,null,null,null,null,null,null,null,null,null,null,null,"Abgeschlossen",false,5,{"$f":"AND(NOT(OR(AP3,AP4)),AP7)*AQ7","v":0},"Abgeschlossen"]
[null,"<<<   Aus     ",null,null,null,null,null,null,null,null,null,null,null,null,null,null,null,null,null,null,null,null,null,null,null,null,null,null,null,null,null,null,null,null,null,null,null,null,null,null,"Für Jahr OK",{"$f":"AND(OR(AP2,AP7),NOT(AP3))","v":true}]
[null,"     Ein   >>>"]
[null,"<<<   Aus     ",null,null,null,null,null,null,null,null,null,null,null,null,null,null,null,null,null,null,null,null,null,null,null,null,null,null,null,null,null,null,null,null,null,null,null,null,null,null,"Statusnummer:",{"$f":"IF(AR2=AQ2,AQ2,MAX(AR2:AR7))","v":-1}]
[null,"     Ein   >>>",null,null,null,null,null,null,null,null,null,null,null,null,null,null,null,null,null,null,null,null,null,null,null,null,null,null,null,null,null,null,null,null,null,null,null,null,"HatDaten:",{"$f":"AND(AP2=FALSE,OR(AP10<>3,COUNTA(D5:AH12,D20:AH35,D39:L40)>0))","v":false},"Statustext:",{"$f":"IFERROR(VLOOKUP(AP10,AR2:AS7,2,FALSE),\"unbekannt\")","v":"Nicht Relevant"},null,null,1]
[null,"<<<   Aus     ",null,null,null,null,null,null,null,null,null,null,null,null,null,null,null,null,null,null,null,null,null,null,null,null,null,null,null,null,null,null,null,null,{"$f":"IF(COUNTIF(D37:AH37,\"I\")>0,\"I\",\"\")","v":""}]
[null,{"$f":"B_PrZeit","v":"Präsenzzeit"},null,{"$f":"24*(D6-D5+D8-D7+D10-D9+D12-D11)*D88","v":0},{"$f":"24*(E6-E5+E8-E7+E10-E9+E12-E11)*E88","v":0},0,0,0,0,0,0,0,0,0,0,0,0,0,0,0,0,0,0,0,0,0,0,0,0,0,0,0,0,0,null,null,null,null,"Anzahl Regeltage:",{"$f":"D83","v":0}]
[null,{"$f":"B_TotalAZist","v":"Total Arbeitszeit (IST)"},null,{"$f":"IF(D13+D35>=D15,D13+D35,MIN(D13+D35+SUM(D20,D22,D23,D24,D25,D26,D27,D28,D29,D30,D31,D32,D33,D34),IF(D15<0,0,D15)))*D82","v":0},0,0,0,0,0,0,0,0,0,0,0,0,0,{"$f":"IF(R13+R35>=R15,R13+R35,MIN(R13+R35+SUM(R20,R22,R23,R24,R25,R26,R27,R28,R29,R30,R31,R32,R33,R34),IF(R15<0,0,R15)))*R82","v":0},{"$f":"IF(S13+S35>=S15,S13+S35,MIN(S13+S35+SUM(S20,S22,S23,S24,S25,S26,S27,S28,S29,S30,S31,S32,S33,S34),IF(S15<0,0,S15)))*S82","v":0},{"$f":"IF(T13+T35>=T15,T13+T35,MIN(T13+T35+SUM(T20,T22,T23,T24,T25,T26,T27,T28,T29,T30,T31,T32,T33,T34),IF(T15<0,0,T15)))*T82","v":0},{"$f":"IF(U13+U35>=U15,U13+U35,MIN(U13+U35+SUM(U20,U22,U23,U24,U25,U26,U27,U28,U29,U30,U31,U32,U33,U34),IF(U15<0,0,U15)))*U82","v":0},0,0,0,0,0,0,0,0,0,0,0,0,0,{"$f":"SUMIF($D$82:$AH$82,1,D14:AH14)","v":0},{"$f":"AI14-AI15","v":8.4},null,null,"Erfasste Regeltage",{"$f":"L83","v":0},{"$f":"AN13-AN14","v":0},"Fehlende Regeltage"]
[null,{"$f":"B_NettoSollAZ","v":"Netto-SOLL-Arbeitszeit"},null,{"$f":"ROUND(D16-D19,2)","v":-8.4},{"$f":"ROUND(E16-E19,2)","v":0},0,0,0,0,0,0,0,0,0,0,0,0,0,0,0,0,0,0,0,0,0,0,0,0,0,0,{"$f":"IF(AF$42=4,0,ROUND(AF16-AF19,2))","v":0},{"$f":"IF(AG$42=4,0,ROUND(AG16-AG19,2))","v":0},0,{"$f":"SUMIF($D$82:$AH$82,1,D15:AH15)","v":-8.4},null,null,null,"Minimum Regeltage",{"$f":"MinRegeltage","v":1},"Ist als Konstante im Blatt \"Intern\" hinterlegt"]
[null,{"$f":"B_BruttoSollAZ","v":"Brutto-SOLL-Arb.zeit"},null,{"$f":"VLOOKUP(D3,VSA_Kalender,16)","v":0},0,0,0,0,0,0,0,0,0,0,0,0,0,0,0,0,0,0,0,0,0,0,0,0,0,0,0,{"$f":"IF(AF$42=4,0,VLOOKUP(AF3,VSA_Kalender,16))","v":0},{"$f":"IF(AG$42=4,0,VLOOKUP(AG3,VSA_Kalender,16))","v":0},{"$f":"IF(AH$42=4,0,VLOOKUP(AH3,VSA_Kalender,16))","v":0},null,null,null,null,"Regel ok","Mind. eigetr. Regeltage erfüllt"]
[null,{"$f":"B_MehrMinder","v":"Mehr-/Minderleistung"},null,{"$f":"(SL_BisDatum>=D3)*ROUND(D14-D15,2)","v":0},0,0,0,0,0,0,0,0,0,0,0,0,0,0,0,0,0,0,0,0,0,0,0,0,0,0,0,0,0,0,{"$f":"B_Total","v":"Total"},{"$f":"B_Vortrag","v":"Vortrag"},null,null,"Spalten ok:","Alle Einträge an Regeltagen ok"]
[null,{"$f":"B_AZSaldo","v":"AZ - Saldo"},{"$f":"VLOOKUP(ROW(),VSA_Uebertrag,$A$1+3)","v":16.8},{"$f":"IFERROR((C18+D17)*(D3<=SL_BisDatum)*VLOOKUP(D3,VSA_Kalender,21,FALSE),0)","v":0},0,0,{"$f":"IFERROR((F18+G17)*(G3<=SL_BisDatum)*VLOOKUP(G3,VSA_Kalender,21,FALSE),0)","v":0},0,0,0,0,0,0,0,0,0,0,0,0,0,0,0,0,0,0,0,0,0,0,0,0,0,0,0,null,{"$f":"SUMIF($D$82:$AH$82,1,D17:AH17)+C18","v":16.8}]
[null,{"$f":"B_FTA","v":"Feiertagsanspruch"},0,{"$f":"VLOOKUP(D3,VSA_Kalender,14)","v":8.4},0,0,0,0,0,0,0,0,0,0,0,0,0,0,0,0,0,0,0,0,0,0,0,0,0,0,0,{"$f":"IF(AF$42=4,0,VLOOKUP(AF3,VSA_Kalender,14))","v":0},{"$f":"IF(AG$42=4,0,VLOOKUP(AG3,VSA_Kalender,14))","v":0},{"$f":"IF(AH$42=4,0,VLOOKUP(AH3,VSA_Kalender,14))","v":0},{"$f":"SUM(D19:AH19)","v":8.4}]
[null,{"$f":"B_Ferien","v":"Ferien"},{"$f":"VLOOKUP(ROW(),VSA_Uebertrag,$A$1+3)","v":0},null,null,null,null,null,null,null,null,null,null,null,null,null,null,null,null,null,null,null,null,null,null,null,null,null,null,null,null,null,null,null,{"$f":"SUMIF($D$82:$AH$82,1,D20:AH20)","v":0},{"$f":"ROUND(C20-AI20,2)","v":0},"Rest"]
[null,{"$f":"B_KompAZ","v":"Kompensation Arbeitstage"},0,null,null,null,null,null,null,null,null,null,null,null,null,null,null,null,null,null,null,null,null,null,null,null,null,null,null,null,null,null,null,null,0,{"$f":"ROUND(A21+C21-AI21,0)","v":0}]
[null,{"$f":"B_Arzt","v":"Arztbesuch"},0,null,null,null,null,null,null,null,null,null,null,null,null,null,null,null,null,null,null,null,null,null,null,null,null,null,null,null,null,null,null,null,0,{"$f":"ROUND(A22+C22+AI22,2)","v":0},"Summen"]
[null,{"$f":"B_Krank","v":"Krankheit"},0,null,null,null,null,null,null,null,null,null,null,null,null,null,null,null,null,null,null,null,null,null,null,null,null,null,null,null,null,null,null,null,0,{"$f":"ROUND(A23+C23+AI23,2)","v":0}]
[null,{"$f":"B_BU","v":"Berufsunfall"},0,null,null,null,null,null,null,null,null,null,null,null,null,null,null,null,null,null,null,null,null,null,null,null,null,null,null,null,null,null,null,null,0,0]
[null,{"$f":"B_NBU","v":"Nichtberufsunfall"},0,null,null,null,null,null,null,null,null,null,null,null,null,null,null,null,null,null,null,null,null,null,null,null,null,null,null,null,null,null,null,null,0,0]
[null,{"$f":"B_MilZiv","v":"Militär / Zivilschutz"},0,null,null,null,null,null,null,null,null,null,null,null,null,null,null,null,null,null,null,null,null,null,null,null,null,null,null,null,null,null,null,null,0,0]
[null,{"$f":"B_UUB","v":"Unbezahlter Urlaub"},0,null,null,null,null,null,null,null,null,null,null,null,null,null,null,null,null,null,null,null,null,null,null,null,null,null,null,null,null,null,null,null,0,{"$f":"ROUND(A27+C27-AI27,2)","v":0},"Rest"]
[null,{"$f":"B_UB","v":"Bezahlter Urlaub"},0,null,null,null,null,null,null,null,null,null,null,null,null,null,null,null,null,null,null,null,null,null,null,null,null,null,null,null,null,null,null,null,0,{"$f":"ROUND(A28+C28-AI28,2)","v":0}]
[null,{"$f":"B_NebenB","v":"Nebenbeschäftigung"},0,null,null,null,null,null,null,null,null,null,null,null,null,null,null,null,null,null,null,null,null,null,null,null,null,null,null,null,null,null,null,null,0,0]
[null,{"$f":"B_DAG","v":"D A G"},0,null,null,null,null,null,null,null,null,null,null,null,null,null,null,null,null,null,null,null,null,null,null,null,null,null,null,null,null,null,null,null,0,0]
[null,{"$f":"B_Divers","v":"Diverses"},0,null,null,null,null,null,null,null,null,null,null,null,null,null,null,null,null,null,null,null,null,null,null,null,null,null,null,null,null,null,null,null,0,0,"Summen"]
[null,{"$f":"B_FamPersErg","v":"Fam./pers. Ereignisse"},0,null,null,null,null,null,null,null,null,null,null,null,null,null,null,null,null,null,null,null,null,null,null,null,null,null,null,null,null,null,null,null,0,0]
[null,{"$f":"B_FZ1","v":"freie Zeile 1"},0,null,null,null,null,null,null,null,null,null,null,null,null,null,null,null,null,null,null,null,null,null,null,null,null,null,null,null,null,null,null,null,0,0]
[null,{"$f":"B_FZ2","v":"freie Zeile 2"},0,null,null,null,null,null,null,null,null,null,null,null,null,null,null,null,null,null,null,null,null,null,null,null,null,null,null,null,null,null,null,null,0,0]
[null,{"$f":"B_WB","v":"Weiterbildung"},0,null,null,null,null,null,null,null,null,null,null,null,null,null,null,null,null,null,null,null,null,null,null,null,null,null,null,null,null,null,null,null,0,0]
[null,{"$f":"B_FEL","v":"frei einsetzbare Lekt."},0,null,null,null,null,null,null,null,null,null,null,null,null,null,null,null,null,null,null,null,null,null,null,null,null,null,null,null,null,null,null,null,{"$f":"SUM(D36:AH36)","v":0},{"$f":"ROUND(C36-AI36,0)","v":0}]
[null,null,null,{"$f":"IF(AND((D13 - D15)+SUM(D20,D22:D34)>0.00001,SUM(D20,D22:D34)>0),\"I\",\"\")","v":""},"","","","","","","","","","","","","","","","","","","","","","","","","","","","","",""]
[null,null,"Visum","Identität:",null,null,null,null,"Datum:",null,"Status:"]
[null,null,"SL"]
[null,null,"VG"]
[null,null,null,1,2,3,4,5,6,7,8,9,10,11,12,13,14,15,16,17,18,19,20,21,22,23,24,25,26,27,28,29,30,31]
[null,null,null,{"$f":"IF(D3=\"\",4,VLOOKUP(D3,VSA_Kalender,18))","v":1},0,1,1,0,0,0,0,0,1,1,0,0,0,0,0,1,1,0,0,0,0,0,1,1,0,0,0,0,0,1]
[]
[null,null,null,{"$f":"IF(D19>0,VLOOKUP(D3,KalFeiertage,6,FALSE),\"\")","v":"1. August"},"","","","","","","","","","","","","","","","","","","","","","","","","","","","","",""]
[null,null,null,"FT=WENN(D13+D35>=D15;D13+D35;MIN(D13+D35+SUMME(D20;D22;D23;D24;D25;D26;D27;D28;D29;D30;D31;D32;D33;D34);WENN(D15<0;0;D15)))*D82","FT=WENN(E13+E35>=E15;E13+E35;MIN(E13+E35+SUMME(E20;E22;E23;E24;E25;E26;E27;E28;E29;E30;E31;E32;E33;E34);WENN(E15<0;0;E15)))*E82","FT=WENN(F13+F35>=F15;F13+F35;MIN(F13+F35+SUMME(F20;F22;F23;F24;F25;F26;F27;F28;F29;F30;F31;F32;F33;F34);WENN(F15<0;0;F15)))*F82","FT=WENN(G13+G35>=G15;G13+G35;MIN(G13+G35+SUMME(G20;G22;G23;G24;G25;G26;G27;G28;G29;G30;G31;G32;G33;G34);WENN(G15<0;0;G15)))*G82","FT=WENN(H13+H35>=H15;H13+H35;MIN(H13+H35+SUMME(H20;H22;H23;H24;H25;H26;H27;H28;H29;H30;H31;H32;H33;H34);WENN(H15<0;0;H15)))*H82","FT=WENN(I13+I35>=I15;I13+I35;MIN(I13+I35+SUMME(I20;I22;I23;I24;I25;I26;I27;I28;I29;I30;I31;I32;I33;I34);WENN(I15<0;0;I15)))*I82","FT=WENN(J13+J35>=J15;J13+J35;MIN(J13+J35+SUMME(J20;J22;J23;J24;J25;J26;J27;J28;J29;J30;J31;J32;J33;J34);WENN(J15<0;0;J15)))*J82","FT=WENN(K13+K35>=K15;K13+K35;MIN(K13+K35+SUMME(K20;K22;K23;K24;K25;K26;K27;K28;K29;K30;K31;K32;K33;K34);WENN(K15<0;0;K15)))*K82","FT=WENN(L13+L35>=L15;L13+L35;MIN(L13+L35+SUMME(L20;L22;L23;L24;L25;L26;L27;L28;L29;L30;L31;L32;L33;L34);WENN(L15<0;0;L15)))*L82","FT=WENN(M13+M35>=M15;M13+M35;MIN(M13+M35+SUMME(M20;M22;M23;M24;M25;M26;M27;M28;M29;M30;M31;M32;M33;M34);WENN(M15<0;0;M15)))*M82","FT=WENN(N13+N35>=N15;N13+N35;MIN(N13+N35+SUMME(N20;N22;N23;N24;N25;N26;N27;N28;N29;N30;N31;N32;N33;N34);WENN(N15<0;0;N15)))*N82","FT=WENN(O13+O35>=O15;O13+O35;MIN(O13+O35+SUMME(O20;O22;O23;O24;O25;O26;O27;O28;O29;O30;O31;O32;O33;O34);WENN(O15<0;0;O15)))*O82","FT=WENN(P13+P35>=P15;P13+P35;MIN(P13+P35+SUMME(P20;P22;P23;P24;P25;P26;P27;P28;P29;P30;P31;P32;P33;P34);WENN(P15<0;0;P15)))*P82","FT=WENN(Q13+Q35>=Q15;Q13+Q35;MIN(Q13+Q35+SUMME(Q20;Q22;Q23;Q24;Q25;Q26;Q27;Q28;Q29;Q30;Q31;Q32;Q33;Q34);WENN(Q15<0;0;Q15)))*Q82","FT=WENN(R13+R35>=R15;R13+R35;MIN(R13+R35+SUMME(R20;R22;R23;R24;R25;R26;R27;R28;R29;R30;R31;R32;R33;R34);WENN(R15<0;0;R15)))*R82","FT=WENN(S13+S35>=S15;S13+S35;MIN(S13+S35+SUMME(S20;S22;S23;S24;S25;S26;S27;S28;S29;S30;S31;S32;S33;S34);WENN(S15<0;0;S15)))*S82","FT=WENN(T13+T35>=T15;T13+T35;MIN(T13+T35+SUMME(T20;T22;T23;T24;T25;T26;T27;T28;T29;T30;T31;T32;T33;T34);WENN(T15<0;0;T15)))*T82","FT=WENN(U13+U35>=U15;U13+U35;MIN(U13+U35+SUMME(U20;U22;U23;U24;U25;U26;U27;U28;U29;U30;U31;U32;U33;U34);WENN(U15<0;0;U15)))*U82","FT=WENN(V13+V35>=V15;V13+V35;MIN(V13+V35+SUMME(V20;V22;V23;V24;V25;V26;V27;V28;V29;V30;V31;V32;V33;V34);WENN(V15<0;0;V15)))*V82","FT=WENN(W13+W35>=W15;W13+W35;MIN(W13+W35+SUMME(W20;W22;W23;W24;W25;W26;W27;W28;W29;W30;W31;W32;W33;W34);WENN(W15<0;0;W15)))*W82","FT=WENN(X13+X35>=X15;X13+X35;MIN(X13+X35+SUMME(X20;X22;X23;X24;X25;X26;X27;X28;X29;X30;X31;X32;X33;X34);WENN(X15<0;0;X15)))*X82","FT=WENN(Y13+Y35>=Y15;Y13+Y35;MIN(Y13+Y35+SUMME(Y20;Y22;Y23;Y24;Y25;Y26;Y27;Y28;Y29;Y30;Y31;Y32;Y33;Y34);WENN(Y15<0;0;Y15)))*Y82","FT=WENN(Z13+Z35>=Z15;Z13+Z35;MIN(Z13+Z35+SUMME(Z20;Z22;Z23;Z24;Z25;Z26;Z27;Z28;Z29;Z30;Z31;Z32;Z33;Z34);WENN(Z15<0;0;Z15)))*Z82","FT=WENN(AA13+AA35>=AA15;AA13+AA35;MIN(AA13+AA35+SUMME(AA20;AA22;AA23;AA24;AA25;AA26;AA27;AA28;AA29;AA30;AA31;AA32;AA33;AA34);WENN(AA15<0;0;AA15)))*AA82","FT=WENN(AB13+AB35>=AB15;AB13+AB35;MIN(AB13+AB35+SUMME(AB20;AB22;AB23;AB24;AB25;AB26;AB27;AB28;AB29;AB30;AB31;AB32;AB33;AB34);WENN(AB15<0;0;AB15)))*AB82","FT=WENN(AC13+AC35>=AC15;AC13+AC35;MIN(AC13+AC35+SUMME(AC20;AC22;AC23;AC24;AC25;AC26;AC27;AC28;AC29;AC30;AC31;AC32;AC33;AC34);WENN(AC15<0;0;AC15)))*AC82","FT=WENN(AD13+AD35>=AD15;AD13+AD35;MIN(AD13+AD35+SUMME(AD20;AD22;AD23;AD24;AD25;AD26;AD27;AD28;AD29;AD30;AD31;AD32;AD33;AD34);WENN(AD15<0;0;AD15)))*AD82","FT=WENN(AE13+AE35>=AE15;AE13+AE35;MIN(AE13+AE35+SUMME(AE20;AE22;AE23;AE24;AE25;AE26;AE27;AE28;AE29;AE30;AE31;AE32;AE33;AE34);WENN(AE15<0;0;AE15)))*AE82","FT=WENN(AF13+AF35>=AF15;AF13+AF35;MIN(AF13+AF35+SUMME(AF20;AF22;AF23;AF24;AF25;AF26;AF27;AF28;AF29;AF30;AF31;AF32;AF33;AF34);WENN(AF15<0;0;AF15)))*AF82","FT=WENN(AG13+AG35>=AG15;AG13+AG35;MIN(AG13+AG35+SUMME(AG20;AG22;AG23;AG24;AG25;AG26;AG27;AG28;AG29;AG30;AG31;AG32;AG33;AG34);WENN(AG15<0;0;AG15)))*AG82","FT=WENN(AH13+AH35>=AH15;AH13+AH35;MIN(AH13+AH35+SUMME(AH20;AH22;AH23;AH24;AH25;AH26;AH27;AH28;AH29;AH30;AH31;AH32;AH33;AH34);WENN(AH15<0;0;AH15)))*AH82"]
[null,null,null,"FT=24*(D6-D5+D8-D7+D10-D9+D12-D11)*D88","FT=24*(E6-E5+E8-E7+E10-E9+E12-E11)*E88","FT=24*(F6-F5+F8-F7+F10-F9+F12-F11)*F88","FT=24*(G6-G5+G8-G7+G10-G9+G12-G11)*G88","FT=24*(H6-H5+H8-H7+H10-H9+H12-H11)*H88","FT=24*(I6-I5+I8-I7+I10-I9+I12-I11)*I88","FT=24*(J6-J5+J8-J7+J10-J9+J12-J11)*J88","FT=24*(K6-K5+K8-K7+K10-K9+K12-K11)*K88","FT=24*(L6-L5+L8-L7+L10-L9+L12-L11)*L88","FT=24*(M6-M5+M8-M7+M10-M9+M12-M11)*M88","FT=24*(N6-N5+N8-N7+N10-N9+N12-N11)*N88","FT=24*(O6-O5+O8-O7+O10-O9+O12-O11)*O88","FT=24*(P6-P5+P8-P7+P10-P9+P12-P11)*P88","FT=24*(Q6-Q5+Q8-Q7+Q10-Q9+Q12-Q11)*Q88","FT=24*(R6-R5+R8-R7+R10-R9+R12-R11)*R88","FT=24*(S6-S5+S8-S7+S10-S9+S12-S11)*S88","FT=24*(T6-T5+T8-T7+T10-T9+T12-T11)*T88","FT=24*(U6-U5+U8-U7+U10-U9+U12-U11)*U88","FT=24*(V6-V5+V8-V7+V10-V9+V12-V11)*V88","FT=24*(W6-W5+W8-W7+W10-W9+W12-W11)*W88","FT=24*(X6-X5+X8-X7+X10-X9+X12-X11)*X88","FT=24*(Y6-Y5+Y8-Y7+Y10-Y9+Y12-Y11)*Y88","FT=24*(Z6-Z5+Z8-Z7+Z10-Z9+Z12-Z11)*Z88","FT=24*(AA6-AA5+AA8-AA7+AA10-AA9+AA12-AA11)*AA88","FT=24*(AB6-AB5+AB8-AB7+AB10-AB9+AB12-AB11)*AB88","FT=24*(AC6-AC5+AC8-AC7+AC10-AC9+AC12-AC11)*AC88","FT=24*(AD6-AD5+AD8-AD7+AD10-AD9+AD12-AD11)*AD88","FT=24*(AE6-AE5+AE8-AE7+AE10-AE9+AE12-AE11)*AE88","FT=24*(AF6-AF5+AF8-AF7+AF10-AF9+AF12-AF11)*AF88","FT=24*(AG6-AG5+AG8-AG7+AG10-AG9+AG12-AG11)*AG88","FT=24*(AH6-AH5+AH8-AH7+AH10-AH9+AH12-AH11)*AH88"]
[null,null,null,"FT=ODER(D14>0;D21>0)*1","FT=ODER(E14>0;E21>0)*1","FT=ODER(F14>0;F21>0)*1","FT=ODER(G14>0;G21>0)*1","FT=ODER(H14>0;H21>0)*1","FT=ODER(I14>0;I21>0)*1","FT=ODER(J14>0;J21>0)*1","FT=ODER(K14>0;K21>0)*1","FT=ODER(L14>0;L21>0)*1","FT=ODER(M14>0;M21>0)*1","FT=ODER(N14>0;N21>0)*1","FT=ODER(O14>0;O21>0)*1","FT=ODER(P14>0;P21>0)*1","FT=ODER(Q14>0;Q21>0)*1","FT=ODER(R14>0;R21>0)*1","FT=ODER(S14>0;S21>0)*1","FT=ODER(T14>0;T21>0)*1","FT=ODER(U14>0;U21>0)*1","FT=ODER(V14>0;V21>0)*1","FT=ODER(W14>0;W21>0)*1","FT=ODER(X14>0;X21>0)*1","FT=ODER(Y14>0;Y21>0)*1","FT=ODER(Z14>0;Z21>0)*1","FT=ODER(AA14>0;AA21>0)*1","FT=ODER(AB14>0;AB21>0)*1","FT=ODER(AC14>0;AC21>0)*1","FT=ODER(AD14>0;AD21>0)*1","FT=ODER(AE14>0;AE21>0)*1","FT=ODER(AF14>0;AF21>0)*1","FT=ODER(AG14>0;AG21>0)*1","FT=ODER(AH14>0;AH21>0)*1"]
[null,null,null,{"$f":"ABS(\"FT\"&_xlfn.FORMULATEXT(D14)<>D45)","v":0},{"$f":"ABS(\"FT\"&_xlfn.FORMULATEXT(E14)<>E45)","v":0},0,0,0,0,0,0,0,0,0,0,0,0,0,0,0,0,0,0,0,0,0,0,0,0,0,0,0,0,0]
[null,null,null,{"$f":"ABS(\"FT\"&_xlfn.FORMULATEXT(D13)<>D46)","v":0},{"$f":"ABS(\"FT\"&_xlfn.FORMULATEXT(E13)<>E46)","v":0},0,0,0,0,0,0,0,0,0,0,0,0,0,0,0,0,0,0,0,0,0,0,0,0,0,0,0,0,0]
[null,null,null,{"$f":"ABS(\"FT\"&_xlfn.FORMULATEXT(D80)<>D47)","v":0},{"$f":"ABS(\"FT\"&_xlfn.FORMULATEXT(E80)<>E47)","v":0},0,0,0,0,0,0,0,0,0,0,0,0,0,0,0,0,0,0,0,0,0,0,0,0,0,0,0,0,0]
[null,null,null,{"$f":"ABS(ISERROR(D37))","v":0},{"$f":"ABS(ISERROR(E37))","v":0},0,0,0,0,0,0,0,0,0,0,0,0,0,0,0,0,0,0,0,0,0,0,0,0,0,0,0,0,0]
[null,null,null,{"$f":"SUM(D48:D51)","v":0},{"$f":"SUM(E48:E51)","v":0},0,0,0,0,0,0,0,0,0,0,0,0,0,0,0,0,0,0,0,0,0,0,0,0,0,0,0,0,0,null,null,null,null,"Formel defekt",{"$f":"SUM(D52:AH52)","v":0}]
[]
[]
[]
[]
[]
[]
[]
[]
[]
[]
[]
[]
[]
[]
[]
[]
[]
[]
[]
[]
[]
[]
[]
[]
[null,"HT_Naz-Kopie",{"$f":"HT_NAZ","v":8.4}]
[null,"Heute:",{"$f":"SL_BisDatum","v":"2024-02-02"}]
[null,null,"Reguläre Tage ausgefüllt",{"$f":"((D80*D81)=1)*1","v":0},{"$f":"((E80*E81)=1)*1","v":0},0,0,0,0,0,0,0,0,0,0,0,0,0,0,0,0,0,0,0,0,0,0,0,0,0,0,0,0,0]
[null,null,"Arbeitstage ausgefüllt",{"$f":"OR(D14>0,D21>0)*1","v":0},{"$f":"OR(E14>0,E21>0)*1","v":0},0,0,0,0,0,0,0,0,0,0,0,0,0,0,0,0,0,0,0,0,0,0,0,0,0,0,0,0,0]
[null,null,"Arbeitstage wenn BG>0%",{"$f":"IFERROR(VLOOKUP(D3,VSA_Kalender,22),0)","v":0},0,0,0,0,0,0,0,0,0,0,0,0,0,0,0,0,0,0,0,0,0,0,0,0,0,0,0,0,0,0]
[null,null,"Der BG beträgt mehr als 0%",{"$f":"IF(D4=\"\",0,ABS(VLOOKUP(D3,VSA_Kalender,13,FALSE)>0))","v":1},1,1,1,1,1,1,1,1,1,1,1,1,1,1,1,1,1,1,1,1,1,1,1,1,1,1,1,1,1,1]
[null,null,"(Ja: 1, Nein: 0)",{"$f":"SUM(D81:AH81)","v":0},"Total Tage bei BG>0%",null,null,{"$f":"SUM(D80:AH80)","v":0},"Total Tage ausgefüllt",null,null,{"$f":"SUM(D79:AH79)","v":0},"Total reguläre Tage ausgefüllt"]
[]
[null,null,"Tag des Monats",{"$f":"D4","v":1},2,3,4,5,6,7,8,9,10,11,12,13,14,15,16,17,18,19,20,21,22,23,24,25,26,27,28,29,30,31]
[null,null,"Ist Arbeitsbereich",{"$f":"IFERROR(ABS(WEEKDAY(D3,2)<6),0)","v":1},1,0,0,1,1,1,1,1,0,0,1,1,1,1,1,0,0,1,1,1,1,1,0,0,1,1,1,1,1,0]
[null,null,"Maximaler Fehler",{"$f":"MAX(D100:D107,D98,D134)","v":0},{"$f":"MAX(E100:E107,E98,E134)","v":0},0,0,0,0,0,0,0,0,0,0,0,0,0,0,0,0,0,0,0,0,0,0,0,0,0,0,0,0,0]
[null,null,"Wird die Präsenzzeit angezeigt?",{"$f":"IF(D87=0,1,0)","v":1},{"$f":"IF(E87=0,1,0)","v":1},1,1,1,1,1,1,1,1,1,1,1,1,1,1,1,1,1,1,1,1,1,1,1,1,1,1,1,1,1]
[]
[null,null,"Gruppenfehler 1",{"$f":"IF(AND(D6-D5=0,COUNTA(D7:D12)>0),1,0)","v":0},0,0,0,0,0,0,0,0,0,0,0,0,0,0,0,0,0,0,0,0,0,0,0,0,0,0,0,0,0,0]
[null,"Gruppenfehler","(aus)",{"$f":"D90","v":0},0,0,0,0,0,0,0,0,0,0,0,0,0,0,0,0,0,0,0,0,0,0,0,0,0,0,0,0,0,0]
[null,null,"Gruppenfehler 2",{"$f":"IF(AND(D8-D7=0,COUNTA(D9:D12)>0),1,0)","v":0},0,0,0,0,0,0,0,0,0,0,0,0,0,0,0,0,0,0,0,0,0,0,0,0,0,0,0,0,0,0]
[null,null,"(aus)",{"$f":"D92","v":0},0,0,0,0,0,0,0,0,0,0,0,0,0,0,0,0,0,0,0,0,0,0,0,0,0,0,0,0,0,0]
[null,null,"Gruppenfehler 3",{"$f":"IF(AND(D10-D9=0,COUNTA(D11:D12)>0),1,0)","v":0},0,0,0,0,0,0,0,0,0,0,0,0,0,0,0,0,0,0,0,0,0,0,0,0,0,0,0,0,0,0]
[null,null,"(aus)",{"$f":"D94","v":0},0,0,0,0,0,0,0,0,0,0,0,0,0,0,0,0,0,0,0,0,0,0,0,0,0,0,0,0,0,0]
[null,null,"leer"]
[null,null,"leer"]
[null,null,"Genereller Gruppenfehler",{"$f":"MAX(D90:D95)","v":0},0,0,0,0,0,0,0,0,0,0,0,0,0,0,0,0,0,0,0,0,0,0,0,0,0,0,0,0,0,0]
[]
[null,null,"Ein1",{"$f":"IF(AND(D109=0,D110>0),1,0)","v":0},{"$f":"IF(AND(E109=0,E110>0),1,0)","v":0},0,0,0,0,0,0,0,0,0,0,0,0,0,0,0,0,0,0,0,0,0,0,0,0,0,0,0,0,0]
[null,null,"Aus1",{"$f":"IF(AND(D110>0,D110<D109),3,IF(AND(D109>0,D110=0),1,0))*D$86","v":0},{"$f":"IF(AND(E110>0,E110<E109),3,IF(AND(E109>0,E110=0),1,0))*E$86","v":0},0,0,0,0,0,0,0,0,0,0,0,0,0,0,0,0,0,0,0,0,0,0,0,0,0,0,0,0,0]
[null,null,"Ein2",{"$f":"IF(AND(D111>0,D111<D110),3,IF(AND(D111=0,D112>0),1,0))*D$86","v":0},0,0,0,0,0,0,0,0,0,0,0,0,0,0,0,0,0,0,0,0,0,0,0,0,0,0,0,0,0,0]
[null,null,"Aus2",{"$f":"IF(AND(D112>0,D112<D111),3,IF(AND(D111>0,D112=0),1,0))*D$86","v":0},{"$f":"IF(AND(E112>0,E112<E111),3,IF(AND(E111>0,E112=0),1,0))*E$86","v":0},0,0,0,0,0,0,0,0,0,0,0,0,0,0,0,0,0,0,0,0,0,0,0,0,0,0,0,0,0]
[null,"Zellenfehler","Ein3",{"$f":"IF(AND(D113>0,D113<D112),3,IF(AND(D113=0,D114>0),1,0))*D$86","v":0},{"$f":"IF(AND(E113>0,E113<E112),3,IF(AND(E113=0,E114>0),1,0))*E$86","v":0},0,0,0,0,0,0,0,0,0,0,0,0,0,0,0,0,0,0,0,0,0,0,0,0,0,0,0,0,0]
[null,null,"Aus3",{"$f":"IF(AND(D114>0,D114<D113),3,IF(AND(D113>0,D114=0),1,0))*D$86","v":0},{"$f":"IF(AND(E114>0,E114<E113),3,IF(AND(E113>0,E114=0),1,0))*E$86","v":0},0,0,0,0,0,0,0,0,0,0,0,0,0,0,0,0,0,0,0,0,0,0,0,0,0,0,0,0,0]
[null,null,"Ein4",{"$f":"IF(AND(D115>0,D115<D114),3,IF(AND(D115=0,D116>0),1,0))*D$86","v":0},{"$f":"IF(AND(E115>0,E115<E114),3,IF(AND(E115=0,E116>0),1,0))*E$86","v":0},0,0,0,0,0,0,0,0,0,0,0,0,0,0,0,0,0,0,0,0,0,0,0,0,0,0,0,0,0]
[null,null,"Aus4",{"$f":"IF(AND(D116>0,D116<D115),3,IF(AND(D115>0,D116=0),1,0))*D$86","v":0},{"$f":"IF(AND(E116>0,E116<E115),3,IF(AND(E115>0,E116=0),1,0))*E$86","v":0},0,0,0,0,0,0,0,0,0,0,0,0,0,0,0,0,0,0,0,0,0,0,0,0,0,0,0,0,0]
[]
[null,null,"Ein1",{"$f":"ROUND(D5*24,2)","v":0},0,0,0,0,0,0,0,0,0,0,0,0,0,0,0,0,0,0,0,0,0,0,0,0,0,0,0,0,0,0]
[null,null,"Aus1",0,0,0,0,0,0,0,0,0,0,0,0,0,0,0,0,0,0,0,0,0,0,0,0,0,0,0,0,0,0,0]
[null,"Zeiten dezimal gewandelt","Ein2",0,0,0,0,0,0,0,0,0,0,0,0,0,0,0,0,0,0,0,0,0,0,0,0,0,0,0,0,0,0,0]
[null,null,"Aus2",0,0,0,0,0,0,0,0,0,0,0,0,0,0,0,0,0,0,0,0,0,0,0,0,0,0,0,0,0,0,0]
[null,null,"Ein3",0,0,0,0,0,0,0,0,0,0,0,0,0,0,0,0,0,0,0,0,0,0,0,0,0,0,0,0,0,0,0]
[null,null,"Aus3",0,0,0,0,0,0,0,0,0,0,0,0,0,0,0,0,0,0,0,0,0,0,0,0,0,0,0,0,0,0,0]
[null,null,"Ein4",0,0,0,0,0,0,0,0,0,0,0,0,0,0,0,0,0,0,0,0,0,0,0,0,0,0,0,0,0,0,0]
[null,null,"Aus4",0,0,0,0,0,0,0,0,0,0,0,0,0,0,0,0,0,0,0,0,0,0,0,0,0,0,0,0,0,0,0]
[]
[null,"Pausenfehler","Gruppe1",{"$f":"IF(OR(D109=\"\",D110=\"\"),0,D110-D109)","v":0},{"$f":"IF(OR(E109=\"\",E110=\"\"),0,E110-E109)","v":0},0,0,0,0,0,0,0,0,0,0,0,0,0,0,0,{"$f":"IF(OR(U109=\"\",U110=\"\"),0,U110-U109)","v":0},{"$f":"IF(OR(V109=\"\",V110=\"\"),0,V110-V109)","v":0},0,0,0,0,0,0,0,0,0,0,0,0]
[null,null,"Gruppe2",{"$f":"IF(OR(D111=\"\",D112=\"\"),0,D112-D111)","v":0},{"$f":"IF(OR(E111=\"\",E112=\"\"),0,E112-E111)","v":0},0,0,0,0,0,0,0,0,0,0,0,0,0,0,0,{"$f":"IF(OR(U111=\"\",U112=\"\"),0,U112-U111)","v":0},{"$f":"IF(OR(V111=\"\",V112=\"\"),0,V112-V111)","v":0},0,0,0,0,0,0,0,0,0,0,0,0]
[null,null,"Gruppe3",{"$f":"IF(OR(D113=\"\",D114=\"\"),0,D114-D113)","v":0},{"$f":"IF(OR(E113=\"\",E114=\"\"),0,E114-E113)","v":0},0,0,0,0,0,0,0,0,0,0,0,0,0,0,0,{"$f":"IF(OR(U113=\"\",U114=\"\"),0,U114-U113)","v":0},{"$f":"IF(OR(V113=\"\",V114=\"\"),0,V114-V113)","v":0},0,0,0,0,0,0,0,0,0,0,0,0]
[null,null,"Gruppe4",{"$f":"IF(OR(D115=\"\",D116=\"\"),0,D116-D115)","v":0},{"$f":"IF(OR(E115=\"\",E116=\"\"),0,E116-E115)","v":0},0,0,0,0,0,0,0,0,0,0,0,0,0,0,0,{"$f":"IF(OR(U115=\"\",U116=\"\"),0,U116-U115)","v":0},{"$f":"IF(OR(V115=\"\",V116=\"\"),0,V116-V115)","v":0},0,0,0,0,0,0,0,0,0,0,0,0]
[]
[null,null,"Pause12",{"$f":"IF(OR(D110=\"\",D111=\"\"),0,D111-D110)","v":0},{"$f":"IF(OR(E110=\"\",E111=\"\"),0,E111-E110)","v":0},0,0,0,0,0,0,0,0,0,0,0,0,0,0,0,{"$f":"IF(OR(U110=\"\",U111=\"\"),0,U111-U110)","v":0},{"$f":"IF(OR(V110=\"\",V111=\"\"),0,V111-V110)","v":0},0,0,0,0,0,0,0,0,0,0,0,0]
[null,null,"Pause23",{"$f":"IF(OR(D112=\"\",D113=\"\"),0,D113-D112)","v":0},{"$f":"IF(OR(E112=\"\",E113=\"\"),0,E113-E112)","v":0},0,0,0,0,0,0,0,0,0,0,0,0,0,0,0,{"$f":"IF(OR(U112=\"\",U113=\"\"),0,U113-U112)","v":0},{"$f":"IF(OR(V112=\"\",V113=\"\"),0,V113-V112)","v":0},0,0,0,0,0,0,0,0,0,0,0,0]
[null,null,"Pause34",{"$f":"IF(OR(D114=\"\",D115=\"\"),0,D115-D114)","v":0},{"$f":"IF(OR(E114=\"\",E115=\"\"),0,E115-E114)","v":0},0,0,0,0,0,0,0,0,0,0,0,0,0,0,0,{"$f":"IF(OR(U114=\"\",U115=\"\"),0,U115-U114)","v":0},{"$f":"IF(OR(V114=\"\",V115=\"\"),0,V115-V114)","v":0},0,0,0,0,0,0,0,0,0,0,0,0]
[]
[null,null,"Kum12",{"$f":"IF(D123>=0.5,0,D118+D119)","v":0},{"$f":"IF(E123>=0.5,0,E118+E119)","v":0},0,0,0,0,0,0,0,0,0,0,0,0,0,0,0,{"$f":"IF(U123>=0.5,0,U118+U119)","v":0},{"$f":"IF(V123>=0.5,0,V118+V119)","v":0},0,0,0,0,0,0,0,0,0,0,0,0]
[null,null,"Kum123",{"$f":"IF(OR(D123>=0.5,D124>=0.5),0,D118+D119+D120)","v":0},{"$f":"IF(OR(E123>=0.5,E124>=0.5),0,E118+E119+E120)","v":0},0,0,0,0,0,0,0,0,0,0,0,0,0,0,0,{"$f":"IF(OR(U123>=0.5,U124>=0.5),0,U118+U119+U120)","v":0},{"$f":"IF(OR(V123>=0.5,V124>=0.5),0,V118+V119+V120)","v":0},0,0,0,0,0,0,0,0,0,0,0,0]
[null,null,"Kum1234",{"$f":"IF(OR(D123>=0.5,D124>=0.5,D125>=0.5),0,D118+D119+D120+D121)","v":0},{"$f":"IF(OR(E123>=0.5,E124>=0.5,E125>=0.5),0,E118+E119+E120+E121)","v":0},0,0,0,0,0,0,0,0,0,0,0,0,0,0,0,{"$f":"IF(OR(U123>=0.5,U124>=0.5,U125>=0.5),0,U118+U119+U120+U121)","v":0},{"$f":"IF(OR(V123>=0.5,V124>=0.5,V125>=0.5),0,V118+V119+V120+V121)","v":0},0,0,0,0,0,0,0,0,0,0,0,0]
[null,null,"Kum23",{"$f":"IF(D124>=0.5,0,D119+D120)","v":0},{"$f":"IF(E124>=0.5,0,E119+E120)","v":0},0,0,0,0,0,0,0,0,0,0,0,0,0,0,0,{"$f":"IF(U124>=0.5,0,U119+U120)","v":0},{"$f":"IF(V124>=0.5,0,V119+V120)","v":0},0,0,0,0,0,0,0,0,0,0,0,0]
[null,null,"Kum234",{"$f":"IF(OR(D124>=0.5,D125>=0.5),0,D119+D120+D121)","v":0},{"$f":"IF(OR(E124>=0.5,E125>=0.5),0,E119+E120+E121)","v":0},0,0,0,0,0,0,0,0,0,0,0,0,0,0,0,{"$f":"IF(OR(U124>=0.5,U125>=0.5),0,U119+U120+U121)","v":0},{"$f":"IF(OR(V124>=0.5,V125>=0.5),0,V119+V120+V121)","v":0},0,0,0,0,0,0,0,0,0,0,0,0]
[null,null,"Kum34",{"$f":"IF(D125>=0.5,0,D120+D121)","v":0},{"$f":"IF(E125>=0.5,0,E120+E121)","v":0},0,0,0,0,0,0,0,0,0,0,0,0,0,0,0,{"$f":"IF(U125>=0.5,0,U120+U121)","v":0},{"$f":"IF(V125>=0.5,0,V120+V121)","v":0},0,0,0,0,0,0,0,0,0,0,0,0]
[]
[null,null,"Pausenfehler-Code",{"$f":"IF(MAX(D118:D121,D127:D132)>6,2,0)","v":0},{"$f":"IF(MAX(E118:E121,E127:E132)>6,2,0)","v":0},0,0,0,0,0,0,0,0,0,0,0,0,0,0,0,0,0,0,0,0,0,0,0,0,0,0,0,0,0]

{"sheet":"September","index":14,"n_rows":134,"n_cols":45,"rows_kept":134,"cut":false,"hidden":true,"merged":[[11,34,12,35]]}
[9,{"$f":"DATEVALUE(\"1.\"&A1&\".\"&SL_Jahr)","v":"2024-09-01"},{"$f":"SL_Jahr","v":2024},{"$f":"B_Gde","v":"Gde:"},{"$f":"SL_Gemeinde","v":0},null,null,null,null,null,null,null,null,null,null,null,null,null,null,{"$f":"B_Schule","v":"Schule:"},{"$f":"SL_Schule","v":0},null,null,null,null,null,null,null,null,null,null,null,null,null,null,null,null,null,"Abschluss-Teilbedingungen:"]
[{"$f":"VLOOKUP(A1,Monatsenden,2)","v":45565},{"$f":"B_Bg","v":"BG:"},{"$f":"VLOOKUP(B1,VSA_Kalender,13)","v":1},{"$f":"B_Name","v":"Name:"},{"$f":"SL_Name","v":0},null,null,null,null,null,null,null,null,null,null,null,null,null,null,null,null,null,null,null,null,null,null,null,null,null,null,null,null,null,null,null,null,null,"Regel ok",{"$f":"(AN14>=AN15)","v":false},"Nicht Relevant",{"$f":"D83=0","v":true},-1,{"$f":"IF(AP2=TRUE,AQ2,0)","v":-1},"Nicht Relevant"]
[null,{"$f":"Zerf_Version & \" \" & Zerf_T","v":"Version VSA 1.06 "},null,{"$f":"DATE($C$1,MONTH($B$1),D$4)","v":"2024-09-01"},{"$f":"DATE($C$1,MONTH($B$1),E$4)","v":"2024-09-02"},"2024-09-03","2024-09-04","2024-09-05","2024-09-06","2024-09-07","2024-09-08","2024-09-09","2024-09-10","2024-09-11","2024-09-12","2024-09-13","2024-09-14","2024-09-15","2024-09-16","2024-09-17","2024-09-18","2024-09-19","2024-09-20","2024-09-21","2024-09-22","2024-09-23","2024-09-24","2024-09-25","2024-09-26","2024-09-27","2024-09-28",{"$f":"IF(MONTH(DATE($C$1,MONTH($B$1),AF$41))>MONTH($B$1),\"\",DATE($C$1,MONTH($B$1),AF$4))","v":"2024-09-29"},{"$f":"IF(MONTH(DATE($C$1,MONTH($B$1),AG$41))>MONTH($B$1),\"\",DATE($C$1,MONTH($B$1),AG$4))","v":"2024-09-30"},{"$f":"IF(MONTH(DATE($C$1,MONTH($B$1),AH$41))>MONTH($B$1),\"\",DATE($C$1,MONTH($B$1),AH$4))","v":""},null,null,null,null,"Spalten ok",{"$f":"(L83>=D83)","v":true},"Entsperrt",false,1,{"$f":"AP3*AQ3","v":0},"Entsperrt"]
[null,{"$f":"IF(VSATestModus=TRUE(),\"VSA-Modus!\",\"\")","v":""},{"$f":"IF(AN52>0,\"DEFEKT\",\"\")","v":""},{"$f":"IF(MONTH(DATE($C$1,MONTH($B$1),D$41))>MONTH($B$1),\"\",D41)","v":1},2,3,4,5,6,7,8,9,10,11,12,13,14,15,16,17,18,19,20,21,22,23,24,25,26,27,28,{"$f":"IF(MONTH(DATE($C$1,MONTH($B$1),AF$41))>MONTH($B$1),\"\",AF41)","v":29},{"$f":"IF(MONTH(DATE($C$1,MONTH($B$1),AG$41))>MONTH($B$1),\"\",AG41)","v":30},{"$f":"IF(MONTH(DATE($C$1,MONTH($B$1),AH$41))>MONTH($B$1),\"\",AH41)","v":""},null,null,null,null,"Keine Fehler",{"$f":"(SUM(D87:AH87)=0)","v":true},"Geändert",false,2,{"$f":"AP4*AQ4","v":0},"Geändert"]
[null,"     Ein   >>>",null,null,null,null,null,null,null,null,null,null,null,null,null,null,null,null,null,null,null,null,null,null,null,null,null,null,null,null,null,null,null,null,null,null,null,null,"Keine Hand",{"$f":"(AI12=\"\")","v":true},"Sperre",{"$f":"AS11=2","v":false},3,{"$f":"NOT(AP6)*AQ5","v":3},"Eingaben vornehmen"]
[null,"<<<   Aus     ",null,null,null,null,null,null,null,null,null,null,null,null,null,null,null,null,null,null,null,null,null,null,null,null,null,null,null,null,null,null,null,null,null,null,null,null,null,null,"Abschliessbar 1",{"$f":"AND(OR(AN2,AN3),AN4,AN5,NOT(AP7),NOT(AP2))","v":false},4,{"$f":"AND(NOT(OR(AP3,AP4)),AP6)*AQ6","v":0},"Abschliessbar 1"]
[null,"     Ein   >>>",null,null,null,null,null,null,null,null,null,null,null,null,null,null,null,null,null,null,null,null,null,null,null,null,null,null,null,null,null,null,null,null,null,null,null,null,null,null,"Abgeschlossen",false,5,{"$f":"AND(NOT(OR(AP3,AP4)),AP7)*AQ7","v":0},"Abgeschlossen"]
[null,"<<<   Aus     ",null,null,null,null,null,null,null,null,null,null,null,null,null,null,null,null,null,null,null,null,null,null,null,null,null,null,null,null,null,null,null,null,null,null,null,null,null,null,"Für Jahr OK",{"$f":"AND(OR(AP2,AP7),NOT(AP3))","v":true}]
[null,"     Ein   >>>"]
[null,"<<<   Aus     ",null,null,null,null,null,null,null,null,null,null,null,null,null,null,null,null,null,null,null,null,null,null,null,null,null,null,null,null,null,null,null,null,null,null,null,null,null,null,"Statusnummer:",{"$f":"IF(AR2=AQ2,AQ2,MAX(AR2:AR7))","v":-1}]
[null,"     Ein   >>>",null,null,null,null,null,null,null,null,null,null,null,null,null,null,null,null,null,null,null,null,null,null,null,null,null,null,null,null,null,null,null,null,null,null,null,null,"HatDaten:",{"$f":"AND(AP2=FALSE,OR(AP10<>3,COUNTA(D5:AH12,D20:AH35,D39:L40)>0))","v":false},"Statustext:",{"$f":"IFERROR(VLOOKUP(AP10,AR2:AS7,2,FALSE),\"unbekannt\")","v":"Nicht Relevant"},null,null,1]
[null,"<<<   Aus     ",null,null,null,null,null,null,null,null,null,null,null,null,null,null,null,null,null,null,null,null,null,null,null,null,null,null,null,null,null,null,null,null,{"$f":"IF(COUNTIF(D37:AH37,\"I\")>0,\"I\",\"\")","v":""}]
[null,{"$f":"B_PrZeit","v":"Präsenzzeit"},null,{"$f":"24*(D6-D5+D8-D7+D10-D9+D12-D11)*D88","v":0},{"$f":"24*(E6-E5+E8-E7+E10-E9+E12-E11)*E88","v":0},0,0,0,0,0,0,0,0,0,0,0,0,0,0,0,0,0,0,0,0,0,0,0,0,0,0,0,0,0,null,null,null,null,"Anzahl Regeltage:",{"$f":"D83","v":0}]
[null,{"$f":"B_TotalAZist","v":"Total Arbeitszeit (IST)"},null,{"$f":"IF(D13+D35>=D15,D13+D35,MIN(D13+D35+SUM(D20,D22,D23,D24,D25,D26,D27,D28,D29,D30,D31,D32,D33,D34),IF(D15<0,0,D15)))*D82","v":0},0,0,0,0,0,0,0,0,0,0,0,0,0,{"$f":"IF(R13+R35>=R15,R13+R35,MIN(R13+R35+SUM(R20,R22,R23,R24,R25,R26,R27,R28,R29,R30,R31,R32,R33,R34),IF(R15<0,0,R15)))*R82","v":0},{"$f":"IF(S13+S35>=S15,S13+S35,MIN(S13+S35+SUM(S20,S22,S23,S24,S25,S26,S27,S28,S29,S30,S31,S32,S33,S34),IF(S15<0,0,S15)))*S82","v":0},{"$f":"IF(T13+T35>=T15,T13+T35,MIN(T13+T35+SUM(T20,T22,T23,T24,T25,T26,T27,T28,T29,T30,T31,T32,T33,T34),IF(T15<0,0,T15)))*T82","v":0},{"$f":"IF(U13+U35>=U15,U13+U35,MIN(U13+U35+SUM(U20,U22,U23,U24,U25,U26,U27,U28,U29,U30,U31,U32,U33,U34),IF(U15<0,0,U15)))*U82","v":0},0,0,0,0,0,0,0,0,0,0,0,0,0,{"$f":"SUMIF($D$82:$AH$82,1,D14:AH14)","v":0},{"$f":"AI14-AI15","v":0},null,null,"Erfasste Regeltage",{"$f":"L83","v":0},{"$f":"AN13-AN14","v":0},"Fehlende Regeltage"]
[null,{"$f":"B_NettoSollAZ","v":"Netto-SOLL-Arbeitszeit"},null,{"$f":"ROUND(D16-D19,2)","v":0},{"$f":"ROUND(E16-E19,2)","v":0},0,0,0,0,0,0,0,0,0,0,0,0,0,0,0,0,0,0,0,0,0,0,0,0,0,0,{"$f":"IF(AF$42=4,0,ROUND(AF16-AF19,2))","v":0},{"$f":"IF(AG$42=4,0,ROUND(AG16-AG19,2))","v":0},0,{"$f":"SUMIF($D$82:$AH$82,1,D15:AH15)","v":0},null,null,null,"Minimum Regeltage",{"$f":"MinRegeltage","v":1},"Ist als Konstante im Blatt \"Intern\" hinterlegt"]
[null,{"$f":"B_BruttoSollAZ","v":"Brutto-SOLL-Arb.zeit"},null,{"$f":"VLOOKUP(D3,VSA_Kalender,16)","v":0},0,0,0,0,0,0,0,0,0,0,0,0,0,0,0,0,0,0,0,0,0,0,0,0,0,0,0,{"$f":"IF(AF$42=4,0,VLOOKUP(AF3,VSA_Kalender,16))","v":0},{"$f":"IF(AG$42=4,0,VLOOKUP(AG3,VSA_Kalender,16))","v":0},{"$f":"IF(AH$42=4,0,VLOOKUP(AH3,VSA_Kalender,16))","v":0},null,null,null,null,"Regel ok","Mind. eigetr. Regeltage erfüllt"]
[null,{"$f":"B_MehrMinder","v":"Mehr-/Minderleistung"},null,{"$f":"(SL_BisDatum>=D3)*ROUND(D14-D15,2)","v":0},0,0,0,0,0,0,0,0,0,0,0,0,0,0,0,0,0,0,0,0,0,0,0,0,0,0,0,0,0,0,{"$f":"B_Total","v":"Total"},{"$f":"B_Vortrag","v":"Vortrag"},null,null,"Spalten ok:","Alle Einträge an Regeltagen ok"]
[null,{"$f":"B_AZSaldo","v":"AZ - Saldo"},{"$f":"VLOOKUP(ROW(),VSA_Uebertrag,$A$1+3)","v":16.8},{"$f":"IFERROR((C18+D17)*(D3<=SL_BisDatum)*VLOOKUP(D3,VSA_Kalender,21,FALSE),0)","v":0},0,0,{"$f":"IFERROR((F18+G17)*(G3<=SL_BisDatum)*VLOOKUP(G3,VSA_Kalender,21,FALSE),0)","v":0},0,0,0,0,0,0,0,0,0,0,0,0,0,0,0,0,0,0,0,0,0,0,0,0,0,0,0,null,{"$f":"SUMIF($D$82:$AH$82,1,D17:AH17)+C18","v":16.8}]
[null,{"$f":"B_FTA","v":"Feiertagsanspruch"},0,{"$f":"VLOOKUP(D3,VSA_Kalender,14)","v":0},0,0,0,0,0,0,0,0,0,0,0,0,0,0,0,0,0,0,0,0,0,0,0,0,0,0,0,{"$f":"IF(AF$42=4,0,VLOOKUP(AF3,VSA_Kalender,14))","v":0},{"$f":"IF(AG$42=4,0,VLOOKUP(AG3,VSA_Kalender,14))","v":0},{"$f":"IF(AH$42=4,0,VLOOKUP(AH3,VSA_Kalender,14))","v":0},{"$f":"SUM(D19:AH19)","v":0}]
[null,{"$f":"B_Ferien","v":"Ferien"},{"$f":"VLOOKUP(ROW(),VSA_Uebertrag,$A$1+3)","v":0},null,null,null,null,null,null,null,null,null,null,null,null,null,null,null,null,null,null,null,null,null,null,null,null,null,null,null,null,null,null,null,{"$f":"SUMIF($D$82:$AH$82,1,D20:AH20)","v":0},{"$f":"ROUND(C20-AI20,2)","v":0},"Rest"]
[null,{"$f":"B_KompAZ","v":"Kompensation Arbeitstage"},0,null,null,null,null,null,null,null,null,null,null,null,null,null,null,null,null,null,null,null,null,null,null,null,null,null,null,null,null,null,null,null,0,{"$f":"ROUND(A21+C21-AI21,0)","v":0}]
[null,{"$f":"B_Arzt","v":"Arztbesuch"},0,null,null,null,null,null,null,null,null,null,null,null,null,null,null,null,null,null,null,null,null,null,null,null,null,null,null,null,null,null,null,null,0,{"$f":"ROUND(A22+C22+AI22,2)","v":0},"Summen"]
[null,{"$f":"B_Krank","v":"Krankheit"},0,null,null,null,null,null,null,null,null,null,null,null,null,null,null,null,null,null,null,null,null,null,null,null,null,null,null,null,null,null,null,null,0,{"$f":"ROUND(A23+C23+AI23,2)","v":0}]
[null,{"$f":"B_BU","v":"Berufsunfall"},0,null,null,null,null,null,null,null,null,null,null,null,null,null,null,null,null,null,null,null,null,null,null,null,null,null,null,null,null,null,null,null,0,0]
[null,{"$f":"B_NBU","v":"Nichtberufsunfall"},0,null,null,null,null,null,null,null,null,null,null,null,null,null,null,null,null,null,null,null,null,null,null,null,null,null,null,null,null,null,null,null,0,0]
[null,{"$f":"B_MilZiv","v":"Militär / Zivilschutz"},0,null,null,null,null,null,null,null,null,null,null,null,null,null,null,null,null,null,null,null,null,null,null,null,null,null,null,null,null,null,null,null,0,0]
[null,{"$f":"B_UUB","v":"Unbezahlter Urlaub"},0,null,null,null,null,null,null,null,null,null,null,null,null,null,null,null,null,null,null,null,null,null,null,null,null,null,null,null,null,null,null,null,0,{"$f":"ROUND(A27+C27-AI27,2)","v":0},"Rest"]
[null,{"$f":"B_UB","v":"Bezahlter Urlaub"},0,null,null,null,null,null,null,null,null,null,null,null,null,null,null,null,null,null,null,null,null,null,null,null,null,null,null,null,null,null,null,null,0,{"$f":"ROUND(A28+C28-AI28,2)","v":0}]
[null,{"$f":"B_NebenB","v":"Nebenbeschäftigung"},0,null,null,null,null,null,null,null,null,null,null,null,null,null,null,null,null,null,null,null,null,null,null,null,null,null,null,null,null,null,null,null,0,0]
[null,{"$f":"B_DAG","v":"D A G"},0,null,null,null,null,null,null,null,null,null,null,null,null,null,null,null,null,null,null,null,null,null,null,null,null,null,null,null,null,null,null,null,0,0]
[null,{"$f":"B_Divers","v":"Diverses"},0,null,null,null,null,null,null,null,null,null,null,null,null,null,null,null,null,null,null,null,null,null,null,null,null,null,null,null,null,null,null,null,0,0,"Summen"]
[null,{"$f":"B_FamPersErg","v":"Fam./pers. Ereignisse"},0,null,null,null,null,null,null,null,null,null,null,null,null,null,null,null,null,null,null,null,null,null,null,null,null,null,null,null,null,null,null,null,0,0]
[null,{"$f":"B_FZ1","v":"freie Zeile 1"},0,null,null,null,null,null,null,null,null,null,null,null,null,null,null,null,null,null,null,null,null,null,null,null,null,null,null,null,null,null,null,null,0,0]
[null,{"$f":"B_FZ2","v":"freie Zeile 2"},0,null,null,null,null,null,null,null,null,null,null,null,null,null,null,null,null,null,null,null,null,null,null,null,null,null,null,null,null,null,null,null,0,0]
[null,{"$f":"B_WB","v":"Weiterbildung"},0,null,null,null,null,null,null,null,null,null,null,null,null,null,null,null,null,null,null,null,null,null,null,null,null,null,null,null,null,null,null,null,0,0]
[null,{"$f":"B_FEL","v":"frei einsetzbare Lekt."},0,null,null,null,null,null,null,null,null,null,null,null,null,null,null,null,null,null,null,null,null,null,null,null,null,null,null,null,null,null,null,null,{"$f":"SUM(D36:AH36)","v":0},{"$f":"ROUND(C36-AI36,0)","v":0}]
[null,null,null,{"$f":"IF(AND((D13 - D15)+SUM(D20,D22:D34)>0.00001,SUM(D20,D22:D34)>0),\"I\",\"\")","v":""},"","","","","","","","","","","","","","","","","","","","","","","","","","","","","",""]
[null,null,"Visum","Identität:",null,null,null,null,"Datum:",null,"Status:"]
[null,null,"SL"]
[null,null,"VG"]
[null,null,null,1,2,3,4,5,6,7,8,9,10,11,12,13,14,15,16,17,18,19,20,21,22,23,24,25,26,27,28,29,30,31]
[null,null,null,{"$f":"IF(D3=\"\",4,VLOOKUP(D3,VSA_Kalender,18))","v":1},0,0,0,0,0,1,1,0,0,0,0,0,1,1,0,0,0,0,0,1,1,0,0,0,0,0,1,1,0,4]
[]
[null,null,null,{"$f":"IF(D19>0,VLOOKUP(D3,KalFeiertage,6,FALSE),\"\")","v":""},"","","","","","","","","","","","","","","","","","","","","","","","","","","","","",""]
[null,null,null,"FT=WENN(D13+D35>=D15;D13+D35;MIN(D13+D35+SUMME(D20;D22;D23;D24;D25;D26;D27;D28;D29;D30;D31;D32;D33;D34);WENN(D15<0;0;D15)))*D82","FT=WENN(E13+E35>=E15;E13+E35;MIN(E13+E35+SUMME(E20;E22;E23;E24;E25;E26;E27;E28;E29;E30;E31;E32;E33;E34);WENN(E15<0;0;E15)))*E82","FT=WENN(F13+F35>=F15;F13+F35;MIN(F13+F35+SUMME(F20;F22;F23;F24;F25;F26;F27;F28;F29;F30;F31;F32;F33;F34);WENN(F15<0;0;F15)))*F82","FT=WENN(G13+G35>=G15;G13+G35;MIN(G13+G35+SUMME(G20;G22;G23;G24;G25;G26;G27;G28;G29;G30;G31;G32;G33;G34);WENN(G15<0;0;G15)))*G82","FT=WENN(H13+H35>=H15;H13+H35;MIN(H13+H35+SUMME(H20;H22;H23;H24;H25;H26;H27;H28;H29;H30;H31;H32;H33;H34);WENN(H15<0;0;H15)))*H82","FT=WENN(I13+I35>=I15;I13+I35;MIN(I13+I35+SUMME(I20;I22;I23;I24;I25;I26;I27;I28;I29;I30;I31;I32;I33;I34);WENN(I15<0;0;I15)))*I82","FT=WENN(J13+J35>=J15;J13+J35;MIN(J13+J35+SUMME(J20;J22;J23;J24;J25;J26;J27;J28;J29;J30;J31;J32;J33;J34);WENN(J15<0;0;J15)))*J82","FT=WENN(K13+K35>=K15;K13+K35;MIN(K13+K35+SUMME(K20;K22;K23;K24;K25;K26;K27;K28;K29;K30;K31;K32;K33;K34);WENN(K15<0;0;K15)))*K82","FT=WENN(L13+L35>=L15;L13+L35;MIN(L13+L35+SUMME(L20;L22;L23;L24;L25;L26;L27;L28;L29;L30;L31;L32;L33;L34);WENN(L15<0;0;L15)))*L82","FT=WENN(M13+M35>=M15;M13+M35;MIN(M13+M35+SUMME(M20;M22;M23;M24;M25;M26;M27;M28;M29;M30;M31;M32;M33;M34);WENN(M15<0;0;M15)))*M82","FT=WENN(N13+N35>=N15;N13+N35;MIN(N13+N35+SUMME(N20;N22;N23;N24;N25;N26;N27;N28;N29;N30;N31;N32;N33;N34);WENN(N15<0;0;N15)))*N82","FT=WENN(O13+O35>=O15;O13+O35;MIN(O13+O35+SUMME(O20;O22;O23;O24;O25;O26;O27;O28;O29;O30;O31;O32;O33;O34);WENN(O15<0;0;O15)))*O82","FT=WENN(P13+P35>=P15;P13+P35;MIN(P13+P35+SUMME(P20;P22;P23;P24;P25;P26;P27;P28;P29;P30;P31;P32;P33;P34);WENN(P15<0;0;P15)))*P82","FT=WENN(Q13+Q35>=Q15;Q13+Q35;MIN(Q13+Q35+SUMME(Q20;Q22;Q23;Q24;Q25;Q26;Q27;Q28;Q29;Q30;Q31;Q32;Q33;Q34);WENN(Q15<0;0;Q15)))*Q82","FT=WENN(R13+R35>=R15;R13+R35;MIN(R13+R35+SUMME(R20;R22;R23;R24;R25;R26;R27;R28;R29;R30;R31;R32;R33;R34);WENN(R15<0;0;R15)))*R82","FT=WENN(S13+S35>=S15;S13+S35;MIN(S13+S35+SUMME(S20;S22;S23;S24;S25;S26;S27;S28;S29;S30;S31;S32;S33;S34);WENN(S15<0;0;S15)))*S82","FT=WENN(T13+T35>=T15;T13+T35;MIN(T13+T35+SUMME(T20;T22;T23;T24;T25;T26;T27;T28;T29;T30;T31;T32;T33;T34);WENN(T15<0;0;T15)))*T82","FT=WENN(U13+U35>=U15;U13+U35;MIN(U13+U35+SUMME(U20;U22;U23;U24;U25;U26;U27;U28;U29;U30;U31;U32;U33;U34);WENN(U15<0;0;U15)))*U82","FT=WENN(V13+V35>=V15;V13+V35;MIN(V13+V35+SUMME(V20;V22;V23;V24;V25;V26;V27;V28;V29;V30;V31;V32;V33;V34);WENN(V15<0;0;V15)))*V82","FT=WENN(W13+W35>=W15;W13+W35;MIN(W13+W35+SUMME(W20;W22;W23;W24;W25;W26;W27;W28;W29;W30;W31;W32;W33;W34);WENN(W15<0;0;W15)))*W82","FT=WENN(X13+X35>=X15;X13+X35;MIN(X13+X35+SUMME(X20;X22;X23;X24;X25;X26;X27;X28;X29;X30;X31;X32;X33;X34);WENN(X15<0;0;X15)))*X82","FT=WENN(Y13+Y35>=Y15;Y13+Y35;MIN(Y13+Y35+SUMME(Y20;Y22;Y23;Y24;Y25;Y26;Y27;Y28;Y29;Y30;Y31;Y32;Y33;Y34);WENN(Y15<0;0;Y15)))*Y82","FT=WENN(Z13+Z35>=Z15;Z13+Z35;MIN(Z13+Z35+SUMME(Z20;Z22;Z23;Z24;Z25;Z26;Z27;Z28;Z29;Z30;Z31;Z32;Z33;Z34);WENN(Z15<0;0;Z15)))*Z82","FT=WENN(AA13+AA35>=AA15;AA13+AA35;MIN(AA13+AA35+SUMME(AA20;AA22;AA23;AA24;AA25;AA26;AA27;AA28;AA29;AA30;AA31;AA32;AA33;AA34);WENN(AA15<0;0;AA15)))*AA82","FT=WENN(AB13+AB35>=AB15;AB13+AB35;MIN(AB13+AB35+SUMME(AB20;AB22;AB23;AB24;AB25;AB26;AB27;AB28;AB29;AB30;AB31;AB32;AB33;AB34);WENN(AB15<0;0;AB15)))*AB82","FT=WENN(AC13+AC35>=AC15;AC13+AC35;MIN(AC13+AC35+SUMME(AC20;AC22;AC23;AC24;AC25;AC26;AC27;AC28;AC29;AC30;AC31;AC32;AC33;AC34);WENN(AC15<0;0;AC15)))*AC82","FT=WENN(AD13+AD35>=AD15;AD13+AD35;MIN(AD13+AD35+SUMME(AD20;AD22;AD23;AD24;AD25;AD26;AD27;AD28;AD29;AD30;AD31;AD32;AD33;AD34);WENN(AD15<0;0;AD15)))*AD82","FT=WENN(AE13+AE35>=AE15;AE13+AE35;MIN(AE13+AE35+SUMME(AE20;AE22;AE23;AE24;AE25;AE26;AE27;AE28;AE29;AE30;AE31;AE32;AE33;AE34);WENN(AE15<0;0;AE15)))*AE82","FT=WENN(AF13+AF35>=AF15;AF13+AF35;MIN(AF13+AF35+SUMME(AF20;AF22;AF23;AF24;AF25;AF26;AF27;AF28;AF29;AF30;AF31;AF32;AF33;AF34);WENN(AF15<0;0;AF15)))*AF82","FT=WENN(AG13+AG35>=AG15;AG13+AG35;MIN(AG13+AG35+SUMME(AG20;AG22;AG23;AG24;AG25;AG26;AG27;AG28;AG29;AG30;AG31;AG32;AG33;AG34);WENN(AG15<0;0;AG15)))*AG82","FT=WENN(AH13+AH35>=AH15;AH13+AH35;MIN(AH13+AH35+SUMME(AH20;AH22;AH23;AH24;AH25;AH26;AH27;AH28;AH29;AH30;AH31;AH32;AH33;AH34);WENN(AH15<0;0;AH15)))*AH82"]
[null,null,null,"FT=24*(D6-D5+D8-D7+D10-D9+D12-D11)*D88","FT=24*(E6-E5+E8-E7+E10-E9+E12-E11)*E88","FT=24*(F6-F5+F8-F7+F10-F9+F12-F11)*F88","FT=24*(G6-G5+G8-G7+G10-G9+G12-G11)*G88","FT=24*(H6-H5+H8-H7+H10-H9+H12-H11)*H88","FT=24*(I6-I5+I8-I7+I10-I9+I12-I11)*I88","FT=24*(J6-J5+J8-J7+J10-J9+J12-J11)*J88","FT=24*(K6-K5+K8-K7+K10-K9+K12-K11)*K88","FT=24*(L6-L5+L8-L7+L10-L9+L12-L11)*L88","FT=24*(M6-M5+M8-M7+M10-M9+M12-M11)*M88","FT=24*(N6-N5+N8-N7+N10-N9+N12-N11)*N88","FT=24*(O6-O5+O8-O7+O10-O9+O12-O11)*O88","FT=24*(P6-P5+P8-P7+P10-P9+P12-P11)*P88","FT=24*(Q6-Q5+Q8-Q7+Q10-Q9+Q12-Q11)*Q88","FT=24*(R6-R5+R8-R7+R10-R9+R12-R11)*R88","FT=24*(S6-S5+S8-S7+S10-S9+S12-S11)*S88","FT=24*(T6-T5+T8-T7+T10-T9+T12-T11)*T88","FT=24*(U6-U5+U8-U7+U10-U9+U12-U11)*U88","FT=24*(V6-V5+V8-V7+V10-V9+V12-V11)*V88","FT=24*(W6-W5+W8-W7+W10-W9+W12-W11)*W88","FT=24*(X6-X5+X8-X7+X10-X9+X12-X11)*X88","FT=24*(Y6-Y5+Y8-Y7+Y10-Y9+Y12-Y11)*Y88","FT=24*(Z6-Z5+Z8-Z7+Z10-Z9+Z12-Z11)*Z88","FT=24*(AA6-AA5+AA8-AA7+AA10-AA9+AA12-AA11)*AA88","FT=24*(AB6-AB5+AB8-AB7+AB10-AB9+AB12-AB11)*AB88","FT=24*(AC6-AC5+AC8-AC7+AC10-AC9+AC12-AC11)*AC88","FT=24*(AD6-AD5+AD8-AD7+AD10-AD9+AD12-AD11)*AD88","FT=24*(AE6-AE5+AE8-AE7+AE10-AE9+AE12-AE11)*AE88","FT=24*(AF6-AF5+AF8-AF7+AF10-AF9+AF12-AF11)*AF88","FT=24*(AG6-AG5+AG8-AG7+AG10-AG9+AG12-AG11)*AG88","FT=24*(AH6-AH5+AH8-AH7+AH10-AH9+AH12-AH11)*AH88"]
[null,null,null,"FT=ODER(D14>0;D21>0)*1","FT=ODER(E14>0;E21>0)*1","FT=ODER(F14>0;F21>0)*1","FT=ODER(G14>0;G21>0)*1","FT=ODER(H14>0;H21>0)*1","FT=ODER(I14>0;I21>0)*1","FT=ODER(J14>0;J21>0)*1","FT=ODER(K14>0;K21>0)*1","FT=ODER(L14>0;L21>0)*1","FT=ODER(M14>0;M21>0)*1","FT=ODER(N14>0;N21>0)*1","FT=ODER(O14>0;O21>0)*1","FT=ODER(P14>0;P21>0)*1","FT=ODER(Q14>0;Q21>0)*1","FT=ODER(R14>0;R21>0)*1","FT=ODER(S14>0;S21>0)*1","FT=ODER(T14>0;T21>0)*1","FT=ODER(U14>0;U21>0)*1","FT=ODER(V14>0;V21>0)*1","FT=ODER(W14>0;W21>0)*1","FT=ODER(X14>0;X21>0)*1","FT=ODER(Y14>0;Y21>0)*1","FT=ODER(Z14>0;Z21>0)*1","FT=ODER(AA14>0;AA21>0)*1","FT=ODER(AB14>0;AB21>0)*1","FT=ODER(AC14>0;AC21>0)*1","FT=ODER(AD14>0;AD21>0)*1","FT=ODER(AE14>0;AE21>0)*1","FT=ODER(AF14>0;AF21>0)*1","FT=ODER(AG14>0;AG21>0)*1","FT=ODER(AH14>0;AH21>0)*1"]
[null,null,null,{"$f":"ABS(\"FT\"&_xlfn.FORMULATEXT(D14)<>D45)","v":0},{"$f":"ABS(\"FT\"&_xlfn.FORMULATEXT(E14)<>E45)","v":0},0,0,0,0,0,0,0,0,0,0,0,0,0,0,0,0,0,0,0,0,0,0,0,0,0,0,0,0,0]
[null,null,null,{"$f":"ABS(\"FT\"&_xlfn.FORMULATEXT(D13)<>D46)","v":0},{"$f":"ABS(\"FT\"&_xlfn.FORMULATEXT(E13)<>E46)","v":0},0,0,0,0,0,0,0,0,0,0,0,0,0,0,0,0,0,0,0,0,0,0,0,0,0,0,0,0,0]
[null,null,null,{"$f":"ABS(\"FT\"&_xlfn.FORMULATEXT(D80)<>D47)","v":0},{"$f":"ABS(\"FT\"&_xlfn.FORMULATEXT(E80)<>E47)","v":0},0,0,0,0,0,0,0,0,0,0,0,0,0,0,0,0,0,0,0,0,0,0,0,0,0,0,0,0,0]
[null,null,null,{"$f":"ABS(ISERROR(D37))","v":0},{"$f":"ABS(ISERROR(E37))","v":0},0,0,0,0,0,0,0,0,0,0,0,0,0,0,0,0,0,0,0,0,0,0,0,0,0,0,0,0,0]
[null,null,null,{"$f":"SUM(D48:D51)","v":0},{"$f":"SUM(E48:E51)","v":0},0,0,0,0,0,0,0,0,0,0,0,0,0,0,0,0,0,0,0,0,0,0,0,0,0,0,0,0,0,null,null,null,null,"Formel defekt",{"$f":"SUM(D52:AH52)","v":0}]
[]
[]
[]
[]
[]
[]
[]
[]
[]
[]
[]
[]
[]
[]
[]
[]
[]
[]
[]
[]
[]
[]
[]
[]
[null,"HT_Naz-Kopie",{"$f":"HT_NAZ","v":8.4}]
[null,"Heute:",{"$f":"SL_BisDatum","v":"2024-02-02"}]
[null,null,"Reguläre Tage ausgefüllt",{"$f":"((D80*D81)=1)*1","v":0},{"$f":"((E80*E81)=1)*1","v":0},0,0,0,0,0,0,0,0,0,0,0,0,0,0,0,0,0,0,0,0,0,0,0,0,0,0,0,0,0]
[null,null,"Arbeitstage ausgefüllt",{"$f":"OR(D14>0,D21>0)*1","v":0},{"$f":"OR(E14>0,E21>0)*1","v":0},0,0,0,0,0,0,0,0,0,0,0,0,0,0,0,0,0,0,0,0,0,0,0,0,0,0,0,0,0]
[null,null,"Arbeitstage wenn BG>0%",{"$f":"IFERROR(VLOOKUP(D3,VSA_Kalender,22),0)","v":0},0,0,0,0,0,0,0,0,0,0,0,0,0,0,0,0,0,0,0,0,0,0,0,0,0,0,0,0,0,0]
[null,null,"Der BG beträgt mehr als 0%",{"$f":"IF(D4=\"\",0,ABS(VLOOKUP(D3,VSA_Kalender,13,FALSE)>0))","v":1},1,1,1,1,1,1,1,1,1,1,1,1,1,1,1,1,1,1,1,1,1,1,1,1,1,1,1,1,1,0]
[null,null,"(Ja: 1, Nein: 0)",{"$f":"SUM(D81:AH81)","v":0},"Total Tage bei BG>0%",null,null,{"$f":"SUM(D80:AH80)","v":0},"Total Tage ausgefüllt",null,null,{"$f":"SUM(D79:AH79)","v":0},"Total reguläre Tage ausgefüllt"]
[]
[null,null,"Tag des Monats",{"$f":"D4","v":1},2,3,4,5,6,7,8,9,10,11,12,13,14,15,16,17,18,19,20,21,22,23,24,25,26,27,28,29,30,""]
[null,null,"Ist Arbeitsbereich",{"$f":"IFERROR(ABS(WEEKDAY(D3,2)<6),0)","v":0},1,1,1,1,1,0,0,1,1,1,1,1,0,0,1,1,1,1,1,0,0,1,1,1,1,1,0,0,1,0]
[null,null,"Maximaler Fehler",{"$f":"MAX(D100:D107,D98,D134)","v":0},{"$f":"MAX(E100:E107,E98,E134)","v":0},0,0,0,0,0,0,0,0,0,0,0,0,0,0,0,0,0,0,0,0,0,0,0,0,0,0,0,0,0]
[null,null,"Wird die Präsenzzeit angezeigt?",{"$f":"IF(D87=0,1,0)","v":1},{"$f":"IF(E87=0,1,0)","v":1},1,1,1,1,1,1,1,1,1,1,1,1,1,1,1,1,1,1,1,1,1,1,1,1,1,1,1,1,1]
[]
[null,null,"Gruppenfehler 1",{"$f":"IF(AND(D6-D5=0,COUNTA(D7:D12)>0),1,0)","v":0},0,0,0,0,0,0,0,0,0,0,0,0,0,0,0,0,0,0,0,0,0,0,0,0,0,0,0,0,0,0]
[null,"Gruppenfehler","(aus)",{"$f":"D90","v":0},0,0,0,0,0,0,0,0,0,0,0,0,0,0,0,0,0,0,0,0,0,0,0,0,0,0,0,0,0,0]
[null,null,"Gruppenfehler 2",{"$f":"IF(AND(D8-D7=0,COUNTA(D9:D12)>0),1,0)","v":0},0,0,0,0,0,0,0,0,0,0,0,0,0,0,0,0,0,0,0,0,0,0,0,0,0,0,0,0,0,0]
[null,null,"(aus)",{"$f":"D92","v":0},0,0,0,0,0,0,0,0,0,0,0,0,0,0,0,0,0,0,0,0,0,0,0,0,0,0,0,0,0,0]
[null,null,"Gruppenfehler 3",{"$f":"IF(AND(D10-D9=0,COUNTA(D11:D12)>0),1,0)","v":0},0,0,0,0,0,0,0,0,0,0,0,0,0,0,0,0,0,0,0,0,0,0,0,0,0,0,0,0,0,0]
[null,null,"(aus)",{"$f":"D94","v":0},0,0,0,0,0,0,0,0,0,0,0,0,0,0,0,0,0,0,0,0,0,0,0,0,0,0,0,0,0,0]
[null,null,"leer"]
[null,null,"leer"]
[null,null,"Genereller Gruppenfehler",{"$f":"MAX(D90:D95)","v":0},0,0,0,0,0,0,0,0,0,0,0,0,0,0,0,0,0,0,0,0,0,0,0,0,0,0,0,0,0,0]
[]
[null,null,"Ein1",{"$f":"IF(AND(D109=0,D110>0),1,0)","v":0},{"$f":"IF(AND(E109=0,E110>0),1,0)","v":0},0,0,0,0,0,0,0,0,0,0,0,0,0,0,0,0,0,0,0,0,0,0,0,0,0,0,0,0,0]
[null,null,"Aus1",{"$f":"IF(AND(D110>0,D110<D109),3,IF(AND(D109>0,D110=0),1,0))*D$86","v":0},{"$f":"IF(AND(E110>0,E110<E109),3,IF(AND(E109>0,E110=0),1,0))*E$86","v":0},0,0,0,0,0,0,0,0,0,0,0,0,0,0,0,0,0,0,0,0,0,0,0,0,0,0,0,0,0]
[null,null,"Ein2",{"$f":"IF(AND(D111>0,D111<D110),3,IF(AND(D111=0,D112>0),1,0))*D$86","v":0},0,0,0,0,0,0,0,0,0,0,0,0,0,0,0,0,0,0,0,0,0,0,0,0,0,0,0,0,0,0]
[null,null,"Aus2",{"$f":"IF(AND(D112>0,D112<D111),3,IF(AND(D111>0,D112=0),1,0))*D$86","v":0},{"$f":"IF(AND(E112>0,E112<E111),3,IF(AND(E111>0,E112=0),1,0))*E$86","v":0},0,0,0,0,0,0,0,0,0,0,0,0,0,0,0,0,0,0,0,0,0,0,0,0,0,0,0,0,0]
[null,"Zellenfehler","Ein3",{"$f":"IF(AND(D113>0,D113<D112),3,IF(AND(D113=0,D114>0),1,0))*D$86","v":0},{"$f":"IF(AND(E113>0,E113<E112),3,IF(AND(E113=0,E114>0),1,0))*E$86","v":0},0,0,0,0,0,0,0,0,0,0,0,0,0,0,0,0,0,0,0,0,0,0,0,0,0,0,0,0,0]
[null,null,"Aus3",{"$f":"IF(AND(D114>0,D114<D113),3,IF(AND(D113>0,D114=0),1,0))*D$86","v":0},{"$f":"IF(AND(E114>0,E114<E113),3,IF(AND(E113>0,E114=0),1,0))*E$86","v":0},0,0,0,0,0,0,0,0,0,0,0,0,0,0,0,0,0,0,0,0,0,0,0,0,0,0,0,0,0]
[null,null,"Ein4",{"$f":"IF(AND(D115>0,D115<D114),3,IF(AND(D115=0,D116>0),1,0))*D$86","v":0},{"$f":"IF(AND(E115>0,E115<E114),3,IF(AND(E115=0,E116>0),1,0))*E$86","v":0},0,0,0,0,0,0,0,0,0,0,0,0,0,0,0,0,0,0,0,0,0,0,0,0,0,0,0,0,0]
[null,null,"Aus4",{"$f":"IF(AND(D116>0,D116<D115),3,IF(AND(D115>0,D116=0),1,0))*D$86","v":0},{"$f":"IF(AND(E116>0,E116<E115),3,IF(AND(E115>0,E116=0),1,0))*E$86","v":0},0,0,0,0,0,0,0,0,0,0,0,0,0,0,0,0,0,0,0,0,0,0,0,0,0,0,0,0,0]
[]
[null,null,"Ein1",{"$f":"ROUND(D5*24,2)","v":0},0,0,0,0,0,0,0,0,0,0,0,0,0,0,0,0,0,0,0,0,0,0,0,0,0,0,0,0,0,0]
[null,null,"Aus1",0,0,0,0,0,0,0,0,0,0,0,0,0,0,0,0,0,0,0,0,0,0,0,0,0,0,0,0,0,0,0]
[null,"Zeiten dezimal gewandelt","Ein2",0,0,0,0,0,0,0,0,0,0,0,0,0,0,0,0,0,0,0,0,0,0,0,0,0,0,0,0,0,0,0]
[null,null,"Aus2",0,0,0,0,0,0,0,0,0,0,0,0,0,0,0,0,0,0,0,0,0,0,0,0,0,0,0,0,0,0,0]
[null,null,"Ein3",0,0,0,0,0,0,0,0,0,0,0,0,0,0,0,0,0,0,0,0,0,0,0,0,0,0,0,0,0,0,0]
[null,null,"Aus3",0,0,0,0,0,0,0,0,0,0,0,0,0,0,0,0,0,0,0,0,0,0,0,0,0,0,0,0,0,0,0]
[null,null,"Ein4",0,0,0,0,0,0,0,0,0,0,0,0,0,0,0,0,0,0,0,0,0,0,0,0,0,0,0,0,0,0,0]
[null,null,"Aus4",0,0,0,0,0,0,0,0,0,0,0,0,0,0,0,0,0,0,0,0,0,0,0,0,0,0,0,0,0,0,0]
[]
[null,"Pausenfehler","Gruppe1",{"$f":"IF(OR(D109=\"\",D110=\"\"),0,D110-D109)","v":0},{"$f":"IF(OR(E109=\"\",E110=\"\"),0,E110-E109)","v":0},0,0,0,0,0,0,0,0,0,0,0,0,0,0,0,{"$f":"IF(OR(U109=\"\",U110=\"\"),0,U110-U109)","v":0},{"$f":"IF(OR(V109=\"\",V110=\"\"),0,V110-V109)","v":0},0,0,0,0,0,0,0,0,0,0,0,0]
[null,null,"Gruppe2",{"$f":"IF(OR(D111=\"\",D112=\"\"),0,D112-D111)","v":0},{"$f":"IF(OR(E111=\"\",E112=\"\"),0,E112-E111)","v":0},0,0,0,0,0,0,0,0,0,0,0,0,0,0,0,{"$f":"IF(OR(U111=\"\",U112=\"\"),0,U112-U111)","v":0},{"$f":"IF(OR(V111=\"\",V112=\"\"),0,V112-V111)","v":0},0,0,0,0,0,0,0,0,0,0,0,0]
[null,null,"Gruppe3",{"$f":"IF(OR(D113=\"\",D114=\"\"),0,D114-D113)","v":0},{"$f":"IF(OR(E113=\"\",E114=\"\"),0,E114-E113)","v":0},0,0,0,0,0,0,0,0,0,0,0,0,0,0,0,{"$f":"IF(OR(U113=\"\",U114=\"\"),0,U114-U113)","v":0},{"$f":"IF(OR(V113=\"\",V114=\"\"),0,V114-V113)","v":0},0,0,0,0,0,0,0,0,0,0,0,0]
[null,null,"Gruppe4",{"$f":"IF(OR(D115=\"\",D116=\"\"),0,D116-D115)","v":0},{"$f":"IF(OR(E115=\"\",E116=\"\"),0,E116-E115)","v":0},0,0,0,0,0,0,0,0,0,0,0,0,0,0,0,{"$f":"IF(OR(U115=\"\",U116=\"\"),0,U116-U115)","v":0},{"$f":"IF(OR(V115=\"\",V116=\"\"),0,V116-V115)","v":0},0,0,0,0,0,0,0,0,0,0,0,0]
[]
[null,null,"Pause12",{"$f":"IF(OR(D110=\"\",D111=\"\"),0,D111-D110)","v":0},{"$f":"IF(OR(E110=\"\",E111=\"\"),0,E111-E110)","v":0},0,0,0,0,0,0,0,0,0,0,0,0,0,0,0,{"$f":"IF(OR(U110=\"\",U111=\"\"),0,U111-U110)","v":0},{"$f":"IF(OR(V110=\"\",V111=\"\"),0,V111-V110)","v":0},0,0,0,0,0,0,0,0,0,0,0,0]
[null,null,"Pause23",{"$f":"IF(OR(D112=\"\",D113=\"\"),0,D113-D112)","v":0},{"$f":"IF(OR(E112=\"\",E113=\"\"),0,E113-E112)","v":0},0,0,0,0,0,0,0,0,0,0,0,0,0,0,0,{"$f":"IF(OR(U112=\"\",U113=\"\"),0,U113-U112)","v":0},{"$f":"IF(OR(V112=\"\",V113=\"\"),0,V113-V112)","v":0},0,0,0,0,0,0,0,0,0,0,0,0]
[null,null,"Pause34",{"$f":"IF(OR(D114=\"\",D115=\"\"),0,D115-D114)","v":0},{"$f":"IF(OR(E114=\"\",E115=\"\"),0,E115-E114)","v":0},0,0,0,0,0,0,0,0,0,0,0,0,0,0,0,{"$f":"IF(OR(U114=\"\",U115=\"\"),0,U115-U114)","v":0},{"$f":"IF(OR(V114=\"\",V115=\"\"),0,V115-V114)","v":0},0,0,0,0,0,0,0,0,0,0,0,0]
[]
[null,null,"Kum12",{"$f":"IF(D123>=0.5,0,D118+D119)","v":0},{"$f":"IF(E123>=0.5,0,E118+E119)","v":0},0,0,0,0,0,0,0,0,0,0,0,0,0,0,0,{"$f":"IF(U123>=0.5,0,U118+U119)","v":0},{"$f":"IF(V123>=0.5,0,V118+V119)","v":0},0,0,0,0,0,0,0,0,0,0,0,0]
[null,null,"Kum123",{"$f":"IF(OR(D123>=0.5,D124>=0.5),0,D118+D119+D120)","v":0},{"$f":"IF(OR(E123>=0.5,E124>=0.5),0,E118+E119+E120)","v":0},0,0,0,0,0,0,0,0,0,0,0,0,0,0,0,{"$f":"IF(OR(U123>=0.5,U124>=0.5),0,U118+U119+U120)","v":0},{"$f":"IF(OR(V123>=0.5,V124>=0.5),0,V118+V119+V120)","v":0},0,0,0,0,0,0,0,0,0,0,0,0]
[null,null,"Kum1234",{"$f":"IF(OR(D123>=0.5,D124>=0.5,D125>=0.5),0,D118+D119+D120+D121)","v":0},{"$f":"IF(OR(E123>=0.5,E124>=0.5,E125>=0.5),0,E118+E119+E120+E121)","v":0},0,0,0,0,0,0,0,0,0,0,0,0,0,0,0,{"$f":"IF(OR(U123>=0.5,U124>=0.5,U125>=0.5),0,U118+U119+U120+U121)","v":0},{"$f":"IF(OR(V123>=0.5,V124>=0.5,V125>=0.5),0,V118+V119+V120+V121)","v":0},0,0,0,0,0,0,0,0,0,0,0,0]
[null,null,"Kum23",{"$f":"IF(D124>=0.5,0,D119+D120)","v":0},{"$f":"IF(E124>=0.5,0,E119+E120)","v":0},0,0,0,0,0,0,0,0,0,0,0,0,0,0,0,{"$f":"IF(U124>=0.5,0,U119+U120)","v":0},{"$f":"IF(V124>=0.5,0,V119+V120)","v":0},0,0,0,0,0,0,0,0,0,0,0,0]
[null,null,"Kum234",{"$f":"IF(OR(D124>=0.5,D125>=0.5),0,D119+D120+D121)","v":0},{"$f":"IF(OR(E124>=0.5,E125>=0.5),0,E119+E120+E121)","v":0},0,0,0,0,0,0,0,0,0,0,0,0,0,0,0,{"$f":"IF(OR(U124>=0.5,U125>=0.5),0,U119+U120+U121)","v":0},{"$f":"IF(OR(V124>=0.5,V125>=0.5),0,V119+V120+V121)","v":0},0,0,0,0,0,0,0,0,0,0,0,0]
[null,null,"Kum34",{"$f":"IF(D125>=0.5,0,D120+D121)","v":0},{"$f":"IF(E125>=0.5,0,E120+E121)","v":0},0,0,0,0,0,0,0,0,0,0,0,0,0,0,0,{"$f":"IF(U125>=0.5,0,U120+U121)","v":0},{"$f":"IF(V125>=0.5,0,V120+V121)","v":0},0,0,0,0,0,0,0,0,0,0,0,0]
[]
[null,null,"Pausenfehler-Code",{"$f":"IF(MAX(D118:D121,D127:D132)>6,2,0)","v":0},{"$f":"IF(MAX(E118:E121,E127:E132)>6,2,0)","v":0},0,0,0,0,0,0,0,0,0,0,0,0,0,0,0,0,0,0,0,0,0,0,0,0,0,0,0,0,0]

{"sheet":"Oktober","index":15,"n_rows":134,"n_cols":45,"rows_kept":134,"cut":false,"hidden":true,"merged":[[11,34,12,35]]}
[10,{"$f":"DATEVALUE(\"1.\"&A1&\".\"&SL_Jahr)","v":"2024-10-01"},{"$f":"SL_Jahr","v":2024},{"$f":"B_Gde","v":"Gde:"},{"$f":"SL_Gemeinde","v":0},null,null,null,null,null,null,null,null,null,null,null,null,null,null,{"$f":"B_Schule","v":"Schule:"},{"$f":"SL_Schule","v":0},null,null,null,null,null,null,null,null,null,null,null,null,null,null,null,null,null,"Abschluss-Teilbedingungen:"]
[{"$f":"VLOOKUP(A1,Monatsenden,2)","v":45596},{"$f":"B_Bg","v":"BG:"},{"$f":"VLOOKUP(B1,VSA_Kalender,13)","v":1},{"$f":"B_Name","v":"Name:"},{"$f":"SL_Name","v":0},null,null,null,null,null,null,null,null,null,null,null,null,null,null,null,null,null,null,null,null,null,null,null,null,null,null,null,null,null,null,null,null,null,"Regel ok",{"$f":"(AN14>=AN15)","v":false},"Nicht Relevant",{"$f":"D83=0","v":true},-1,{"$f":"IF(AP2=TRUE,AQ2,0)","v":-1},"Nicht Relevant"]
[null,{"$f":"Zerf_Version & \" \" & Zerf_T","v":"Version VSA 1.06 "},null,{"$f":"DATE($C$1,MONTH($B$1),D$4)","v":"2024-10-01"},{"$f":"DATE($C$1,MONTH($B$1),E$4)","v":"2024-10-02"},"2024-10-03","2024-10-04","2024-10-05","2024-10-06","2024-10-07","2024-10-08","2024-10-09","2024-10-10","2024-10-11","2024-10-12","2024-10-13","2024-10-14","2024-10-15","2024-10-16","2024-10-17","2024-10-18","2024-10-19","2024-10-20","2024-10-21","2024-10-22","2024-10-23","2024-10-24","2024-10-25","2024-10-26","2024-10-27","2024-10-28",{"$f":"IF(MONTH(DATE($C$1,MONTH($B$1),AF$41))>MONTH($B$1),\"\",DATE($C$1,MONTH($B$1),AF$4))","v":"2024-10-29"},{"$f":"IF(MONTH(DATE($C$1,MONTH($B$1),AG$41))>MONTH($B$1),\"\",DATE($C$1,MONTH($B$1),AG$4))","v":"2024-10-30"},{"$f":"IF(MONTH(DATE($C$1,MONTH($B$1),AH$41))>MONTH($B$1),\"\",DATE($C$1,MONTH($B$1),AH$4))","v":"2024-10-31"},null,null,null,null,"Spalten ok",{"$f":"(L83>=D83)","v":true},"Entsperrt",false,1,{"$f":"AP3*AQ3","v":0},"Entsperrt"]
[null,{"$f":"IF(VSATestModus=TRUE(),\"VSA-Modus!\",\"\")","v":""},{"$f":"IF(AN52>0,\"DEFEKT\",\"\")","v":""},{"$f":"IF(MONTH(DATE($C$1,MONTH($B$1),D$41))>MONTH($B$1),\"\",D41)","v":1},2,3,4,5,6,7,8,9,10,11,12,13,14,15,16,17,18,19,20,21,22,23,24,25,26,27,28,{"$f":"IF(MONTH(DATE($C$1,MONTH($B$1),AF$41))>MONTH($B$1),\"\",AF41)","v":29},{"$f":"IF(MONTH(DATE($C$1,MONTH($B$1),AG$41))>MONTH($B$1),\"\",AG41)","v":30},{"$f":"IF(MONTH(DATE($C$1,MONTH($B$1),AH$41))>MONTH($B$1),\"\",AH41)","v":31},null,null,null,null,"Keine Fehler",{"$f":"(SUM(D87:AH87)=0)","v":true},"Geändert",false,2,{"$f":"AP4*AQ4","v":0},"Geändert"]
[null,"     Ein   >>>",null,null,null,null,null,null,null,null,null,null,null,null,null,null,null,null,null,null,null,null,null,null,null,null,null,null,null,null,null,null,null,null,null,null,null,null,"Keine Hand",{"$f":"(AI12=\"\")","v":true},"Sperre",{"$f":"AS11=2","v":false},3,{"$f":"NOT(AP6)*AQ5","v":3},"Eingaben vornehmen"]
[null,"<<<   Aus     ",null,null,null,null,null,null,null,null,null,null,null,null,null,null,null,null,null,null,null,null,null,null,null,null,null,null,null,null,null,null,null,null,null,null,null,null,null,null,"Abschliessbar 1",{"$f":"AND(OR(AN2,AN3),AN4,AN5,NOT(AP7),NOT(AP2))","v":false},4,{"$f":"AND(NOT(OR(AP3,AP4)),AP6)*AQ6","v":0},"Abschliessbar 1"]
[null,"     Ein   >>>",null,null,null,null,null,null,null,null,null,null,null,null,null,null,null,null,null,null,null,null,null,null,null,null,null,null,null,null,null,null,null,null,null,null,null,null,null,null,"Abgeschlossen",false,5,{"$f":"AND(NOT(OR(AP3,AP4)),AP7)*AQ7","v":0},"Abgeschlossen"]
[null,"<<<   Aus     ",null,null,null,null,null,null,null,null,null,null,null,null,null,null,null,null,null,null,null,null,null,null,null,null,null,null,null,null,null,null,null,null,null,null,null,null,null,null,"Für Jahr OK",{"$f":"AND(OR(AP2,AP7),NOT(AP3))","v":true}]
[null,"     Ein   >>>"]
[null,"<<<   Aus     ",null,null,null,null,null,null,null,null,null,null,null,null,null,null,null,null,null,null,null,null,null,null,null,null,null,null,null,null,null,null,null,null,null,null,null,null,null,null,"Statusnummer:",{"$f":"IF(AR2=AQ2,AQ2,MAX(AR2:AR7))","v":-1}]
[null,"     Ein   >>>",null,null,null,null,null,null,null,null,null,null,null,null,null,null,null,null,null,null,null,null,null,null,null,null,null,null,null,null,null,null,null,null,null,null,null,null,"HatDaten:",{"$f":"AND(AP2=FALSE,OR(AP10<>3,COUNTA(D5:AH12,D20:AH35,D39:L40)>0))","v":false},"Statustext:",{"$f":"IFERROR(VLOOKUP(AP10,AR2:AS7,2,FALSE),\"unbekannt\")","v":"Nicht Relevant"},null,null,1]
[null,"<<<   Aus     ",null,null,null,null,null,null,null,null,null,null,null,null,null,null,null,null,null,null,null,null,null,null,null,null,null,null,null,null,null,null,null,null,{"$f":"IF(COUNTIF(D37:AH37,\"I\")>0,\"I\",\"\")","v":""}]
[null,{"$f":"B_PrZeit","v":"Präsenzzeit"},null,{"$f":"24*(D6-D5+D8-D7+D10-D9+D12-D11)*D88","v":0},{"$f":"24*(E6-E5+E8-E7+E10-E9+E12-E11)*E88","v":0},0,0,0,0,0,0,0,0,0,0,0,0,0,0,0,0,0,0,0,0,0,0,0,0,0,0,0,0,0,null,null,null,null,"Anzahl Regeltage:",{"$f":"D83","v":0}]
[null,{"$f":"B_TotalAZist","v":"Total Arbeitszeit (IST)"},null,{"$f":"IF(D13+D35>=D15,D13+D35,MIN(D13+D35+SUM(D20,D22,D23,D24,D25,D26,D27,D28,D29,D30,D31,D32,D33,D34),IF(D15<0,0,D15)))*D82","v":0},0,0,0,0,0,0,0,0,0,0,0,0,0,{"$f":"IF(R13+R35>=R15,R13+R35,MIN(R13+R35+SUM(R20,R22,R23,R24,R25,R26,R27,R28,R29,R30,R31,R32,R33,R34),IF(R15<0,0,R15)))*R82","v":0},{"$f":"IF(S13+S35>=S15,S13+S35,MIN(S13+S35+SUM(S20,S22,S23,S24,S25,S26,S27,S28,S29,S30,S31,S32,S33,S34),IF(S15<0,0,S15)))*S82","v":0},{"$f":"IF(T13+T35>=T15,T13+T35,MIN(T13+T35+SUM(T20,T22,T23,T24,T25,T26,T27,T28,T29,T30,T31,T32,T33,T34),IF(T15<0,0,T15)))*T82","v":0},{"$f":"IF(U13+U35>=U15,U13+U35,MIN(U13+U35+SUM(U20,U22,U23,U24,U25,U26,U27,U28,U29,U30,U31,U32,U33,U34),IF(U15<0,0,U15)))*U82","v":0},0,0,0,0,0,0,0,0,0,0,0,0,0,{"$f":"SUMIF($D$82:$AH$82,1,D14:AH14)","v":0},{"$f":"AI14-AI15","v":0},null,null,"Erfasste Regeltage",{"$f":"L83","v":0},{"$f":"AN13-AN14","v":0},"Fehlende Regeltage"]
[null,{"$f":"B_NettoSollAZ","v":"Netto-SOLL-Arbeitszeit"},null,{"$f":"ROUND(D16-D19,2)","v":0},{"$f":"ROUND(E16-E19,2)","v":0},0,0,0,0,0,0,0,0,0,0,0,0,0,0,0,0,0,0,0,0,0,0,0,0,0,0,{"$f":"IF(AF$42=4,0,ROUND(AF16-AF19,2))","v":0},{"$f":"IF(AG$42=4,0,ROUND(AG16-AG19,2))","v":0},0,{"$f":"SUMIF($D$82:$AH$82,1,D15:AH15)","v":0},null,null,null,"Minimum Regeltage",{"$f":"MinRegeltage","v":1},"Ist als Konstante im Blatt \"Intern\" hinterlegt"]
[null,{"$f":"B_BruttoSollAZ","v":"Brutto-SOLL-Arb.zeit"},null,{"$f":"VLOOKUP(D3,VSA_Kalender,16)","v":0},0,0,0,0,0,0,0,0,0,0,0,0,0,0,0,0,0,0,0,0,0,0,0,0,0,0,0,{"$f":"IF(AF$42=4,0,VLOOKUP(AF3,VSA_Kalender,16))","v":0},{"$f":"IF(AG$42=4,0,VLOOKUP(AG3,VSA_Kalender,16))","v":0},{"$f":"IF(AH$42=4,0,VLOOKUP(AH3,VSA_Kalender,16))","v":0},null,null,null,null,"Regel ok","Mind. eigetr. Regeltage erfüllt"]
[null,{"$f":"B_MehrMinder","v":"Mehr-/Minderleistung"},null,{"$f":"(SL_BisDatum>=D3)*ROUND(D14-D15,2)","v":0},0,0,0,0,0,0,0,0,0,0,0,0,0,0,0,0,0,0,0,0,0,0,0,0,0,0,0,0,0,0,{"$f":"B_Total","v":"Total"},{"$f":"B_Vortrag","v":"Vortrag"},null,null,"Spalten ok:","Alle Einträge an Regeltagen ok"]
[null,{"$f":"B_AZSaldo","v":"AZ - Saldo"},{"$f":"VLOOKUP(ROW(),VSA_Uebertrag,$A$1+3)","v":16.8},{"$f":"IFERROR((C18+D17)*(D3<=SL_BisDatum)*VLOOKUP(D3,VSA_Kalender,21,FALSE),0)","v":0},0,0,{"$f":"IFERROR((F18+G17)*(G3<=SL_BisDatum)*VLOOKUP(G3,VSA_Kalender,21,FALSE),0)","v":0},0,0,0,0,0,0,0,0,0,0,0,0,0,0,0,0,0,0,0,0,0,0,0,0,0,0,0,null,{"$f":"SUMIF($D$82:$AH$82,1,D17:AH17)+C18","v":16.8}]
[null,{"$f":"B_FTA","v":"Feiertagsanspruch"},0,{"$f":"VLOOKUP(D3,VSA_Kalender,14)","v":0},0,0,0,0,0,0,0,0,0,0,0,0,0,0,0,0,0,0,0,0,0,0,0,0,0,0,0,{"$f":"IF(AF$42=4,0,VLOOKUP(AF3,VSA_Kalender,14))","v":0},{"$f":"IF(AG$42=4,0,VLOOKUP(AG3,VSA_Kalender,14))","v":0},{"$f":"IF(AH$42=4,0,VLOOKUP(AH3,VSA_Kalender,14))","v":0},{"$f":"SUM(D19:AH19)","v":0}]
[null,{"$f":"B_Ferien","v":"Ferien"},{"$f":"VLOOKUP(ROW(),VSA_Uebertrag,$A$1+3)","v":0},null,null,null,null,null,null,null,null,null,null,null,null,null,null,null,null,null,null,null,null,null,null,null,null,null,null,null,null,null,null,null,{"$f":"SUMIF($D$82:$AH$82,1,D20:AH20)","v":0},{"$f":"ROUND(C20-AI20,2)","v":0},"Rest"]
[null,{"$f":"B_KompAZ","v":"Kompensation Arbeitstage"},0,null,null,null,null,null,null,null,null,null,null,null,null,null,null,null,null,null,null,null,null,null,null,null,null,null,null,null,null,null,null,null,0,{"$f":"ROUND(A21+C21-AI21,0)","v":0}]
[null,{"$f":"B_Arzt","v":"Arztbesuch"},0,null,null,null,null,null,null,null,null,null,null,null,null,null,null,null,null,null,null,null,null,null,null,null,null,null,null,null,null,null,null,null,0,{"$f":"ROUND(A22+C22+AI22,2)","v":0},"Summen"]
[null,{"$f":"B_Krank","v":"Krankheit"},0,null,null,null,null,null,null,null,null,null,null,null,null,null,null,null,null,null,null,null,null,null,null,null,null,null,null,null,null,null,null,null,0,{"$f":"ROUND(A23+C23+AI23,2)","v":0}]
[null,{"$f":"B_BU","v":"Berufsunfall"},0,null,null,null,null,null,null,null,null,null,null,null,null,null,null,null,null,null,null,null,null,null,null,null,null,null,null,null,null,null,null,null,0,{"$f":"ROUND(A24+C24+AI24,2)","v":0}]
[null,{"$f":"B_NBU","v":"Nichtberufsunfall"},0,null,null,null,null,null,null,null,null,null,null,null,null,null,null,null,null,null,null,null,null,null,null,null,null,null,null,null,null,null,null,null,0,{"$f":"ROUND(A25+C25+AI25,2)","v":0}]
[null,{"$f":"B_MilZiv","v":"Militär / Zivilschutz"},0,null,null,null,null,null,null,null,null,null,null,null,null,null,null,null,null,null,null,null,null,null,null,null,null,null,null,null,null,null,null,null,0,{"$f":"ROUND(A26+C26+AI26,2)","v":0}]
[null,{"$f":"B_UUB","v":"Unbezahlter Urlaub"},0,null,null,null,null,null,null,null,null,null,null,null,null,null,null,null,null,null,null,null,null,null,null,null,null,null,null,null,null,null,null,null,0,{"$f":"ROUND(A27+C27-AI27,2)","v":0},"Rest"]
[null,{"$f":"B_UB","v":"Bezahlter Urlaub"},0,null,null,null,null,null,null,null,null,null,null,null,null,null,null,null,null,null,null,null,null,null,null,null,null,null,null,null,null,null,null,null,0,{"$f":"ROUND(A28+C28-AI28,2)","v":0}]
[null,{"$f":"B_NebenB","v":"Nebenbeschäftigung"},0,null,null,null,null,null,null,null,null,null,null,null,null,null,null,null,null,null,null,null,null,null,null,null,null,null,null,null,null,null,null,null,0,{"$f":"ROUND(A29+C29-AI29,2)","v":0}]
[null,{"$f":"B_DAG","v":"D A G"},0,null,null,null,null,null,null,null,null,null,null,null,null,null,null,null,null,null,null,null,null,null,null,null,null,null,null,null,null,null,null,null,0,{"$f":"ROUND(A30+C30-AI30,2)","v":0}]
[null,{"$f":"B_Divers","v":"Diverses"},0,null,null,null,null,null,null,null,null,null,null,null,null,null,null,null,null,null,null,null,null,null,null,null,null,null,null,null,null,null,null,null,0,{"$f":"ROUND(A31+C31+AI31,2)","v":0},"Summen"]
[null,{"$f":"B_FamPersErg","v":"Fam./pers. Ereignisse"},0,null,null,null,null,null,null,null,null,null,null,null,null,null,null,null,null,null,null,null,null,null,null,null,null,null,null,null,null,null,null,null,0,{"$f":"ROUND(A32+C32+AI32,2)","v":0}]
[null,{"$f":"B_FZ1","v":"freie Zeile 1"},0,null,null,null,null,null,null,null,null,null,null,null,null,null,null,null,null,null,null,null,null,null,null,null,null,null,null,null,null,null,null,null,0,{"$f":"ROUND(A33+C33+AI33,2)","v":0}]
[null,{"$f":"B_FZ2","v":"freie Zeile 2"},0,null,null,null,null,null,null,null,null,null,null,null,null,null,null,null,null,null,null,null,null,null,null,null,null,null,null,null,null,null,null,null,0,{"$f":"ROUND(A34+C34+AI34,2)","v":0}]
[null,{"$f":"B_WB","v":"Weiterbildung"},0,null,null,null,null,null,null,null,null,null,null,null,null,null,null,null,null,null,null,null,null,null,null,null,null,null,null,null,null,null,null,null,0,{"$f":"ROUND(A35+C35+AI35,2)","v":0}]
[null,{"$f":"B_FEL","v":"frei einsetzbare Lekt."},0,null,null,null,null,null,null,null,null,null,null,null,null,null,null,null,null,null,null,null,null,null,null,null,null,null,null,null,null,null,null,null,{"$f":"SUM(D36:AH36)","v":0},{"$f":"ROUND(C36-AI36,0)","v":0}]
[null,null,null,{"$f":"IF(AND((D13 - D15)+SUM(D20,D22:D34)>0.00001,SUM(D20,D22:D34)>0),\"I\",\"\")","v":""},"","","","","","","","","","","","","","","","","","","","","","","","","","","","","",""]
[null,null,"Visum","Identität:",null,null,null,null,"Datum:",null,"Status:"]
[null,null,"SL"]
[null,null,"VG"]
[null,null,null,1,2,3,4,5,6,7,8,9,10,11,12,13,14,15,16,17,18,19,20,21,22,23,24,25,26,27,28,29,30,31]
[null,null,null,{"$f":"IF(D3=\"\",4,VLOOKUP(D3,VSA_Kalender,18))","v":0},0,0,0,1,1,0,0,0,0,0,1,1,0,0,0,0,0,1,1,0,0,0,0,0,1,1,0,0,0,0]
[]
[null,null,null,{"$f":"IF(D19>0,VLOOKUP(D3,KalFeiertage,6,FALSE),\"\")","v":""},"","","","","","","","","","","","","","","","","","","","","","","","","","","","","",""]
[null,null,null,"FT=WENN(D13+D35>=D15;D13+D35;MIN(D13+D35+SUMME(D20;D22;D23;D24;D25;D26;D27;D28;D29;D30;D31;D32;D33;D34);WENN(D15<0;0;D15)))*D82","FT=WENN(E13+E35>=E15;E13+E35;MIN(E13+E35+SUMME(E20;E22;E23;E24;E25;E26;E27;E28;E29;E30;E31;E32;E33;E34);WENN(E15<0;0;E15)))*E82","FT=WENN(F13+F35>=F15;F13+F35;MIN(F13+F35+SUMME(F20;F22;F23;F24;F25;F26;F27;F28;F29;F30;F31;F32;F33;F34);WENN(F15<0;0;F15)))*F82","FT=WENN(G13+G35>=G15;G13+G35;MIN(G13+G35+SUMME(G20;G22;G23;G24;G25;G26;G27;G28;G29;G30;G31;G32;G33;G34);WENN(G15<0;0;G15)))*G82","FT=WENN(H13+H35>=H15;H13+H35;MIN(H13+H35+SUMME(H20;H22;H23;H24;H25;H26;H27;H28;H29;H30;H31;H32;H33;H34);WENN(H15<0;0;H15)))*H82","FT=WENN(I13+I35>=I15;I13+I35;MIN(I13+I35+SUMME(I20;I22;I23;I24;I25;I26;I27;I28;I29;I30;I31;I32;I33;I34);WENN(I15<0;0;I15)))*I82","FT=WENN(J13+J35>=J15;J13+J35;MIN(J13+J35+SUMME(J20;J22;J23;J24;J25;J26;J27;J28;J29;J30;J31;J32;J33;J34);WENN(J15<0;0;J15)))*J82","FT=WENN(K13+K35>=K15;K13+K35;MIN(K13+K35+SUMME(K20;K22;K23;K24;K25;K26;K27;K28;K29;K30;K31;K32;K33;K34);WENN(K15<0;0;K15)))*K82","FT=WENN(L13+L35>=L15;L13+L35;MIN(L13+L35+SUMME(L20;L22;L23;L24;L25;L26;L27;L28;L29;L30;L31;L32;L33;L34);WENN(L15<0;0;L15)))*L82","FT=WENN(M13+M35>=M15;M13+M35;MIN(M13+M35+SUMME(M20;M22;M23;M24;M25;M26;M27;M28;M29;M30;M31;M32;M33;M34);WENN(M15<0;0;M15)))*M82","FT=WENN(N13+N35>=N15;N13+N35;MIN(N13+N35+SUMME(N20;N22;N23;N24;N25;N26;N27;N28;N29;N30;N31;N32;N33;N34);WENN(N15<0;0;N15)))*N82","FT=WENN(O13+O35>=O15;O13+O35;MIN(O13+O35+SUMME(O20;O22;O23;O24;O25;O26;O27;O28;O29;O30;O31;O32;O33;O34);WENN(O15<0;0;O15)))*O82","FT=WENN(P13+P35>=P15;P13+P35;MIN(P13+P35+SUMME(P20;P22;P23;P24;P25;P26;P27;P28;P29;P30;P31;P32;P33;P34);WENN(P15<0;0;P15)))*P82","FT=WENN(Q13+Q35>=Q15;Q13+Q35;MIN(Q13+Q35+SUMME(Q20;Q22;Q23;Q24;Q25;Q26;Q27;Q28;Q29;Q30;Q31;Q32;Q33;Q34);WENN(Q15<0;0;Q15)))*Q82","FT=WENN(R13+R35>=R15;R13+R35;MIN(R13+R35+SUMME(R20;R22;R23;R24;R25;R26;R27;R28;R29;R30;R31;R32;R33;R34);WENN(R15<0;0;R15)))*R82","FT=WENN(S13+S35>=S15;S13+S35;MIN(S13+S35+SUMME(S20;S22;S23;S24;S25;S26;S27;S28;S29;S30;S31;S32;S33;S34);WENN(S15<0;0;S15)))*S82","FT=WENN(T13+T35>=T15;T13+T35;MIN(T13+T35+SUMME(T20;T22;T23;T24;T25;T26;T27;T28;T29;T30;T31;T32;T33;T34);WENN(T15<0;0;T15)))*T82","FT=WENN(U13+U35>=U15;U13+U35;MIN(U13+U35+SUMME(U20;U22;U23;U24;U25;U26;U27;U28;U29;U30;U31;U32;U33;U34);WENN(U15<0;0;U15)))*U82","FT=WENN(V13+V35>=V15;V13+V35;MIN(V13+V35+SUMME(V20;V22;V23;V24;V25;V26;V27;V28;V29;V30;V31;V32;V33;V34);WENN(V15<0;0;V15)))*V82","FT=WENN(W13+W35>=W15;W13+W35;MIN(W13+W35+SUMME(W20;W22;W23;W24;W25;W26;W27;W28;W29;W30;W31;W32;W33;W34);WENN(W15<0;0;W15)))*W82","FT=WENN(X13+X35>=X15;X13+X35;MIN(X13+X35+SUMME(X20;X22;X23;X24;X25;X26;X27;X28;X29;X30;X31;X32;X33;X34);WENN(X15<0;0;X15)))*X82","FT=WENN(Y13+Y35>=Y15;Y13+Y35;MIN(Y13+Y35+SUMME(Y20;Y22;Y23;Y24;Y25;Y26;Y27;Y28;Y29;Y30;Y31;Y32;Y33;Y34);WENN(Y15<0;0;Y15)))*Y82","FT=WENN(Z13+Z35>=Z15;Z13+Z35;MIN(Z13+Z35+SUMME(Z20;Z22;Z23;Z24;Z25;Z26;Z27;Z28;Z29;Z30;Z31;Z32;Z33;Z34);WENN(Z15<0;0;Z15)))*Z82","FT=WENN(AA13+AA35>=AA15;AA13+AA35;MIN(AA13+AA35+SUMME(AA20;AA22;AA23;AA24;AA25;AA26;AA27;AA28;AA29;AA30;AA31;AA32;AA33;AA34);WENN(AA15<0;0;AA15)))*AA82","FT=WENN(AB13+AB35>=AB15;AB13+AB35;MIN(AB13+AB35+SUMME(AB20;AB22;AB23;AB24;AB25;AB26;AB27;AB28;AB29;AB30;AB31;AB32;AB33;AB34);WENN(AB15<0;0;AB15)))*AB82","FT=WENN(AC13+AC35>=AC15;AC13+AC35;MIN(AC13+AC35+SUMME(AC20;AC22;AC23;AC24;AC25;AC26;AC27;AC28;AC29;AC30;AC31;AC32;AC33;AC34);WENN(AC15<0;0;AC15)))*AC82","FT=WENN(AD13+AD35>=AD15;AD13+AD35;MIN(AD13+AD35+SUMME(AD20;AD22;AD23;AD24;AD25;AD26;AD27;AD28;AD29;AD30;AD31;AD32;AD33;AD34);WENN(AD15<0;0;AD15)))*AD82","FT=WENN(AE13+AE35>=AE15;AE13+AE35;MIN(AE13+AE35+SUMME(AE20;AE22;AE23;AE24;AE25;AE26;AE27;AE28;AE29;AE30;AE31;AE32;AE33;AE34);WENN(AE15<0;0;AE15)))*AE82","FT=WENN(AF13+AF35>=AF15;AF13+AF35;MIN(AF13+AF35+SUMME(AF20;AF22;AF23;AF24;AF25;AF26;AF27;AF28;AF29;AF30;AF31;AF32;AF33;AF34);WENN(AF15<0;0;AF15)))*AF82","FT=WENN(AG13+AG35>=AG15;AG13+AG35;MIN(AG13+AG35+SUMME(AG20;AG22;AG23;AG24;AG25;AG26;AG27;AG28;AG29;AG30;AG31;AG32;AG33;AG34);WENN(AG15<0;0;AG15)))*AG82","FT=WENN(AH13+AH35>=AH15;AH13+AH35;MIN(AH13+AH35+SUMME(AH20;AH22;AH23;AH24;AH25;AH26;AH27;AH28;AH29;AH30;AH31;AH32;AH33;AH34);WENN(AH15<0;0;AH15)))*AH82"]
[null,null,null,"FT=24*(D6-D5+D8-D7+D10-D9+D12-D11)*D88","FT=24*(E6-E5+E8-E7+E10-E9+E12-E11)*E88","FT=24*(F6-F5+F8-F7+F10-F9+F12-F11)*F88","FT=24*(G6-G5+G8-G7+G10-G9+G12-G11)*G88","FT=24*(H6-H5+H8-H7+H10-H9+H12-H11)*H88","FT=24*(I6-I5+I8-I7+I10-I9+I12-I11)*I88","FT=24*(J6-J5+J8-J7+J10-J9+J12-J11)*J88","FT=24*(K6-K5+K8-K7+K10-K9+K12-K11)*K88","FT=24*(L6-L5+L8-L7+L10-L9+L12-L11)*L88","FT=24*(M6-M5+M8-M7+M10-M9+M12-M11)*M88","FT=24*(N6-N5+N8-N7+N10-N9+N12-N11)*N88","FT=24*(O6-O5+O8-O7+O10-O9+O12-O11)*O88","FT=24*(P6-P5+P8-P7+P10-P9+P12-P11)*P88","FT=24*(Q6-Q5+Q8-Q7+Q10-Q9+Q12-Q11)*Q88","FT=24*(R6-R5+R8-R7+R10-R9+R12-R11)*R88","FT=24*(S6-S5+S8-S7+S10-S9+S12-S11)*S88","FT=24*(T6-T5+T8-T7+T10-T9+T12-T11)*T88","FT=24*(U6-U5+U8-U7+U10-U9+U12-U11)*U88","FT=24*(V6-V5+V8-V7+V10-V9+V12-V11)*V88","FT=24*(W6-W5+W8-W7+W10-W9+W12-W11)*W88","FT=24*(X6-X5+X8-X7+X10-X9+X12-X11)*X88","FT=24*(Y6-Y5+Y8-Y7+Y10-Y9+Y12-Y11)*Y88","FT=24*(Z6-Z5+Z8-Z7+Z10-Z9+Z12-Z11)*Z88","FT=24*(AA6-AA5+AA8-AA7+AA10-AA9+AA12-AA11)*AA88","FT=24*(AB6-AB5+AB8-AB7+AB10-AB9+AB12-AB11)*AB88","FT=24*(AC6-AC5+AC8-AC7+AC10-AC9+AC12-AC11)*AC88","FT=24*(AD6-AD5+AD8-AD7+AD10-AD9+AD12-AD11)*AD88","FT=24*(AE6-AE5+AE8-AE7+AE10-AE9+AE12-AE11)*AE88","FT=24*(AF6-AF5+AF8-AF7+AF10-AF9+AF12-AF11)*AF88","FT=24*(AG6-AG5+AG8-AG7+AG10-AG9+AG12-AG11)*AG88","FT=24*(AH6-AH5+AH8-AH7+AH10-AH9+AH12-AH11)*AH88"]
[null,null,null,"FT=ODER(D14>0;D21>0)*1","FT=ODER(E14>0;E21>0)*1","FT=ODER(F14>0;F21>0)*1","FT=ODER(G14>0;G21>0)*1","FT=ODER(H14>0;H21>0)*1","FT=ODER(I14>0;I21>0)*1","FT=ODER(J14>0;J21>0)*1","FT=ODER(K14>0;K21>0)*1","FT=ODER(L14>0;L21>0)*1","FT=ODER(M14>0;M21>0)*1","FT=ODER(N14>0;N21>0)*1","FT=ODER(O14>0;O21>0)*1","FT=ODER(P14>0;P21>0)*1","FT=ODER(Q14>0;Q21>0)*1","FT=ODER(R14>0;R21>0)*1","FT=ODER(S14>0;S21>0)*1","FT=ODER(T14>0;T21>0)*1","FT=ODER(U14>0;U21>0)*1","FT=ODER(V14>0;V21>0)*1","FT=ODER(W14>0;W21>0)*1","FT=ODER(X14>0;X21>0)*1","FT=ODER(Y14>0;Y21>0)*1","FT=ODER(Z14>0;Z21>0)*1","FT=ODER(AA14>0;AA21>0)*1","FT=ODER(AB14>0;AB21>0)*1","FT=ODER(AC14>0;AC21>0)*1","FT=ODER(AD14>0;AD21>0)*1","FT=ODER(AE14>0;AE21>0)*1","FT=ODER(AF14>0;AF21>0)*1","FT=ODER(AG14>0;AG21>0)*1","FT=ODER(AH14>0;AH21>0)*1"]
[null,null,null,{"$f":"ABS(\"FT\"&_xlfn.FORMULATEXT(D14)<>D45)","v":0},{"$f":"ABS(\"FT\"&_xlfn.FORMULATEXT(E14)<>E45)","v":0},0,0,0,0,0,0,0,0,0,0,0,0,0,0,0,0,0,0,0,0,0,0,0,0,0,0,0,0,0]
[null,null,null,{"$f":"ABS(\"FT\"&_xlfn.FORMULATEXT(D13)<>D46)","v":0},{"$f":"ABS(\"FT\"&_xlfn.FORMULATEXT(E13)<>E46)","v":0},0,0,0,0,0,0,0,0,0,0,0,0,0,0,0,0,0,0,0,0,0,0,0,0,0,0,0,0,0]
[null,null,null,{"$f":"ABS(\"FT\"&_xlfn.FORMULATEXT(D80)<>D47)","v":0},{"$f":"ABS(\"FT\"&_xlfn.FORMULATEXT(E80)<>E47)","v":0},0,0,0,0,0,0,0,0,0,0,0,0,0,0,0,0,0,0,0,0,0,0,0,0,0,0,0,0,0]
[null,null,null,{"$f":"ABS(ISERROR(D37))","v":0},{"$f":"ABS(ISERROR(E37))","v":0},0,0,0,0,0,0,0,0,0,0,0,0,0,0,0,0,0,0,0,0,0,0,0,0,0,0,0,0,0]
[null,null,null,{"$f":"SUM(D48:D51)","v":0},{"$f":"SUM(E48:E51)","v":0},0,0,0,0,0,0,0,0,0,0,0,0,0,0,0,0,0,0,0,0,0,0,0,0,0,0,0,0,0,null,null,null,null,"Formel defekt",{"$f":"SUM(D52:AH52)","v":0}]
[]
[]
[]
[]
[]
[]
[]
[]
[]
[]
[]
[]
[]
[]
[]
[]
[]
[]
[]
[]
[]
[]
[]
[]
[null,"HT_Naz-Kopie",{"$f":"HT_NAZ","v":8.4}]
[null,"Heute:",{"$f":"SL_BisDatum","v":"2024-02-02"}]
[null,null,"Reguläre Tage ausgefüllt",{"$f":"((D80*D81)=1)*1","v":0},{"$f":"((E80*E81)=1)*1","v":0},0,0,0,0,0,0,0,0,0,0,0,0,0,0,0,0,0,0,0,0,0,0,0,0,0,0,0,0,0]
[null,null,"Arbeitstage ausgefüllt",{"$f":"OR(D14>0,D21>0)*1","v":0},{"$f":"OR(E14>0,E21>0)*1","v":0},0,0,0,0,0,0,0,0,0,0,0,0,0,0,0,0,0,0,0,0,0,0,0,0,0,0,0,0,0]
[null,null,"Arbeitstage wenn BG>0%",{"$f":"IFERROR(VLOOKUP(D3,VSA_Kalender,22),0)","v":0},0,0,0,0,0,0,0,0,0,0,0,0,0,0,0,0,0,0,0,0,0,0,0,0,0,0,0,0,0,0]
[null,null,"Der BG beträgt mehr als 0%",{"$f":"IF(D4=\"\",0,ABS(VLOOKUP(D3,VSA_Kalender,13,FALSE)>0))","v":1},1,1,1,1,1,1,1,1,1,1,1,1,1,1,1,1,1,1,1,1,1,1,1,1,1,1,1,1,1,1]
[null,null,"(Ja: 1, Nein: 0)",{"$f":"SUM(D81:AH81)","v":0},"Total Tage bei BG>0%",null,null,{"$f":"SUM(D80:AH80)","v":0},"Total Tage ausgefüllt",null,null,{"$f":"SUM(D79:AH79)","v":0},"Total reguläre Tage ausgefüllt"]
[]
[null,null,"Tag des Monats",{"$f":"D4","v":1},2,3,4,5,6,7,8,9,10,11,12,13,14,15,16,17,18,19,20,21,22,23,24,25,26,27,28,29,30,31]
[null,null,"Ist Arbeitsbereich",{"$f":"IFERROR(ABS(WEEKDAY(D3,2)<6),0)","v":1},1,1,1,0,0,1,1,1,1,1,0,0,1,1,1,1,1,0,0,1,1,1,1,1,0,0,1,1,1,1]
[null,null,"Maximaler Fehler",{"$f":"MAX(D100:D107,D98,D134)","v":0},{"$f":"MAX(E100:E107,E98,E134)","v":0},0,0,0,0,0,0,0,0,0,0,0,0,0,0,0,0,0,0,0,0,0,0,0,0,0,0,0,0,0]
[null,null,"Wird die Präsenzzeit angezeigt?",{"$f":"IF(D87=0,1,0)","v":1},{"$f":"IF(E87=0,1,0)","v":1},1,1,1,1,1,1,1,1,1,1,1,1,1,1,1,1,1,1,1,1,1,1,1,1,1,1,1,1,1]
[]
[null,null,"Gruppenfehler 1",{"$f":"IF(AND(D6-D5=0,COUNTA(D7:D12)>0),1,0)","v":0},0,0,0,0,0,0,0,0,0,0,0,0,0,0,0,0,0,0,0,0,0,0,0,0,0,0,0,0,0,0]
[null,"Gruppenfehler","(aus)",{"$f":"D90","v":0},0,0,0,0,0,0,0,0,0,0,0,0,0,0,0,0,0,0,0,0,0,0,0,0,0,0,0,0,0,0]
[null,null,"Gruppenfehler 2",{"$f":"IF(AND(D8-D7=0,COUNTA(D9:D12)>0),1,0)","v":0},0,0,0,0,0,0,0,0,0,0,0,0,0,0,0,0,0,0,0,0,0,0,0,0,0,0,0,0,0,0]
[null,null,"(aus)",{"$f":"D92","v":0},0,0,0,0,0,0,0,0,0,0,0,0,0,0,0,0,0,0,0,0,0,0,0,0,0,0,0,0,0,0]
[null,null,"Gruppenfehler 3",{"$f":"IF(AND(D10-D9=0,COUNTA(D11:D12)>0),1,0)","v":0},0,0,0,0,0,0,0,0,0,0,0,0,0,0,0,0,0,0,0,0,0,0,0,0,0,0,0,0,0,0]
[null,null,"(aus)",{"$f":"D94","v":0},0,0,0,0,0,0,0,0,0,0,0,0,0,0,0,0,0,0,0,0,0,0,0,0,0,0,0,0,0,0]
[null,null,"leer"]
[null,null,"leer"]
[null,null,"Genereller Gruppenfehler",{"$f":"MAX(D90:D95)","v":0},0,0,0,0,0,0,0,0,0,0,0,0,0,0,0,0,0,0,0,0,0,0,0,0,0,0,0,0,0,0]
[]
[null,null,"Ein1",{"$f":"IF(AND(D109=0,D110>0),1,0)","v":0},{"$f":"IF(AND(E109=0,E110>0),1,0)","v":0},0,0,0,0,0,0,0,0,0,0,0,0,0,0,0,0,0,0,0,0,0,0,0,0,0,0,0,0,0]
[null,null,"Aus1",{"$f":"IF(AND(D110>0,D110<D109),3,IF(AND(D109>0,D110=0),1,0))*D$86","v":0},{"$f":"IF(AND(E110>0,E110<E109),3,IF(AND(E109>0,E110=0),1,0))*E$86","v":0},0,0,0,0,0,0,0,0,0,0,0,0,0,0,0,0,0,0,0,0,0,0,0,0,0,0,0,0,0]
[null,null,"Ein2",{"$f":"IF(AND(D111>0,D111<D110),3,IF(AND(D111=0,D112>0),1,0))*D$86","v":0},0,0,0,0,0,0,0,0,0,0,0,0,0,0,0,0,0,0,0,0,0,0,0,0,0,0,0,0,0,0]
[null,null,"Aus2",{"$f":"IF(AND(D112>0,D112<D111),3,IF(AND(D111>0,D112=0),1,0))*D$86","v":0},{"$f":"IF(AND(E112>0,E112<E111),3,IF(AND(E111>0,E112=0),1,0))*E$86","v":0},0,0,0,0,0,0,0,0,0,0,0,0,0,0,0,0,0,0,0,0,0,0,0,0,0,0,0,0,0]
[null,"Zellenfehler","Ein3",{"$f":"IF(AND(D113>0,D113<D112),3,IF(AND(D113=0,D114>0),1,0))*D$86","v":0},{"$f":"IF(AND(E113>0,E113<E112),3,IF(AND(E113=0,E114>0),1,0))*E$86","v":0},0,0,0,0,0,0,0,0,0,0,0,0,0,0,0,0,0,0,0,0,0,0,0,0,0,0,0,0,0]
[null,null,"Aus3",{"$f":"IF(AND(D114>0,D114<D113),3,IF(AND(D113>0,D114=0),1,0))*D$86","v":0},{"$f":"IF(AND(E114>0,E114<E113),3,IF(AND(E113>0,E114=0),1,0))*E$86","v":0},0,0,0,0,0,0,0,0,0,0,0,0,0,0,0,0,0,0,0,0,0,0,0,0,0,0,0,0,0]
[null,null,"Ein4",{"$f":"IF(AND(D115>0,D115<D114),3,IF(AND(D115=0,D116>0),1,0))*D$86","v":0},{"$f":"IF(AND(E115>0,E115<E114),3,IF(AND(E115=0,E116>0),1,0))*E$86","v":0},0,0,0,0,0,0,0,0,0,0,0,0,0,0,0,0,0,0,0,0,0,0,0,0,0,0,0,0,0]
[null,null,"Aus4",{"$f":"IF(AND(D116>0,D116<D115),3,IF(AND(D115>0,D116=0),1,0))*D$86","v":0},{"$f":"IF(AND(E116>0,E116<E115),3,IF(AND(E115>0,E116=0),1,0))*E$86","v":0},0,0,0,0,0,0,0,0,0,0,0,0,0,0,0,0,0,0,0,0,0,0,0,0,0,0,0,0,0]
[]
[null,null,"Ein1",{"$f":"ROUND(D5*24,2)","v":0},0,0,0,0,0,0,0,0,0,0,0,0,0,0,0,0,0,0,0,0,0,0,0,0,0,0,0,0,0,0]
[null,null,"Aus1",0,0,0,0,0,0,0,0,0,0,0,0,0,0,0,0,0,0,0,0,0,0,0,0,0,0,0,0,0,0,0]
[null,"Zeiten dezimal gewandelt","Ein2",0,0,0,0,0,0,0,0,0,0,0,0,0,0,0,0,0,0,0,0,0,0,0,0,0,0,0,0,0,0,0]
[null,null,"Aus2",0,0,0,0,0,0,0,0,0,0,0,0,0,0,0,0,0,0,0,0,0,0,0,0,0,0,0,0,0,0,0]
[null,null,"Ein3",0,0,0,0,0,0,0,0,0,0,0,0,0,0,0,0,0,0,0,0,0,0,0,0,0,0,0,0,0,0,0]
[null,null,"Aus3",0,0,0,0,0,0,0,0,0,0,0,0,0,0,0,0,0,0,0,0,0,0,0,0,0,0,0,0,0,0,0]
[null,null,"Ein4",0,0,0,0,0,0,0,0,0,0,0,0,0,0,0,0,0,0,0,0,0,0,0,0,0,0,0,0,0,0,0]
[null,null,"Aus4",0,0,0,0,0,0,0,0,0,0,0,0,0,0,0,0,0,0,0,0,0,0,0,0,0,0,0,0,0,0,0]
[]
[null,"Pausenfehler","Gruppe1",{"$f":"IF(OR(D109=\"\",D110=\"\"),0,D110-D109)","v":0},{"$f":"IF(OR(E109=\"\",E110=\"\"),0,E110-E109)","v":0},0,0,0,0,0,0,0,0,0,0,0,0,0,0,0,{"$f":"IF(OR(U109=\"\",U110=\"\"),0,U110-U109)","v":0},{"$f":"IF(OR(V109=\"\",V110=\"\"),0,V110-V109)","v":0},0,0,0,0,0,0,0,0,0,0,0,0]
[null,null,"Gruppe2",{"$f":"IF(OR(D111=\"\",D112=\"\"),0,D112-D111)","v":0},{"$f":"IF(OR(E111=\"\",E112=\"\"),0,E112-E111)","v":0},0,0,0,0,0,0,0,0,0,0,0,0,0,0,0,{"$f":"IF(OR(U111=\"\",U112=\"\"),0,U112-U111)","v":0},{"$f":"IF(OR(V111=\"\",V112=\"\"),0,V112-V111)","v":0},0,0,0,0,0,0,0,0,0,0,0,0]
[null,null,"Gruppe3",{"$f":"IF(OR(D113=\"\",D114=\"\"),0,D114-D113)","v":0},{"$f":"IF(OR(E113=\"\",E114=\"\"),0,E114-E113)","v":0},0,0,0,0,0,0,0,0,0,0,0,0,0,0,0,{"$f":"IF(OR(U113=\"\",U114=\"\"),0,U114-U113)","v":0},{"$f":"IF(OR(V113=\"\",V114=\"\"),0,V114-V113)","v":0},0,0,0,0,0,0,0,0,0,0,0,0]
[null,null,"Gruppe4",{"$f":"IF(OR(D115=\"\",D116=\"\"),0,D116-D115)","v":0},{"$f":"IF(OR(E115=\"\",E116=\"\"),0,E116-E115)","v":0},0,0,0,0,0,0,0,0,0,0,0,0,0,0,0,{"$f":"IF(OR(U115=\"\",U116=\"\"),0,U116-U115)","v":0},{"$f":"IF(OR(V115=\"\",V116=\"\"),0,V116-V115)","v":0},0,0,0,0,0,0,0,0,0,0,0,0]
[]
[null,null,"Pause12",{"$f":"IF(OR(D110=\"\",D111=\"\"),0,D111-D110)","v":0},{"$f":"IF(OR(E110=\"\",E111=\"\"),0,E111-E110)","v":0},0,0,0,0,0,0,0,0,0,0,0,0,0,0,0,{"$f":"IF(OR(U110=\"\",U111=\"\"),0,U111-U110)","v":0},{"$f":"IF(OR(V110=\"\",V111=\"\"),0,V111-V110)","v":0},0,0,0,0,0,0,0,0,0,0,0,0]
[null,null,"Pause23",{"$f":"IF(OR(D112=\"\",D113=\"\"),0,D113-D112)","v":0},{"$f":"IF(OR(E112=\"\",E113=\"\"),0,E113-E112)","v":0},0,0,0,0,0,0,0,0,0,0,0,0,0,0,0,{"$f":"IF(OR(U112=\"\",U113=\"\"),0,U113-U112)","v":0},{"$f":"IF(OR(V112=\"\",V113=\"\"),0,V113-V112)","v":0},0,0,0,0,0,0,0,0,0,0,0,0]
[null,null,"Pause34",{"$f":"IF(OR(D114=\"\",D115=\"\"),0,D115-D114)","v":0},{"$f":"IF(OR(E114=\"\",E115=\"\"),0,E115-E114)","v":0},0,0,0,0,0,0,0,0,0,0,0,0,0,0,0,{"$f":"IF(OR(U114=\"\",U115=\"\"),0,U115-U114)","v":0},{"$f":"IF(OR(V114=\"\",V115=\"\"),0,V115-V114)","v":0},0,0,0,0,0,0,0,0,0,0,0,0]
[]
[null,null,"Kum12",{"$f":"IF(D123>=0.5,0,D118+D119)","v":0},{"$f":"IF(E123>=0.5,0,E118+E119)","v":0},0,0,0,0,0,0,0,0,0,0,0,0,0,0,0,{"$f":"IF(U123>=0.5,0,U118+U119)","v":0},{"$f":"IF(V123>=0.5,0,V118+V119)","v":0},0,0,0,0,0,0,0,0,0,0,0,0]
[null,null,"Kum123",{"$f":"IF(OR(D123>=0.5,D124>=0.5),0,D118+D119+D120)","v":0},{"$f":"IF(OR(E123>=0.5,E124>=0.5),0,E118+E119+E120)","v":0},0,0,0,0,0,0,0,0,0,0,0,0,0,0,0,{"$f":"IF(OR(U123>=0.5,U124>=0.5),0,U118+U119+U120)","v":0},{"$f":"IF(OR(V123>=0.5,V124>=0.5),0,V118+V119+V120)","v":0},0,0,0,0,0,0,0,0,0,0,0,0]
[null,null,"Kum1234",{"$f":"IF(OR(D123>=0.5,D124>=0.5,D125>=0.5),0,D118+D119+D120+D121)","v":0},{"$f":"IF(OR(E123>=0.5,E124>=0.5,E125>=0.5),0,E118+E119+E120+E121)","v":0},0,0,0,0,0,0,0,0,0,0,0,0,0,0,0,{"$f":"IF(OR(U123>=0.5,U124>=0.5,U125>=0.5),0,U118+U119+U120+U121)","v":0},{"$f":"IF(OR(V123>=0.5,V124>=0.5,V125>=0.5),0,V118+V119+V120+V121)","v":0},0,0,0,0,0,0,0,0,0,0,0,0]
[null,null,"Kum23",{"$f":"IF(D124>=0.5,0,D119+D120)","v":0},{"$f":"IF(E124>=0.5,0,E119+E120)","v":0},0,0,0,0,0,0,0,0,0,0,0,0,0,0,0,{"$f":"IF(U124>=0.5,0,U119+U120)","v":0},{"$f":"IF(V124>=0.5,0,V119+V120)","v":0},0,0,0,0,0,0,0,0,0,0,0,0]
[null,null,"Kum234",{"$f":"IF(OR(D124>=0.5,D125>=0.5),0,D119+D120+D121)","v":0},{"$f":"IF(OR(E124>=0.5,E125>=0.5),0,E119+E120+E121)","v":0},0,0,0,0,0,0,0,0,0,0,0,0,0,0,0,{"$f":"IF(OR(U124>=0.5,U125>=0.5),0,U119+U120+U121)","v":0},{"$f":"IF(OR(V124>=0.5,V125>=0.5),0,V119+V120+V121)","v":0},0,0,0,0,0,0,0,0,0,0,0,0]
[null,null,"Kum34",{"$f":"IF(D125>=0.5,0,D120+D121)","v":0},{"$f":"IF(E125>=0.5,0,E120+E121)","v":0},0,0,0,0,0,0,0,0,0,0,0,0,0,0,0,{"$f":"IF(U125>=0.5,0,U120+U121)","v":0},{"$f":"IF(V125>=0.5,0,V120+V121)","v":0},0,0,0,0,0,0,0,0,0,0,0,0]
[]
[null,null,"Pausenfehler-Code",{"$f":"IF(MAX(D118:D121,D127:D132)>6,2,0)","v":0},{"$f":"IF(MAX(E118:E121,E127:E132)>6,2,0)","v":0},0,0,0,0,0,0,0,0,0,0,0,0,0,0,0,0,0,0,0,0,0,0,0,0,0,0,0,0,0]

{"sheet":"November","index":16,"n_rows":134,"n_cols":68,"rows_kept":134,"cut":false,"hidden":true,"merged":[[11,34,12,35]]}
[11,{"$f":"DATEVALUE(\"1.\"&A1&\".\"&SL_Jahr)","v":"2024-11-01"},{"$f":"SL_Jahr","v":2024},{"$f":"B_Gde","v":"Gde:"},{"$f":"SL_Gemeinde","v":0},null,null,null,null,null,null,null,null,null,null,null,null,null,null,{"$f":"B_Schule","v":"Schule:"},{"$f":"SL_Schule","v":0},null,null,null,null,null,null,null,null,null,null,null,null,null,null,null,null,null,"Abschluss-Teilbedingungen:"]
[{"$f":"VLOOKUP(A1,Monatsenden,2)","v":45626},{"$f":"B_Bg","v":"BG:"},{"$f":"VLOOKUP(B1,VSA_Kalender,13)","v":1},{"$f":"B_Name","v":"Name:"},{"$f":"SL_Name","v":0},null,null,null,null,null,null,null,null,null,null,null,null,null,null,null,null,null,null,null,null,null,null,null,null,null,null,null,null,null,null,null,null,null,"Regel ok",{"$f":"(AN14>=AN15)","v":false},"Nicht Relevant",{"$f":"D83=0","v":true},-1,{"$f":"IF(AP2=TRUE,AQ2,0)","v":-1},"Nicht Relevant"]
[null,{"$f":"Zerf_Version & \" \" & Zerf_T","v":"Version VSA 1.06 "},null,{"$f":"DATE($C$1,MONTH($B$1),D$4)","v":"2024-11-01"},{"$f":"DATE($C$1,MONTH($B$1),E$4)","v":"2024-11-02"},"2024-11-03","2024-11-04","2024-11-05","2024-11-06","2024-11-07","2024-11-08","2024-11-09","2024-11-10","2024-11-11","2024-11-12","2024-11-13","2024-11-14","2024-11-15","2024-11-16","2024-11-17","2024-11-18","2024-11-19","2024-11-20","2024-11-21","2024-11-22","2024-11-23","2024-11-24","2024-11-25","2024-11-26","2024-11-27","2024-11-28",{"$f":"IF(MONTH(DATE($C$1,MONTH($B$1),AF$41))>MONTH($B$1),\"\",DATE($C$1,MONTH($B$1),AF$4))","v":"2024-11-29"},{"$f":"IF(MONTH(DATE($C$1,MONTH($B$1),AG$41))>MONTH($B$1),\"\",DATE($C$1,MONTH($B$1),AG$4))","v":"2024-11-30"},{"$f":"IF(MONTH(DATE($C$1,MONTH($B$1),AH$41))>MONTH($B$1),\"\",DATE($C$1,MONTH($B$1),AH$4))","v":""},null,null,null,null,"Spalten ok",{"$f":"(L83>=D83)","v":true},"Entsperrt",false,1,{"$f":"AP3*AQ3","v":0},"Entsperrt"]
[null,{"$f":"IF(VSATestModus=TRUE(),\"VSA-Modus!\",\"\")","v":""},{"$f":"IF(AN52>0,\"DEFEKT\",\"\")","v":""},{"$f":"IF(MONTH(DATE($C$1,MONTH($B$1),D$41))>MONTH($B$1),\"\",D41)","v":1},2,3,4,5,6,7,8,9,10,11,12,13,14,15,16,17,18,19,20,21,22,23,24,25,26,27,28,{"$f":"IF(MONTH(DATE($C$1,MONTH($B$1),AF$41))>MONTH($B$1),\"\",AF41)","v":29},{"$f":"IF(MONTH(DATE($C$1,MONTH($B$1),AG$41))>MONTH($B$1),\"\",AG41)","v":30},{"$f":"IF(MONTH(DATE($C$1,MONTH($B$1),AH$41))>MONTH($B$1),\"\",AH41)","v":""},null,null,null,null,"Keine Fehler",{"$f":"(SUM(D87:AH87)=0)","v":true},"Geändert",false,2,{"$f":"AP4*AQ4","v":0},"Geändert"]
[null,"     Ein   >>>",null,null,null,null,null,null,null,null,null,null,null,null,null,null,null,null,null,null,null,null,null,null,null,null,null,null,null,null,null,null,null,null,null,null,null,null,"Keine Hand",{"$f":"(AI12=\"\")","v":true},"Sperre",{"$f":"AS11=2","v":false},3,{"$f":"NOT(AP6)*AQ5","v":3},"Eingaben vornehmen"]
[null,"<<<   Aus     ",null,null,null,null,null,null,null,null,null,null,null,null,null,null,null,null,null,null,null,null,null,null,null,null,null,null,null,null,null,null,null,null,null,null,null,null,null,null,"Abschliessbar 1",{"$f":"AND(OR(AN2,AN3),AN4,AN5,NOT(AP7),NOT(AP2))","v":false},4,{"$f":"AND(NOT(OR(AP3,AP4)),AP6)*AQ6","v":0},"Abschliessbar 1"]
[null,"     Ein   >>>",null,null,null,null,null,null,null,null,null,null,null,null,null,null,null,null,null,null,null,null,null,null,null,null,null,null,null,null,null,null,null,null,null,null,null,null,null,null,"Abgeschlossen",false,5,{"$f":"AND(NOT(OR(AP3,AP4)),AP7)*AQ7","v":0},"Abgeschlossen"]
[null,"<<<   Aus     ",null,null,null,null,null,null,null,null,null,null,null,null,null,null,null,null,null,null,null,null,null,null,null,null,null,null,null,null,null,null,null,null,null,null,null,null,null,null,"Für Jahr OK",{"$f":"AND(OR(AP2,AP7),NOT(AP3))","v":true}]
[null,"     Ein   >>>"]
[null,"<<<   Aus     ",null,null,null,null,null,null,null,null,null,null,null,null,null,null,null,null,null,null,null,null,null,null,null,null,null,null,null,null,null,null,null,null,null,null,null,null,null,null,"Statusnummer:",{"$f":"IF(AR2=AQ2,AQ2,MAX(AR2:AR7))","v":-1}]
[null,"     Ein   >>>",null,null,null,null,null,null,null,null,null,null,null,null,null,null,null,null,null,null,null,null,null,null,null,null,null,null,null,null,null,null,null,null,null,null,null,null,"HatDaten:",{"$f":"AND(AP2=FALSE,OR(AP10<>3,COUNTA(D5:AH12,D20:AH35,D39:L40)>0))","v":false},"Statustext:",{"$f":"IFERROR(VLOOKUP(AP10,AR2:AS7,2,FALSE),\"unbekannt\")","v":"Nicht Relevant"},null,null,1]
[null,"<<<   Aus     ",null,null,null,null,null,null,null,null,null,null,null,null,null,null,null,null,null,null,null,null,null,null,null,null,null,null,null,null,null,null,null,null,{"$f":"IF(COUNTIF(D37:AH37,\"I\")>0,\"I\",\"\")","v":""}]
[null,{"$f":"B_PrZeit","v":"Präsenzzeit"},null,{"$f":"24*(D6-D5+D8-D7+D10-D9+D12-D11)*D88","v":0},{"$f":"24*(E6-E5+E8-E7+E10-E9+E12-E11)*E88","v":0},0,0,0,0,0,0,0,0,0,0,0,0,0,0,0,0,0,0,0,0,0,0,0,0,0,0,0,0,0,null,null,null,null,"Anzahl Regeltage:",{"$f":"D83","v":0}]
[null,{"$f":"B_TotalAZist","v":"Total Arbeitszeit (IST)"},null,{"$f":"IF(D13+D35>=D15,D13+D35,MIN(D13+D35+SUM(D20,D22,D23,D24,D25,D26,D27,D28,D29,D30,D31,D32,D33,D34),IF(D15<0,0,D15)))*D82","v":0},0,0,0,0,0,0,0,0,0,0,0,0,0,{"$f":"IF(R13+R35>=R15,R13+R35,MIN(R13+R35+SUM(R20,R22,R23,R24,R25,R26,R27,R28,R29,R30,R31,R32,R33,R34),IF(R15<0,0,R15)))*R82","v":0},{"$f":"IF(S13+S35>=S15,S13+S35,MIN(S13+S35+SUM(S20,S22,S23,S24,S25,S26,S27,S28,S29,S30,S31,S32,S33,S34),IF(S15<0,0,S15)))*S82","v":0},{"$f":"IF(T13+T35>=T15,T13+T35,MIN(T13+T35+SUM(T20,T22,T23,T24,T25,T26,T27,T28,T29,T30,T31,T32,T33,T34),IF(T15<0,0,T15)))*T82","v":0},{"$f":"IF(U13+U35>=U15,U13+U35,MIN(U13+U35+SUM(U20,U22,U23,U24,U25,U26,U27,U28,U29,U30,U31,U32,U33,U34),IF(U15<0,0,U15)))*U82","v":0},0,0,0,0,0,0,0,0,0,0,0,0,0,{"$f":"SUMIF($D$82:$AH$82,1,D14:AH14)","v":0},{"$f":"AI14-AI15","v":0},null,null,"Erfasste Regeltage",{"$f":"L83","v":0},{"$f":"AN13-AN14","v":0},"Fehlende Regeltage"]
[null,{"$f":"B_NettoSollAZ","v":"Netto-SOLL-Arbeitszeit"},null,{"$f":"ROUND(D16-D19,2)","v":0},{"$f":"ROUND(E16-E19,2)","v":0},0,0,0,0,0,0,0,0,0,0,0,0,0,0,0,0,0,0,0,0,0,0,0,0,0,0,{"$f":"IF(AF$42=4,0,ROUND(AF16-AF19,2))","v":0},{"$f":"IF(AG$42=4,0,ROUND(AG16-AG19,2))","v":0},0,{"$f":"SUMIF($D$82:$AH$82,1,D15:AH15)","v":0},null,null,null,"Minimum Regeltage",{"$f":"MinRegeltage","v":1},"Ist als Konstante im Blatt \"Intern\" hinterlegt"]
[null,{"$f":"B_BruttoSollAZ","v":"Brutto-SOLL-Arb.zeit"},null,{"$f":"VLOOKUP(D3,VSA_Kalender,16)","v":0},0,0,0,0,0,0,0,0,0,0,0,0,0,0,0,0,0,0,0,0,0,0,0,0,0,0,0,{"$f":"IF(AF$42=4,0,VLOOKUP(AF3,VSA_Kalender,16))","v":0},{"$f":"IF(AG$42=4,0,VLOOKUP(AG3,VSA_Kalender,16))","v":0},{"$f":"IF(AH$42=4,0,VLOOKUP(AH3,VSA_Kalender,16))","v":0},null,null,null,null,"Regel ok","Mind. eigetr. Regeltage erfüllt"]
[null,{"$f":"B_MehrMinder","v":"Mehr-/Minderleistung"},null,{"$f":"(SL_BisDatum>=D3)*ROUND(D14-D15,2)","v":0},0,0,0,0,0,0,0,0,0,0,0,0,0,0,0,0,0,0,0,0,0,0,0,0,0,0,0,0,0,0,{"$f":"B_Total","v":"Total"},{"$f":"B_Vortrag","v":"Vortrag"},null,null,"Spalten ok:","Alle Einträge an Regeltagen ok"]
[null,{"$f":"B_AZSaldo","v":"AZ - Saldo"},{"$f":"VLOOKUP(ROW(),VSA_Uebertrag,$A$1+3)","v":16.8},{"$f":"IFERROR((C18+D17)*(D3<=SL_BisDatum)*VLOOKUP(D3,VSA_Kalender,21,FALSE),0)","v":0},0,0,{"$f":"IFERROR((F18+G17)*(G3<=SL_BisDatum)*VLOOKUP(G3,VSA_Kalender,21,FALSE),0)","v":0},0,0,0,0,0,0,0,0,0,0,0,0,0,0,0,0,0,0,0,0,0,0,0,0,0,0,0,null,{"$f":"SUMIF($D$82:$AH$82,1,D17:AH17)+C18","v":16.8}]
[null,{"$f":"B_FTA","v":"Feiertagsanspruch"},0,{"$f":"VLOOKUP(D3,VSA_Kalender,14)","v":0},0,0,0,0,0,0,0,0,0,0,0,0,0,0,0,0,0,0,0,0,0,0,0,0,0,0,0,{"$f":"IF(AF$42=4,0,VLOOKUP(AF3,VSA_Kalender,14))","v":0},{"$f":"IF(AG$42=4,0,VLOOKUP(AG3,VSA_Kalender,14))","v":0},{"$f":"IF(AH$42=4,0,VLOOKUP(AH3,VSA_Kalender,14))","v":0},{"$f":"SUM(D19:AH19)","v":0}]
[null,{"$f":"B_Ferien","v":"Ferien"},{"$f":"VLOOKUP(ROW(),VSA_Uebertrag,$A$1+3)","v":0},null,null,null,null,null,null,null,null,null,null,null,null,null,null,null,null,null,null,null,null,null,null,null,null,null,null,null,null,null,null,null,{"$f":"SUMIF($D$82:$AH$82,1,D20:AH20)","v":0},{"$f":"ROUND(C20-AI20,2)","v":0},"Rest"]
[null,{"$f":"B_KompAZ","v":"Kompensation Arbeitstage"},0,null,null,null,null,null,null,null,null,null,null,null,null,null,null,null,null,null,null,null,null,null,null,null,null,null,null,null,null,null,null,null,0,{"$f":"ROUND(A21+C21-AI21,0)","v":0}]
[null,{"$f":"B_Arzt","v":"Arztbesuch"},0,null,null,null,null,null,null,null,null,null,null,null,null,null,null,null,null,null,null,null,null,null,null,null,null,null,null,null,null,null,null,null,0,{"$f":"ROUND(A22+C22+AI22,2)","v":0},"Summen"]
[null,{"$f":"B_Krank","v":"Krankheit"},0,null,null,null,null,null,null,null,null,null,null,null,null,null,null,null,null,null,null,null,null,null,null,null,null,null,null,null,null,null,null,null,0,{"$f":"ROUND(A23+C23+AI23,2)","v":0}]
[null,{"$f":"B_BU","v":"Berufsunfall"},0,null,null,null,null,null,null,null,null,null,null,null,null,null,null,null,null,null,null,null,null,null,null,null,null,null,null,null,null,null,null,null,0,0]
[null,{"$f":"B_NBU","v":"Nichtberufsunfall"},0,null,null,null,null,null,null,null,null,null,null,null,null,null,null,null,null,null,null,null,null,null,null,null,null,null,null,null,null,null,null,null,0,0]
[null,{"$f":"B_MilZiv","v":"Militär / Zivilschutz"},0,null,null,null,null,null,null,null,null,null,null,null,null,null,null,null,null,null,null,null,null,null,null,null,null,null,null,null,null,null,null,null,0,0]
[null,{"$f":"B_UUB","v":"Unbezahlter Urlaub"},0,null,null,null,null,null,null,null,null,null,null,null,null,null,null,null,null,null,null,null,null,null,null,null,null,null,null,null,null,null,null,null,0,{"$f":"ROUND(A27+C27-AI27,2)","v":0},"Rest"]
[null,{"$f":"B_UB","v":"Bezahlter Urlaub"},0,null,null,null,null,null,null,null,null,null,null,null,null,null,null,null,null,null,null,null,null,null,null,null,null,null,null,null,null,null,null,null,0,{"$f":"ROUND(A28+C28-AI28,2)","v":0}]
[null,{"$f":"B_NebenB","v":"Nebenbeschäftigung"},0,null,null,null,null,null,null,null,null,null,null,null,null,null,null,null,null,null,null,null,null,null,null,null,null,null,null,null,null,null,null,null,0,0]
[null,{"$f":"B_DAG","v":"D A G"},0,null,null,null,null,null,null,null,null,null,null,null,null,null,null,null,null,null,null,null,null,null,null,null,null,null,null,null,null,null,null,null,0,0]
[null,{"$f":"B_Divers","v":"Diverses"},0,null,null,null,null,null,null,null,null,null,null,null,null,null,null,null,null,null,null,null,null,null,null,null,null,null,null,null,null,null,null,null,0,0,"Summen"]
[null,{"$f":"B_FamPersErg","v":"Fam./pers. Ereignisse"},0,null,null,null,null,null,null,null,null,null,null,null,null,null,null,null,null,null,null,null,null,null,null,null,null,null,null,null,null,null,null,null,0,0]
[null,{"$f":"B_FZ1","v":"freie Zeile 1"},0,null,null,null,null,null,null,null,null,null,null,null,null,null,null,null,null,null,null,null,null,null,null,null,null,null,null,null,null,null,null,null,0,0]
[null,{"$f":"B_FZ2","v":"freie Zeile 2"},0,null,null,null,null,null,null,null,null,null,null,null,null,null,null,null,null,null,null,null,null,null,null,null,null,null,null,null,null,null,null,null,0,0]
[null,{"$f":"B_WB","v":"Weiterbildung"},0,null,null,null,null,null,null,null,null,null,null,null,null,null,null,null,null,null,null,null,null,null,null,null,null,null,null,null,null,null,null,null,0,0]
[null,{"$f":"B_FEL","v":"frei einsetzbare Lekt."},0,null,null,null,null,null,null,null,null,null,null,null,null,null,null,null,null,null,null,null,null,null,null,null,null,null,null,null,null,null,null,null,{"$f":"SUM(D36:AH36)","v":0},{"$f":"ROUND(C36-AI36,0)","v":0}]
[null,null,null,{"$f":"IF(AND((D13 - D15)+SUM(D20,D22:D34)>0.00001,SUM(D20,D22:D34)>0),\"I\",\"\")","v":""},"","","","","","","","","","","","","","","","","","","","","","","","","","","","","","",null,null,null,null,{"$f":"CONCATENATE(G37:AJ37)","v":""},"","","","","","","","","","","","","","","","","","","","","","","","","","","","",""]
[null,null,"Visum","Identität:",null,null,null,null,"Datum:",null,"Status:"]
[null,null,"SL"]
[null,null,"VG"]
[null,null,null,1,2,3,4,5,6,7,8,9,10,11,12,13,14,15,16,17,18,19,20,21,22,23,24,25,26,27,28,29,30,31]
[null,null,null,{"$f":"IF(D3=\"\",4,VLOOKUP(D3,VSA_Kalender,18))","v":0},1,1,0,0,0,0,0,1,1,0,0,0,0,0,1,1,0,0,0,0,0,1,1,0,0,0,0,0,1,4]
[]
[null,null,null,{"$f":"IF(D19>0,VLOOKUP(D3,KalFeiertage,6,FALSE),\"\")","v":""},"","","","","","","","","","","","","","","","","","","","","","","","","","","","","",""]
[null,null,null,"FT=WENN(D13+D35>=D15;D13+D35;MIN(D13+D35+SUMME(D20;D22;D23;D24;D25;D26;D27;D28;D29;D30;D31;D32;D33;D34);WENN(D15<0;0;D15)))*D82","FT=WENN(E13+E35>=E15;E13+E35;MIN(E13+E35+SUMME(E20;E22;E23;E24;E25;E26;E27;E28;E29;E30;E31;E32;E33;E34);WENN(E15<0;0;E15)))*E82","FT=WENN(F13+F35>=F15;F13+F35;MIN(F13+F35+SUMME(F20;F22;F23;F24;F25;F26;F27;F28;F29;F30;F31;F32;F33;F34);WENN(F15<0;0;F15)))*F82","FT=WENN(G13+G35>=G15;G13+G35;MIN(G13+G35+SUMME(G20;G22;G23;G24;G25;G26;G27;G28;G29;G30;G31;G32;G33;G34);WENN(G15<0;0;G15)))*G82","FT=WENN(H13+H35>=H15;H13+H35;MIN(H13+H35+SUMME(H20;H22;H23;H24;H25;H26;H27;H28;H29;H30;H31;H32;H33;H34);WENN(H15<0;0;H15)))*H82","FT=WENN(I13+I35>=I15;I13+I35;MIN(I13+I35+SUMME(I20;I22;I23;I24;I25;I26;I27;I28;I29;I30;I31;I32;I33;I34);WENN(I15<0;0;I15)))*I82","FT=WENN(J13+J35>=J15;J13+J35;MIN(J13+J35+SUMME(J20;J22;J23;J24;J25;J26;J27;J28;J29;J30;J31;J32;J33;J34);WENN(J15<0;0;J15)))*J82","FT=WENN(K13+K35>=K15;K13+K35;MIN(K13+K35+SUMME(K20;K22;K23;K24;K25;K26;K27;K28;K29;K30;K31;K32;K33;K34);WENN(K15<0;0;K15)))*K82","FT=WENN(L13+L35>=L15;L13+L35;MIN(L13+L35+SUMME(L20;L22;L23;L24;L25;L26;L27;L28;L29;L30;L31;L32;L33;L34);WENN(L15<0;0;L15)))*L82","FT=WENN(M13+M35>=M15;M13+M35;MIN(M13+M35+SUMME(M20;M22;M23;M24;M25;M26;M27;M28;M29;M30;M31;M32;M33;M34);WENN(M15<0;0;M15)))*M82","FT=WENN(N13+N35>=N15;N13+N35;MIN(N13+N35+SUMME(N20;N22;N23;N24;N25;N26;N27;N28;N29;N30;N31;N32;N33;N34);WENN(N15<0;0;N15)))*N82","FT=WENN(O13+O35>=O15;O13+O35;MIN(O13+O35+SUMME(O20;O22;O23;O24;O25;O26;O27;O28;O29;O30;O31;O32;O33;O34);WENN(O15<0;0;O15)))*O82","FT=WENN(P13+P35>=P15;P13+P35;MIN(P13+P35+SUMME(P20;P22;P23;P24;P25;P26;P27;P28;P29;P30;P31;P32;P33;P34);WENN(P15<0;0;P15)))*P82","FT=WENN(Q13+Q35>=Q15;Q13+Q35;MIN(Q13+Q35+SUMME(Q20;Q22;Q23;Q24;Q25;Q26;Q27;Q28;Q29;Q30;Q31;Q32;Q33;Q34);WENN(Q15<0;0;Q15)))*Q82","FT=WENN(R13+R35>=R15;R13+R35;MIN(R13+R35+SUMME(R20;R22;R23;R24;R25;R26;R27;R28;R29;R30;R31;R32;R33;R34);WENN(R15<0;0;R15)))*R82","FT=WENN(S13+S35>=S15;S13+S35;MIN(S13+S35+SUMME(S20;S22;S23;S24;S25;S26;S27;S28;S29;S30;S31;S32;S33;S34);WENN(S15<0;0;S15)))*S82","FT=WENN(T13+T35>=T15;T13+T35;MIN(T13+T35+SUMME(T20;T22;T23;T24;T25;T26;T27;T28;T29;T30;T31;T32;T33;T34);WENN(T15<0;0;T15)))*T82","FT=WENN(U13+U35>=U15;U13+U35;MIN(U13+U35+SUMME(U20;U22;U23;U24;U25;U26;U27;U28;U29;U30;U31;U32;U33;U34);WENN(U15<0;0;U15)))*U82","FT=WENN(V13+V35>=V15;V13+V35;MIN(V13+V35+SUMME(V20;V22;V23;V24;V25;V26;V27;V28;V29;V30;V31;V32;V33;V34);WENN(V15<0;0;V15)))*V82","FT=WENN(W13+W35>=W15;W13+W35;MIN(W13+W35+SUMME(W20;W22;W23;W24;W25;W26;W27;W28;W29;W30;W31;W32;W33;W34);WENN(W15<0;0;W15)))*W82","FT=WENN(X13+X35>=X15;X13+X35;MIN(X13+X35+SUMME(X20;X22;X23;X24;X25;X26;X27;X28;X29;X30;X31;X32;X33;X34);WENN(X15<0;0;X15)))*X82","FT=WENN(Y13+Y35>=Y15;Y13+Y35;MIN(Y13+Y35+SUMME(Y20;Y22;Y23;Y24;Y25;Y26;Y27;Y28;Y29;Y30;Y31;Y32;Y33;Y34);WENN(Y15<0;0;Y15)))*Y82","FT=WENN(Z13+Z35>=Z15;Z13+Z35;MIN(Z13+Z35+SUMME(Z20;Z22;Z23;Z24;Z25;Z26;Z27;Z28;Z29;Z30;Z31;Z32;Z33;Z34);WENN(Z15<0;0;Z15)))*Z82","FT=WENN(AA13+AA35>=AA15;AA13+AA35;MIN(AA13+AA35+SUMME(AA20;AA22;AA23;AA24;AA25;AA26;AA27;AA28;AA29;AA30;AA31;AA32;AA33;AA34);WENN(AA15<0;0;AA15)))*AA82","FT=WENN(AB13+AB35>=AB15;AB13+AB35;MIN(AB13+AB35+SUMME(AB20;AB22;AB23;AB24;AB25;AB26;AB27;AB28;AB29;AB30;AB31;AB32;AB33;AB34);WENN(AB15<0;0;AB15)))*AB82","FT=WENN(AC13+AC35>=AC15;AC13+AC35;MIN(AC13+AC35+SUMME(AC20;AC22;AC23;AC24;AC25;AC26;AC27;AC28;AC29;AC30;AC31;AC32;AC33;AC34);WENN(AC15<0;0;AC15)))*AC82","FT=WENN(AD13+AD35>=AD15;AD13+AD35;MIN(AD13+AD35+SUMME(AD20;AD22;AD23;AD24;AD25;AD26;AD27;AD28;AD29;AD30;AD31;AD32;AD33;AD34);WENN(AD15<0;0;AD15)))*AD82","FT=WENN(AE13+AE35>=AE15;AE13+AE35;MIN(AE13+AE35+SUMME(AE20;AE22;AE23;AE24;AE25;AE26;AE27;AE28;AE29;AE30;AE31;AE32;AE33;AE34);WENN(AE15<0;0;AE15)))*AE82","FT=WENN(AF13+AF35>=AF15;AF13+AF35;MIN(AF13+AF35+SUMME(AF20;AF22;AF23;AF24;AF25;AF26;AF27;AF28;AF29;AF30;AF31;AF32;AF33;AF34);WENN(AF15<0;0;AF15)))*AF82","FT=WENN(AG13+AG35>=AG15;AG13+AG35;MIN(AG13+AG35+SUMME(AG20;AG22;AG23;AG24;AG25;AG26;AG27;AG28;AG29;AG30;AG31;AG32;AG33;AG34);WENN(AG15<0;0;AG15)))*AG82","FT=WENN(AH13+AH35>=AH15;AH13+AH35;MIN(AH13+AH35+SUMME(AH20;AH22;AH23;AH24;AH25;AH26;AH27;AH28;AH29;AH30;AH31;AH32;AH33;AH34);WENN(AH15<0;0;AH15)))*AH82"]
[null,null,null,"FT=24*(D6-D5+D8-D7+D10-D9+D12-D11)*D88","FT=24*(E6-E5+E8-E7+E10-E9+E12-E11)*E88","FT=24*(F6-F5+F8-F7+F10-F9+F12-F11)*F88","FT=24*(G6-G5+G8-G7+G10-G9+G12-G11)*G88","FT=24*(H6-H5+H8-H7+H10-H9+H12-H11)*H88","FT=24*(I6-I5+I8-I7+I10-I9+I12-I11)*I88","FT=24*(J6-J5+J8-J7+J10-J9+J12-J11)*J88","FT=24*(K6-K5+K8-K7+K10-K9+K12-K11)*K88","FT=24*(L6-L5+L8-L7+L10-L9+L12-L11)*L88","FT=24*(M6-M5+M8-M7+M10-M9+M12-M11)*M88","FT=24*(N6-N5+N8-N7+N10-N9+N12-N11)*N88","FT=24*(O6-O5+O8-O7+O10-O9+O12-O11)*O88","FT=24*(P6-P5+P8-P7+P10-P9+P12-P11)*P88","FT=24*(Q6-Q5+Q8-Q7+Q10-Q9+Q12-Q11)*Q88","FT=24*(R6-R5+R8-R7+R10-R9+R12-R11)*R88","FT=24*(S6-S5+S8-S7+S10-S9+S12-S11)*S88","FT=24*(T6-T5+T8-T7+T10-T9+T12-T11)*T88","FT=24*(U6-U5+U8-U7+U10-U9+U12-U11)*U88","FT=24*(V6-V5+V8-V7+V10-V9+V12-V11)*V88","FT=24*(W6-W5+W8-W7+W10-W9+W12-W11)*W88","FT=24*(X6-X5+X8-X7+X10-X9+X12-X11)*X88","FT=24*(Y6-Y5+Y8-Y7+Y10-Y9+Y12-Y11)*Y88","FT=24*(Z6-Z5+Z8-Z7+Z10-Z9+Z12-Z11)*Z88","FT=24*(AA6-AA5+AA8-AA7+AA10-AA9+AA12-AA11)*AA88","FT=24*(AB6-AB5+AB8-AB7+AB10-AB9+AB12-AB11)*AB88","FT=24*(AC6-AC5+AC8-AC7+AC10-AC9+AC12-AC11)*AC88","FT=24*(AD6-AD5+AD8-AD7+AD10-AD9+AD12-AD11)*AD88","FT=24*(AE6-AE5+AE8-AE7+AE10-AE9+AE12-AE11)*AE88","FT=24*(AF6-AF5+AF8-AF7+AF10-AF9+AF12-AF11)*AF88","FT=24*(AG6-AG5+AG8-AG7+AG10-AG9+AG12-AG11)*AG88","FT=24*(AH6-AH5+AH8-AH7+AH10-AH9+AH12-AH11)*AH88"]
[null,null,null,"FT=ODER(D14>0;D21>0)*1","FT=ODER(E14>0;E21>0)*1","FT=ODER(F14>0;F21>0)*1","FT=ODER(G14>0;G21>0)*1","FT=ODER(H14>0;H21>0)*1","FT=ODER(I14>0;I21>0)*1","FT=ODER(J14>0;J21>0)*1","FT=ODER(K14>0;K21>0)*1","FT=ODER(L14>0;L21>0)*1","FT=ODER(M14>0;M21>0)*1","FT=ODER(N14>0;N21>0)*1","FT=ODER(O14>0;O21>0)*1","FT=ODER(P14>0;P21>0)*1","FT=ODER(Q14>0;Q21>0)*1","FT=ODER(R14>0;R21>0)*1","FT=ODER(S14>0;S21>0)*1","FT=ODER(T14>0;T21>0)*1","FT=ODER(U14>0;U21>0)*1","FT=ODER(V14>0;V21>0)*1","FT=ODER(W14>0;W21>0)*1","FT=ODER(X14>0;X21>0)*1","FT=ODER(Y14>0;Y21>0)*1","FT=ODER(Z14>0;Z21>0)*1","FT=ODER(AA14>0;AA21>0)*1","FT=ODER(AB14>0;AB21>0)*1","FT=ODER(AC14>0;AC21>0)*1","FT=ODER(AD14>0;AD21>0)*1","FT=ODER(AE14>0;AE21>0)*1","FT=ODER(AF14>0;AF21>0)*1","FT=ODER(AG14>0;AG21>0)*1","FT=ODER(AH14>0;AH21>0)*1"]
[null,null,null,{"$f":"ABS(\"FT\"&_xlfn.FORMULATEXT(D14)<>D45)","v":0},0,0,0,0,0,0,0,0,0,0,0,0,0,0,0,0,0,0,0,0,0,0,0,0,0,0,0,0,0,0]
[null,null,null,{"$f":"ABS(\"FT\"&_xlfn.FORMULATEXT(D13)<>D46)","v":0},0,0,0,0,0,0,0,0,0,0,0,0,0,0,0,0,0,0,0,0,0,0,0,0,0,0,0,0,0,0]
[null,null,null,{"$f":"ABS(\"FT\"&_xlfn.FORMULATEXT(D80)<>D47)","v":0},0,0,0,0,0,0,0,0,0,0,0,0,0,0,0,0,0,0,0,0,0,0,0,0,0,0,0,0,0,0]
[null,null,null,{"$f":"ABS(ISERROR(D37))","v":0},{"$f":"ABS(ISERROR(E37))","v":0},0,0,0,0,0,0,0,0,0,0,0,0,0,0,0,0,0,0,0,0,0,0,0,0,0,0,0,0,0]
[null,null,null,{"$f":"SUM(D48:D51)","v":0},0,0,0,0,0,0,0,0,0,0,0,0,0,0,0,0,0,0,0,0,0,0,0,0,0,0,0,0,0,0,null,null,null,null,"Formel defekt",{"$f":"SUM(D52:AH52)","v":0}]
[null,null,null,{"$f":"IFERROR(D37,1)","v":""},{"$f":"IFERROR(E37,1)","v":""},"","","","","",null,"","","","","","","","",null,"","","","","","","","","","","","","",""]
[]
[]
[]
[]
[]
[]
[]
[]
[]
[]
[]
[]
[]
[]
[]
[]
[]
[]
[]
[]
[]
[]
[]
[null,"HT_Naz-Kopie",{"$f":"HT_NAZ","v":8.4}]
[null,"Heute:",{"$f":"SL_BisDatum","v":"2024-02-02"}]
[null,null,"Reguläre Tage ausgefüllt",{"$f":"((D80*D81)=1)*1","v":0},{"$f":"((E80*E81)=1)*1","v":0},0,0,0,0,0,0,0,0,0,0,0,0,0,0,0,0,0,0,0,0,0,0,0,0,0,0,0,0,0]
[null,null,"Arbeitstage ausgefüllt",{"$f":"OR(D14>0,D21>0)*1","v":0},{"$f":"OR(E14>0,E21>0)*1","v":0},0,0,0,0,0,0,0,0,0,0,0,0,0,0,0,0,0,0,0,0,0,0,0,0,0,0,0,0,0]
[null,null,"Arbeitstage wenn BG>0%",{"$f":"IFERROR(VLOOKUP(D3,VSA_Kalender,22),0)","v":0},0,0,0,0,0,0,0,0,0,0,0,0,0,0,0,0,0,0,0,0,0,0,0,0,0,0,0,0,0,0]
[null,null,"Der BG beträgt mehr als 0%",{"$f":"IF(D4=\"\",0,ABS(VLOOKUP(D3,VSA_Kalender,13,FALSE)>0))","v":1},1,1,1,1,1,1,1,1,1,1,1,1,1,1,1,1,1,1,1,1,1,1,1,1,1,1,1,1,1,0]
[null,null,"(Ja: 1, Nein: 0)",{"$f":"SUM(D81:AH81)","v":0},"Total Tage bei BG>0%",null,null,{"$f":"SUM(D80:AH80)","v":0},"Total Tage ausgefüllt",null,null,{"$f":"SUM(D79:AH79)","v":0},"Total reguläre Tage ausgefüllt"]
[]
[null,null,"Tag des Monats",{"$f":"D4","v":1},2,3,4,5,6,7,8,9,10,11,12,13,14,15,16,17,18,19,20,21,22,23,24,25,26,27,28,29,30,""]
[null,null,"Ist Arbeitsbereich",{"$f":"IFERROR(ABS(WEEKDAY(D3,2)<6),0)","v":1},0,0,1,1,1,1,1,0,0,1,1,1,1,1,0,0,1,1,1,1,1,0,0,1,1,1,1,1,0,0]
[null,null,"Maximaler Fehler",{"$f":"MAX(D100:D107,D98,D134)","v":0},{"$f":"MAX(E100:E107,E98,E134)","v":0},0,0,0,0,0,0,0,0,0,0,0,0,0,0,0,0,0,0,0,0,0,0,0,0,0,0,0,0,0]
[null,null,"Wird die Präsenzzeit angezeigt?",{"$f":"IF(D87=0,1,0)","v":1},{"$f":"IF(E87=0,1,0)","v":1},1,1,1,1,1,1,1,1,1,1,1,1,1,1,1,1,1,1,1,1,1,1,1,1,1,1,1,1,1]
[]
[null,null,"Gruppenfehler 1",{"$f":"IF(AND(D6-D5=0,COUNTA(D7:D12)>0),1,0)","v":0},0,0,0,0,0,0,0,0,0,0,0,0,0,0,0,0,0,0,0,0,0,0,0,0,0,0,0,0,0,0]
[null,"Gruppenfehler","(aus)",{"$f":"D90","v":0},0,0,0,0,0,0,0,0,0,0,0,0,0,0,0,0,0,0,0,0,0,0,0,0,0,0,0,0,0,0]
[null,null,"Gruppenfehler 2",{"$f":"IF(AND(D8-D7=0,COUNTA(D9:D12)>0),1,0)","v":0},0,0,0,0,0,0,0,0,0,0,0,0,0,0,0,0,0,0,0,0,0,0,0,0,0,0,0,0,0,0]
[null,null,"(aus)",{"$f":"D92","v":0},0,0,0,0,0,0,0,0,0,0,0,0,0,0,0,0,0,0,0,0,0,0,0,0,0,0,0,0,0,0]
[null,null,"Gruppenfehler 3",{"$f":"IF(AND(D10-D9=0,COUNTA(D11:D12)>0),1,0)","v":0},0,0,0,0,0,0,0,0,0,0,0,0,0,0,0,0,0,0,0,0,0,0,0,0,0,0,0,0,0,0]
[null,null,"(aus)",{"$f":"D94","v":0},0,0,0,0,0,0,0,0,0,0,0,0,0,0,0,0,0,0,0,0,0,0,0,0,0,0,0,0,0,0]
[null,null,"leer"]
[null,null,"leer"]
[null,null,"Genereller Gruppenfehler",{"$f":"MAX(D90:D95)","v":0},0,0,0,0,0,0,0,0,0,0,0,0,0,0,0,0,0,0,0,0,0,0,0,0,0,0,0,0,0,0]
[]
[null,null,"Ein1",{"$f":"IF(AND(D109=0,D110>0),1,0)","v":0},{"$f":"IF(AND(E109=0,E110>0),1,0)","v":0},0,0,0,0,0,0,0,0,0,0,0,0,0,0,0,0,0,0,0,0,0,0,0,0,0,0,0,0,0]
[null,null,"Aus1",{"$f":"IF(AND(D110>0,D110<D109),3,IF(AND(D109>0,D110=0),1,0))*D$86","v":0},{"$f":"IF(AND(E110>0,E110<E109),3,IF(AND(E109>0,E110=0),1,0))*E$86","v":0},0,0,0,0,0,0,0,0,0,0,0,0,0,0,0,0,0,0,0,0,0,0,0,0,0,0,0,0,0]
[null,null,"Ein2",{"$f":"IF(AND(D111>0,D111<D110),3,IF(AND(D111=0,D112>0),1,0))*D$86","v":0},0,0,0,0,0,0,0,0,0,0,0,0,0,0,0,0,0,0,0,0,0,0,0,0,0,0,0,0,0,0]
[null,null,"Aus2",{"$f":"IF(AND(D112>0,D112<D111),3,IF(AND(D111>0,D112=0),1,0))*D$86","v":0},{"$f":"IF(AND(E112>0,E112<E111),3,IF(AND(E111>0,E112=0),1,0))*E$86","v":0},0,0,0,0,0,0,0,0,0,0,0,0,0,0,0,0,0,0,0,0,0,0,0,0,0,0,0,0,0]
[null,"Zellenfehler","Ein3",{"$f":"IF(AND(D113>0,D113<D112),3,IF(AND(D113=0,D114>0),1,0))*D$86","v":0},{"$f":"IF(AND(E113>0,E113<E112),3,IF(AND(E113=0,E114>0),1,0))*E$86","v":0},0,0,0,0,0,0,0,0,0,0,0,0,0,0,0,0,0,0,0,0,0,0,0,0,0,0,0,0,0]
[null,null,"Aus3",{"$f":"IF(AND(D114>0,D114<D113),3,IF(AND(D113>0,D114=0),1,0))*D$86","v":0},{"$f":"IF(AND(E114>0,E114<E113),3,IF(AND(E113>0,E114=0),1,0))*E$86","v":0},0,0,0,0,0,0,0,0,0,0,0,0,0,0,0,0,0,0,0,0,0,0,0,0,0,0,0,0,0]
[null,null,"Ein4",{"$f":"IF(AND(D115>0,D115<D114),3,IF(AND(D115=0,D116>0),1,0))*D$86","v":0},{"$f":"IF(AND(E115>0,E115<E114),3,IF(AND(E115=0,E116>0),1,0))*E$86","v":0},0,0,0,0,0,0,0,0,0,0,0,0,0,0,0,0,0,0,0,0,0,0,0,0,0,0,0,0,0]
[null,null,"Aus4",{"$f":"IF(AND(D116>0,D116<D115),3,IF(AND(D115>0,D116=0),1,0))*D$86","v":0},{"$f":"IF(AND(E116>0,E116<E115),3,IF(AND(E115>0,E116=0),1,0))*E$86","v":0},0,0,0,0,0,0,0,0,0,0,0,0,0,0,0,0,0,0,0,0,0,0,0,0,0,0,0,0,0]
[]
[null,null,"Ein1",{"$f":"ROUND(D5*24,2)","v":0},0,0,0,0,0,0,0,0,0,0,0,0,0,0,0,0,0,0,0,0,0,0,0,0,0,0,0,0,0,0]
[null,null,"Aus1",0,0,0,0,0,0,0,0,0,0,0,0,0,0,0,0,0,0,0,0,0,0,0,0,0,0,0,0,0,0,0]
[null,"Zeiten dezimal gewandelt","Ein2",0,0,0,0,0,0,0,0,0,0,0,0,0,0,0,0,0,0,0,0,0,0,0,0,0,0,0,0,0,0,0]
[null,null,"Aus2",0,0,0,0,0,0,0,0,0,0,0,0,0,0,0,0,0,0,0,0,0,0,0,0,0,0,0,0,0,0,0]
[null,null,"Ein3",0,0,0,0,0,0,0,0,0,0,0,0,0,0,0,0,0,0,0,0,0,0,0,0,0,0,0,0,0,0,0]
[null,null,"Aus3",0,0,0,0,0,0,0,0,0,0,0,0,0,0,0,0,0,0,0,0,0,0,0,0,0,0,0,0,0,0,0]
[null,null,"Ein4",0,0,0,0,0,0,0,0,0,0,0,0,0,0,0,0,0,0,0,0,0,0,0,0,0,0,0,0,0,0,0]
[null,null,"Aus4",0,0,0,0,0,0,0,0,0,0,0,0,0,0,0,0,0,0,0,0,0,0,0,0,0,0,0,0,0,0,0]
[]
[null,"Pausenfehler","Gruppe1",{"$f":"IF(OR(D109=\"\",D110=\"\"),0,D110-D109)","v":0},{"$f":"IF(OR(E109=\"\",E110=\"\"),0,E110-E109)","v":0},0,0,0,0,0,0,0,0,0,0,0,0,0,0,0,{"$f":"IF(OR(U109=\"\",U110=\"\"),0,U110-U109)","v":0},{"$f":"IF(OR(V109=\"\",V110=\"\"),0,V110-V109)","v":0},0,0,0,0,0,0,0,0,0,0,0,0]
[null,null,"Gruppe2",{"$f":"IF(OR(D111=\"\",D112=\"\"),0,D112-D111)","v":0},{"$f":"IF(OR(E111=\"\",E112=\"\"),0,E112-E111)","v":0},0,0,0,0,0,0,0,0,0,0,0,0,0,0,0,{"$f":"IF(OR(U111=\"\",U112=\"\"),0,U112-U111)","v":0},{"$f":"IF(OR(V111=\"\",V112=\"\"),0,V112-V111)","v":0},0,0,0,0,0,0,0,0,0,0,0,0]
[null,null,"Gruppe3",{"$f":"IF(OR(D113=\"\",D114=\"\"),0,D114-D113)","v":0},{"$f":"IF(OR(E113=\"\",E114=\"\"),0,E114-E113)","v":0},0,0,0,0,0,0,0,0,0,0,0,0,0,0,0,{"$f":"IF(OR(U113=\"\",U114=\"\"),0,U114-U113)","v":0},{"$f":"IF(OR(V113=\"\",V114=\"\"),0,V114-V113)","v":0},0,0,0,0,0,0,0,0,0,0,0,0]
[null,null,"Gruppe4",{"$f":"IF(OR(D115=\"\",D116=\"\"),0,D116-D115)","v":0},{"$f":"IF(OR(E115=\"\",E116=\"\"),0,E116-E115)","v":0},0,0,0,0,0,0,0,0,0,0,0,0,0,0,0,{"$f":"IF(OR(U115=\"\",U116=\"\"),0,U116-U115)","v":0},{"$f":"IF(OR(V115=\"\",V116=\"\"),0,V116-V115)","v":0},0,0,0,0,0,0,0,0,0,0,0,0]
[]
[null,null,"Pause12",{"$f":"IF(OR(D110=\"\",D111=\"\"),0,D111-D110)","v":0},{"$f":"IF(OR(E110=\"\",E111=\"\"),0,E111-E110)","v":0},0,0,0,0,0,0,0,0,0,0,0,0,0,0,0,{"$f":"IF(OR(U110=\"\",U111=\"\"),0,U111-U110)","v":0},{"$f":"IF(OR(V110=\"\",V111=\"\"),0,V111-V110)","v":0},0,0,0,0,0,0,0,0,0,0,0,0]
[null,null,"Pause23",{"$f":"IF(OR(D112=\"\",D113=\"\"),0,D113-D112)","v":0},{"$f":"IF(OR(E112=\"\",E113=\"\"),0,E113-E112)","v":0},0,0,0,0,0,0,0,0,0,0,0,0,0,0,0,{"$f":"IF(OR(U112=\"\",U113=\"\"),0,U113-U112)","v":0},{"$f":"IF(OR(V112=\"\",V113=\"\"),0,V113-V112)","v":0},0,0,0,0,0,0,0,0,0,0,0,0]
[null,null,"Pause34",{"$f":"IF(OR(D114=\"\",D115=\"\"),0,D115-D114)","v":0},{"$f":"IF(OR(E114=\"\",E115=\"\"),0,E115-E114)","v":0},0,0,0,0,0,0,0,0,0,0,0,0,0,0,0,{"$f":"IF(OR(U114=\"\",U115=\"\"),0,U115-U114)","v":0},{"$f":"IF(OR(V114=\"\",V115=\"\"),0,V115-V114)","v":0},0,0,0,0,0,0,0,0,0,0,0,0]
[]
[null,null,"Kum12",{"$f":"IF(D123>=0.5,0,D118+D119)","v":0},{"$f":"IF(E123>=0.5,0,E118+E119)","v":0},0,0,0,0,0,0,0,0,0,0,0,0,0,0,0,{"$f":"IF(U123>=0.5,0,U118+U119)","v":0},{"$f":"IF(V123>=0.5,0,V118+V119)","v":0},0,0,0,0,0,0,0,0,0,0,0,0]
[null,null,"Kum123",{"$f":"IF(OR(D123>=0.5,D124>=0.5),0,D118+D119+D120)","v":0},{"$f":"IF(OR(E123>=0.5,E124>=0.5),0,E118+E119+E120)","v":0},0,0,0,0,0,0,0,0,0,0,0,0,0,0,0,{"$f":"IF(OR(U123>=0.5,U124>=0.5),0,U118+U119+U120)","v":0},{"$f":"IF(OR(V123>=0.5,V124>=0.5),0,V118+V119+V120)","v":0},0,0,0,0,0,0,0,0,0,0,0,0]
[null,null,"Kum1234",{"$f":"IF(OR(D123>=0.5,D124>=0.5,D125>=0.5),0,D118+D119+D120+D121)","v":0},{"$f":"IF(OR(E123>=0.5,E124>=0.5,E125>=0.5),0,E118+E119+E120+E121)","v":0},0,0,0,0,0,0,0,0,0,0,0,0,0,0,0,{"$f":"IF(OR(U123>=0.5,U124>=0.5,U125>=0.5),0,U118+U119+U120+U121)","v":0},{"$f":"IF(OR(V123>=0.5,V124>=0.5,V125>=0.5),0,V118+V119+V120+V121)","v":0},0,0,0,0,0,0,0,0,0,0,0,0]
[null,null,"Kum23",{"$f":"IF(D124>=0.5,0,D119+D120)","v":0},{"$f":"IF(E124>=0.5,0,E119+E120)","v":0},0,0,0,0,0,0,0,0,0,0,0,0,0,0,0,{"$f":"IF(U124>=0.5,0,U119+U120)","v":0},{"$f":"IF(V124>=0.5,0,V119+V120)","v":0},0,0,0,0,0,0,0,0,0,0,0,0]
[null,null,"Kum234",{"$f":"IF(OR(D124>=0.5,D125>=0.5),0,D119+D120+D121)","v":0},{"$f":"IF(OR(E124>=0.5,E125>=0.5),0,E119+E120+E121)","v":0},0,0,0,0,0,0,0,0,0,0,0,0,0,0,0,{"$f":"IF(OR(U124>=0.5,U125>=0.5),0,U119+U120+U121)","v":0},{"$f":"IF(OR(V124>=0.5,V125>=0.5),0,V119+V120+V121)","v":0},0,0,0,0,0,0,0,0,0,0,0,0]
[null,null,"Kum34",{"$f":"IF(D125>=0.5,0,D120+D121)","v":0},{"$f":"IF(E125>=0.5,0,E120+E121)","v":0},0,0,0,0,0,0,0,0,0,0,0,0,0,0,0,{"$f":"IF(U125>=0.5,0,U120+U121)","v":0},{"$f":"IF(V125>=0.5,0,V120+V121)","v":0},0,0,0,0,0,0,0,0,0,0,0,0]
[]
[null,null,"Pausenfehler-Code",{"$f":"IF(MAX(D118:D121,D127:D132)>6,2,0)","v":0},{"$f":"IF(MAX(E118:E121,E127:E132)>6,2,0)","v":0},0,0,0,0,0,0,0,0,0,0,0,0,0,0,0,0,0,0,0,0,0,0,0,0,0,0,0,0,0]

{"sheet":"Dezember","index":17,"n_rows":134,"n_cols":45,"rows_kept":134,"cut":false,"hidden":true,"merged":[[11,34,12,35]]}
[12,{"$f":"DATEVALUE(\"1.\"&A1&\".\"&SL_Jahr)","v":"2024-12-01"},{"$f":"SL_Jahr","v":2024},{"$f":"B_Gde","v":"Gde:"},{"$f":"SL_Gemeinde","v":0},null,null,null,null,null,null,null,null,null,null,null,null,null,null,{"$f":"B_Schule","v":"Schule:"},{"$f":"SL_Schule","v":0},null,null,null,null,null,null,null,null,null,null,null,null,null,null,null,null,null,"Abschluss-Teilbedingungen:"]
[{"$f":"VLOOKUP(A1,Monatsenden,2)","v":45657},{"$f":"B_Bg","v":"BG:"},{"$f":"VLOOKUP(B1,VSA_Kalender,13)","v":1},{"$f":"B_Name","v":"Name:"},{"$f":"SL_Name","v":0},null,null,null,null,null,null,null,null,null,null,null,null,null,null,null,null,null,null,null,null,null,null,null,null,null,null,null,null,null,null,null,null,null,"Regel ok",{"$f":"(AN14>=AN15)","v":false},"Nicht Relevant",{"$f":"D83=0","v":true},-1,{"$f":"IF(AP2=TRUE,AQ2,0)","v":-1},"Nicht Relevant"]
[null,{"$f":"Zerf_Version & \" \" & Zerf_T","v":"Version VSA 1.06 "},null,{"$f":"DATE($C$1,MONTH($B$1),D$4)","v":"2024-12-01"},{"$f":"DATE($C$1,MONTH($B$1),E$4)","v":"2024-12-02"},"2024-12-03","2024-12-04","2024-12-05","2024-12-06","2024-12-07","2024-12-08","2024-12-09","2024-12-10","2024-12-11","2024-12-12","2024-12-13","2024-12-14","2024-12-15","2024-12-16","2024-12-17","2024-12-18","2024-12-19","2024-12-20","2024-12-21","2024-12-22","2024-12-23","2024-12-24","2024-12-25","2024-12-26","2024-12-27","2024-12-28",{"$f":"IF(MONTH(DATE($C$1,MONTH($B$1),AF$41))>MONTH($B$1),\"\",DATE($C$1,MONTH($B$1),AF$4))","v":"2024-12-29"},{"$f":"IF(MONTH(DATE($C$1,MONTH($B$1),AG$41))>MONTH($B$1),\"\",DATE($C$1,MONTH($B$1),AG$4))","v":"2024-12-30"},{"$f":"IF(MONTH(DATE($C$1,MONTH($B$1),AH$41))>MONTH($B$1),\"\",DATE($C$1,MONTH($B$1),AH$4))","v":"2024-12-31"},null,null,null,null,"Spalten ok",{"$f":"(L83>=D83)","v":true},"Entsperrt",false,1,{"$f":"AP3*AQ3","v":0},"Entsperrt"]
[null,{"$f":"IF(VSATestModus=TRUE(),\"VSA-Modus!\",\"\")","v":""},{"$f":"IF(AN52>0,\"DEFEKT\",\"\")","v":""},{"$f":"IF(MONTH(DATE($C$1,MONTH($B$1),D$41))>MONTH($B$1),\"\",D41)","v":1},2,3,4,5,6,7,8,9,10,11,12,13,14,15,16,17,18,19,20,21,22,23,24,25,26,27,28,{"$f":"IF(MONTH(DATE($C$1,MONTH($B$1),AF$41))>MONTH($B$1),\"\",AF41)","v":29},{"$f":"IF(MONTH(DATE($C$1,MONTH($B$1),AG$41))>MONTH($B$1),\"\",AG41)","v":30},{"$f":"IF(MONTH(DATE($C$1,MONTH($B$1),AH$41))>MONTH($B$1),\"\",AH41)","v":31},null,null,null,null,"Keine Fehler",{"$f":"(SUM(D87:AH87)=0)","v":true},"Geändert",false,2,{"$f":"AP4*AQ4","v":0},"Geändert"]
[null,"     Ein   >>>",null,null,null,null,null,null,null,null,null,null,null,null,null,null,null,null,null,null,null,null,null,null,null,null,null,null,null,null,null,null,null,null,null,null,null,null,"Keine Hand",{"$f":"(AI12=\"\")","v":true},"Sperre",{"$f":"AS11=2","v":false},3,{"$f":"NOT(AP6)*AQ5","v":3},"Eingaben vornehmen"]
[null,"<<<   Aus     ",null,null,null,null,null,null,null,null,null,null,null,null,null,null,null,null,null,null,null,null,null,null,null,null,null,null,null,null,null,null,null,null,null,null,null,null,null,null,"Abschliessbar 1",{"$f":"AND(OR(AN2,AN3),AN4,AN5,NOT(AP7),NOT(AP2))","v":false},4,{"$f":"AND(NOT(OR(AP3,AP4)),AP6)*AQ6","v":0},"Abschliessbar 1"]
[null,"     Ein   >>>",null,null,null,null,null,null,null,null,null,null,null,null,null,null,null,null,null,null,null,null,null,null,null,null,null,null,null,null,null,null,null,null,null,null,null,null,null,null,"Abgeschlossen",false,5,{"$f":"AND(NOT(OR(AP3,AP4)),AP7)*AQ7","v":0},"Abgeschlossen"]
[null,"<<<   Aus     ",null,null,null,null,null,null,null,null,null,null,null,null,null,null,null,null,null,null,null,null,null,null,null,null,null,null,null,null,null,null,null,null,null,null,null,null,null,null,"Für Jahr OK",{"$f":"AND(OR(AP2,AP7),NOT(AP3))","v":true}]
[null,"     Ein   >>>"]
[null,"<<<   Aus     ",null,null,null,null,null,null,null,null,null,null,null,null,null,null,null,null,null,null,null,null,null,null,null,null,null,null,null,null,null,null,null,null,null,null,null,null,null,null,"Statusnummer:",{"$f":"IF(AR2=AQ2,AQ2,MAX(AR2:AR7))","v":-1}]
[null,"     Ein   >>>",null,null,null,null,null,null,null,null,null,null,null,null,null,null,null,null,null,null,null,null,null,null,null,null,null,null,null,null,null,null,null,null,null,null,null,null,"HatDaten:",{"$f":"AND(AP2=FALSE,OR(AP10<>3,COUNTA(D5:AH12,D20:AH35,D39:L40)>0))","v":false},"Statustext:",{"$f":"IFERROR(VLOOKUP(AP10,AR2:AS7,2,FALSE),\"unbekannt\")","v":"Nicht Relevant"},null,null,1]
[null,"<<<   Aus     ",null,null,null,null,null,null,null,null,null,null,null,null,null,null,null,null,null,null,null,null,null,null,null,null,null,null,null,null,null,null,null,null,{"$f":"IF(COUNTIF(D37:AH37,\"I\")>0,\"I\",\"\")","v":""}]
[null,{"$f":"B_PrZeit","v":"Präsenzzeit"},null,{"$f":"24*(D6-D5+D8-D7+D10-D9+D12-D11)*D88","v":0},{"$f":"24*(E6-E5+E8-E7+E10-E9+E12-E11)*E88","v":0},0,0,0,0,0,0,0,0,0,0,0,0,0,0,0,0,0,0,0,0,0,0,0,0,0,0,0,0,0,null,null,null,null,"Anzahl Regeltage:",{"$f":"D83","v":0}]
[null,{"$f":"B_TotalAZist","v":"Total Arbeitszeit (IST)"},null,{"$f":"IF(D13+D35>=D15,D13+D35,MIN(D13+D35+SUM(D20,D22,D23,D24,D25,D26,D27,D28,D29,D30,D31,D32,D33,D34),IF(D15<0,0,D15)))*D82","v":0},0,0,0,0,0,0,0,0,0,0,0,0,0,{"$f":"IF(R13+R35>=R15,R13+R35,MIN(R13+R35+SUM(R20,R22,R23,R24,R25,R26,R27,R28,R29,R30,R31,R32,R33,R34),IF(R15<0,0,R15)))*R82","v":0},{"$f":"IF(S13+S35>=S15,S13+S35,MIN(S13+S35+SUM(S20,S22,S23,S24,S25,S26,S27,S28,S29,S30,S31,S32,S33,S34),IF(S15<0,0,S15)))*S82","v":0},{"$f":"IF(T13+T35>=T15,T13+T35,MIN(T13+T35+SUM(T20,T22,T23,T24,T25,T26,T27,T28,T29,T30,T31,T32,T33,T34),IF(T15<0,0,T15)))*T82","v":0},{"$f":"IF(U13+U35>=U15,U13+U35,MIN(U13+U35+SUM(U20,U22,U23,U24,U25,U26,U27,U28,U29,U30,U31,U32,U33,U34),IF(U15<0,0,U15)))*U82","v":0},0,0,0,0,0,0,0,0,0,0,0,0,0,{"$f":"SUMIF($D$82:$AH$82,1,D14:AH14)","v":0},{"$f":"AI14-AI15","v":23.4},null,null,"Erfasste Regeltage",{"$f":"L83","v":0},{"$f":"AN13-AN14","v":0},"Fehlende Regeltage"]
[null,{"$f":"B_NettoSollAZ","v":"Netto-SOLL-Arbeitszeit"},null,{"$f":"ROUND(D16-D19,2)","v":0},{"$f":"ROUND(E16-E19,2)","v":0},0,0,0,0,0,0,0,0,0,0,0,0,0,0,0,0,0,0,0,0,0,-4.2,-8.4,-8.4,0,0,{"$f":"IF(AF$42=4,0,ROUND(AF16-AF19,2))","v":0},{"$f":"IF(AG$42=4,0,ROUND(AG16-AG19,2))","v":0},-2.4,{"$f":"SUMIF($D$82:$AH$82,1,D15:AH15)","v":-23.4},null,null,null,"Minimum Regeltage",{"$f":"MinRegeltage","v":1},"Ist als Konstante im Blatt \"Intern\" hinterlegt"]
[null,{"$f":"B_BruttoSollAZ","v":"Brutto-SOLL-Arb.zeit"},null,{"$f":"VLOOKUP(D3,VSA_Kalender,16)","v":0},0,0,0,0,0,0,0,0,0,0,0,0,0,0,0,0,0,0,0,0,0,0,0,0,0,0,0,{"$f":"IF(AF$42=4,0,VLOOKUP(AF3,VSA_Kalender,16))","v":0},{"$f":"IF(AG$42=4,0,VLOOKUP(AG3,VSA_Kalender,16))","v":0},{"$f":"IF(AH$42=4,0,VLOOKUP(AH3,VSA_Kalender,16))","v":0},null,null,null,null,"Regel ok","Mind. eigetr. Regeltage erfüllt"]
[null,{"$f":"B_MehrMinder","v":"Mehr-/Minderleistung"},null,{"$f":"(SL_BisDatum>=D3)*ROUND(D14-D15,2)","v":0},0,0,0,0,0,0,0,0,0,0,0,0,0,0,0,0,0,0,0,0,0,0,0,0,0,0,0,0,0,0,{"$f":"B_Total","v":"Total"},{"$f":"B_Vortrag","v":"Vortrag"},null,null,"Spalten ok:","Alle Einträge an Regeltagen ok"]
[null,{"$f":"B_AZSaldo","v":"AZ - Saldo"},{"$f":"VLOOKUP(ROW(),VSA_Uebertrag,$A$1+3)","v":16.8},{"$f":"IFERROR((C18+D17)*(D3<=SL_BisDatum)*VLOOKUP(D3,VSA_Kalender,21,FALSE),0)","v":0},0,0,{"$f":"IFERROR((F18+G17)*(G3<=SL_BisDatum)*VLOOKUP(G3,VSA_Kalender,21,FALSE),0)","v":0},0,0,0,0,0,0,0,0,0,0,0,0,0,0,0,0,0,0,0,0,0,0,0,0,0,0,0,null,{"$f":"SUMIF($D$82:$AH$82,1,D17:AH17)+C18","v":16.8}]
[null,{"$f":"B_FTA","v":"Feiertagsanspruch"},0,{"$f":"VLOOKUP(D3,VSA_Kalender,14)","v":0},0,0,0,0,0,0,0,0,0,0,0,0,0,0,0,0,0,0,0,0,0,0,4.2,8.4,8.4,0,0,{"$f":"IF(AF$42=4,0,VLOOKUP(AF3,VSA_Kalender,14))","v":0},{"$f":"IF(AG$42=4,0,VLOOKUP(AG3,VSA_Kalender,14))","v":0},{"$f":"IF(AH$42=4,0,VLOOKUP(AH3,VSA_Kalender,14))","v":2.4},{"$f":"SUM(D19:AH19)","v":23.4}]
[null,{"$f":"B_Ferien","v":"Ferien"},{"$f":"VLOOKUP(ROW(),VSA_Uebertrag,$A$1+3)","v":0},null,null,null,null,null,null,null,null,null,null,null,null,null,null,null,null,null,null,null,null,null,null,null,null,null,null,null,null,null,null,null,{"$f":"SUMIF($D$82:$AH$82,1,D20:AH20)","v":0},{"$f":"ROUND(C20-AI20,2)","v":0},"Rest"]
[null,{"$f":"B_KompAZ","v":"Kompensation Arbeitstage"},0,null,null,null,null,null,null,null,null,null,null,null,null,null,null,null,null,null,null,null,null,null,null,null,null,null,null,null,null,null,null,null,0,{"$f":"ROUND(A21+C21-AI21,0)","v":0}]
[null,{"$f":"B_Arzt","v":"Arztbesuch"},0,null,null,null,null,null,null,null,null,null,null,null,null,null,null,null,null,null,null,null,null,null,null,null,null,null,null,null,null,null,null,null,0,{"$f":"ROUND(A22+C22+AI22,2)","v":0},"Summen"]
[null,{"$f":"B_Krank","v":"Krankheit"},0,null,null,null,null,null,null,null,null,null,null,null,null,null,null,null,null,null,null,null,null,null,null,null,null,null,null,null,null,null,null,null,0,{"$f":"ROUND(A23+C23+AI23,2)","v":0}]
[null,{"$f":"B_BU","v":"Berufsunfall"},0,null,null,null,null,null,null,null,null,null,null,null,null,null,null,null,null,null,null,null,null,null,null,null,null,null,null,null,null,null,null,null,0,0]
[null,{"$f":"B_NBU","v":"Nichtberufsunfall"},0,null,null,null,null,null,null,null,null,null,null,null,null,null,null,null,null,null,null,null,null,null,null,null,null,null,null,null,null,null,null,null,0,0]
[null,{"$f":"B_MilZiv","v":"Militär / Zivilschutz"},0,null,null,null,null,null,null,null,null,null,null,null,null,null,null,null,null,null,null,null,null,null,null,null,null,null,null,null,null,null,null,null,0,0]
[null,{"$f":"B_UUB","v":"Unbezahlter Urlaub"},0,null,null,null,null,null,null,null,null,null,null,null,null,null,null,null,null,null,null,null,null,null,null,null,null,null,null,null,null,null,null,null,0,{"$f":"ROUND(A27+C27-AI27,2)","v":0},"Rest"]
[null,{"$f":"B_UB","v":"Bezahlter Urlaub"},0,null,null,null,null,null,null,null,null,null,null,null,null,null,null,null,null,null,null,null,null,null,null,null,null,null,null,null,null,null,null,null,0,{"$f":"ROUND(A28+C28-AI28,2)","v":0}]
[null,{"$f":"B_NebenB","v":"Nebenbeschäftigung"},0,null,null,null,null,null,null,null,null,null,null,null,null,null,null,null,null,null,null,null,null,null,null,null,null,null,null,null,null,null,null,null,0,0]
[null,{"$f":"B_DAG","v":"D A G"},0,null,null,null,null,null,null,null,null,null,null,null,null,null,null,null,null,null,null,null,null,null,null,null,null,null,null,null,null,null,null,null,0,0]
[null,{"$f":"B_Divers","v":"Diverses"},0,null,null,null,null,null,null,null,null,null,null,null,null,null,null,null,null,null,null,null,null,null,null,null,null,null,null,null,null,null,null,null,0,0,"Summen"]
[null,{"$f":"B_FamPersErg","v":"Fam./pers. Ereignisse"},0,null,null,null,null,null,null,null,null,null,null,null,null,null,null,null,null,null,null,null,null,null,null,null,null,null,null,null,null,null,null,null,0,0]
[null,{"$f":"B_FZ1","v":"freie Zeile 1"},0,null,null,null,null,null,null,null,null,null,null,null,null,null,null,null,null,null,null,null,null,null,null,null,null,null,null,null,null,null,null,null,0,0]
[null,{"$f":"B_FZ2","v":"freie Zeile 2"},0,null,null,null,null,null,null,null,null,null,null,null,null,null,null,null,null,null,null,null,null,null,null,null,null,null,null,null,null,null,null,null,0,0]
[null,{"$f":"B_WB","v":"Weiterbildung"},0,null,null,null,null,null,null,null,null,null,null,null,null,null,null,null,null,null,null,null,null,null,null,null,null,null,null,null,null,null,null,null,0,0]
[null,{"$f":"B_FEL","v":"frei einsetzbare Lekt."},0,null,null,null,null,null,null,null,null,null,null,null,null,null,null,null,null,null,null,null,null,null,null,null,null,null,null,null,null,null,null,null,{"$f":"SUM(D36:AH36)","v":0},{"$f":"ROUND(C36-AI36,0)","v":0}]
[null,null,null,{"$f":"IF(AND((D13 - D15)+SUM(D20,D22:D34)>0.00001,SUM(D20,D22:D34)>0),\"I\",\"\")","v":""},"","","","","","","","","","","","","","","","","","","","","","","","","","","","","",""]
[null,null,"Visum","Identität:",null,null,null,null,"Datum:",null,"Status:"]
[null,null,"SL"]
[null,null,"VG"]
[null,null,null,1,2,3,4,5,6,7,8,9,10,11,12,13,14,15,16,17,18,19,20,21,22,23,24,25,26,27,28,29,30,31]
[null,null,null,{"$f":"IF(D3=\"\",4,VLOOKUP(D3,VSA_Kalender,18))","v":1},0,0,0,0,0,1,1,0,0,0,0,0,1,1,0,0,0,0,0,1,1,0,0,1,1,0,1,1,0,0]
[]
[null,null,null,{"$f":"IF(D19>0,VLOOKUP(D3,KalFeiertage,6,FALSE),\"\")","v":""},"","","","","","","","","","","","","","","","","","","","","","","Heiligabend","Weihnachten","Stephanstag","","","","","Silvester"]
[null,null,null,"FT=WENN(D13+D35>=D15;D13+D35;MIN(D13+D35+SUMME(D20;D22;D23;D24;D25;D26;D27;D28;D29;D30;D31;D32;D33;D34);WENN(D15<0;0;D15)))*D82","FT=WENN(E13+E35>=E15;E13+E35;MIN(E13+E35+SUMME(E20;E22;E23;E24;E25;E26;E27;E28;E29;E30;E31;E32;E33;E34);WENN(E15<0;0;E15)))*E82","FT=WENN(F13+F35>=F15;F13+F35;MIN(F13+F35+SUMME(F20;F22;F23;F24;F25;F26;F27;F28;F29;F30;F31;F32;F33;F34);WENN(F15<0;0;F15)))*F82","FT=WENN(G13+G35>=G15;G13+G35;MIN(G13+G35+SUMME(G20;G22;G23;G24;G25;G26;G27;G28;G29;G30;G31;G32;G33;G34);WENN(G15<0;0;G15)))*G82","FT=WENN(H13+H35>=H15;H13+H35;MIN(H13+H35+SUMME(H20;H22;H23;H24;H25;H26;H27;H28;H29;H30;H31;H32;H33;H34);WENN(H15<0;0;H15)))*H82","FT=WENN(I13+I35>=I15;I13+I35;MIN(I13+I35+SUMME(I20;I22;I23;I24;I25;I26;I27;I28;I29;I30;I31;I32;I33;I34);WENN(I15<0;0;I15)))*I82","FT=WENN(J13+J35>=J15;J13+J35;MIN(J13+J35+SUMME(J20;J22;J23;J24;J25;J26;J27;J28;J29;J30;J31;J32;J33;J34);WENN(J15<0;0;J15)))*J82","FT=WENN(K13+K35>=K15;K13+K35;MIN(K13+K35+SUMME(K20;K22;K23;K24;K25;K26;K27;K28;K29;K30;K31;K32;K33;K34);WENN(K15<0;0;K15)))*K82","FT=WENN(L13+L35>=L15;L13+L35;MIN(L13+L35+SUMME(L20;L22;L23;L24;L25;L26;L27;L28;L29;L30;L31;L32;L33;L34);WENN(L15<0;0;L15)))*L82","FT=WENN(M13+M35>=M15;M13+M35;MIN(M13+M35+SUMME(M20;M22;M23;M24;M25;M26;M27;M28;M29;M30;M31;M32;M33;M34);WENN(M15<0;0;M15)))*M82","FT=WENN(N13+N35>=N15;N13+N35;MIN(N13+N35+SUMME(N20;N22;N23;N24;N25;N26;N27;N28;N29;N30;N31;N32;N33;N34);WENN(N15<0;0;N15)))*N82","FT=WENN(O13+O35>=O15;O13+O35;MIN(O13+O35+SUMME(O20;O22;O23;O24;O25;O26;O27;O28;O29;O30;O31;O32;O33;O34);WENN(O15<0;0;O15)))*O82","FT=WENN(P13+P35>=P15;P13+P35;MIN(P13+P35+SUMME(P20;P22;P23;P24;P25;P26;P27;P28;P29;P30;P31;P32;P33;P34);WENN(P15<0;0;P15)))*P82","FT=WENN(Q13+Q35>=Q15;Q13+Q35;MIN(Q13+Q35+SUMME(Q20;Q22;Q23;Q24;Q25;Q26;Q27;Q28;Q29;Q30;Q31;Q32;Q33;Q34);WENN(Q15<0;0;Q15)))*Q82","FT=WENN(R13+R35>=R15;R13+R35;MIN(R13+R35+SUMME(R20;R22;R23;R24;R25;R26;R27;R28;R29;R30;R31;R32;R33;R34);WENN(R15<0;0;R15)))*R82","FT=WENN(S13+S35>=S15;S13+S35;MIN(S13+S35+SUMME(S20;S22;S23;S24;S25;S26;S27;S28;S29;S30;S31;S32;S33;S34);WENN(S15<0;0;S15)))*S82","FT=WENN(T13+T35>=T15;T13+T35;MIN(T13+T35+SUMME(T20;T22;T23;T24;T25;T26;T27;T28;T29;T30;T31;T32;T33;T34);WENN(T15<0;0;T15)))*T82","FT=WENN(U13+U35>=U15;U13+U35;MIN(U13+U35+SUMME(U20;U22;U23;U24;U25;U26;U27;U28;U29;U30;U31;U32;U33;U34);WENN(U15<0;0;U15)))*U82","FT=WENN(V13+V35>=V15;V13+V35;MIN(V13+V35+SUMME(V20;V22;V23;V24;V25;V26;V27;V28;V29;V30;V31;V32;V33;V34);WENN(V15<0;0;V15)))*V82","FT=WENN(W13+W35>=W15;W13+W35;MIN(W13+W35+SUMME(W20;W22;W23;W24;W25;W26;W27;W28;W29;W30;W31;W32;W33;W34);WENN(W15<0;0;W15)))*W82","FT=WENN(X13+X35>=X15;X13+X35;MIN(X13+X35+SUMME(X20;X22;X23;X24;X25;X26;X27;X28;X29;X30;X31;X32;X33;X34);WENN(X15<0;0;X15)))*X82","FT=WENN(Y13+Y35>=Y15;Y13+Y35;MIN(Y13+Y35+SUMME(Y20;Y22;Y23;Y24;Y25;Y26;Y27;Y28;Y29;Y30;Y31;Y32;Y33;Y34);WENN(Y15<0;0;Y15)))*Y82","FT=WENN(Z13+Z35>=Z15;Z13+Z35;MIN(Z13+Z35+SUMME(Z20;Z22;Z23;Z24;Z25;Z26;Z27;Z28;Z29;Z30;Z31;Z32;Z33;Z34);WENN(Z15<0;0;Z15)))*Z82","FT=WENN(AA13+AA35>=AA15;AA13+AA35;MIN(AA13+AA35+SUMME(AA20;AA22;AA23;AA24;AA25;AA26;AA27;AA28;AA29;AA30;AA31;AA32;AA33;AA34);WENN(AA15<0;0;AA15)))*AA82","FT=WENN(AB13+AB35>=AB15;AB13+AB35;MIN(AB13+AB35+SUMME(AB20;AB22;AB23;AB24;AB25;AB26;AB27;AB28;AB29;AB30;AB31;AB32;AB33;AB34);WENN(AB15<0;0;AB15)))*AB82","FT=WENN(AC13+AC35>=AC15;AC13+AC35;MIN(AC13+AC35+SUMME(AC20;AC22;AC23;AC24;AC25;AC26;AC27;AC28;AC29;AC30;AC31;AC32;AC33;AC34);WENN(AC15<0;0;AC15)))*AC82","FT=WENN(AD13+AD35>=AD15;AD13+AD35;MIN(AD13+AD35+SUMME(AD20;AD22;AD23;AD24;AD25;AD26;AD27;AD28;AD29;AD30;AD31;AD32;AD33;AD34);WENN(AD15<0;0;AD15)))*AD82","FT=WENN(AE13+AE35>=AE15;AE13+AE35;MIN(AE13+AE35+SUMME(AE20;AE22;AE23;AE24;AE25;AE26;AE27;AE28;AE29;AE30;AE31;AE32;AE33;AE34);WENN(AE15<0;0;AE15)))*AE82","FT=WENN(AF13+AF35>=AF15;AF13+AF35;MIN(AF13+AF35+SUMME(AF20;AF22;AF23;AF24;AF25;AF26;AF27;AF28;AF29;AF30;AF31;AF32;AF33;AF34);WENN(AF15<0;0;AF15)))*AF82","FT=WENN(AG13+AG35>=AG15;AG13+AG35;MIN(AG13+AG35+SUMME(AG20;AG22;AG23;AG24;AG25;AG26;AG27;AG28;AG29;AG30;AG31;AG32;AG33;AG34);WENN(AG15<0;0;AG15)))*AG82","FT=WENN(AH13+AH35>=AH15;AH13+AH35;MIN(AH13+AH35+SUMME(AH20;AH22;AH23;AH24;AH25;AH26;AH27;AH28;AH29;AH30;AH31;AH32;AH33;AH34);WENN(AH15<0;0;AH15)))*AH82"]
[null,null,null,"FT=24*(D6-D5+D8-D7+D10-D9+D12-D11)*D88","FT=24*(E6-E5+E8-E7+E10-E9+E12-E11)*E88","FT=24*(F6-F5+F8-F7+F10-F9+F12-F11)*F88","FT=24*(G6-G5+G8-G7+G10-G9+G12-G11)*G88","FT=24*(H6-H5+H8-H7+H10-H9+H12-H11)*H88","FT=24*(I6-I5+I8-I7+I10-I9+I12-I11)*I88","FT=24*(J6-J5+J8-J7+J10-J9+J12-J11)*J88","FT=24*(K6-K5+K8-K7+K10-K9+K12-K11)*K88","FT=24*(L6-L5+L8-L7+L10-L9+L12-L11)*L88","FT=24*(M6-M5+M8-M7+M10-M9+M12-M11)*M88","FT=24*(N6-N5+N8-N7+N10-N9+N12-N11)*N88","FT=24*(O6-O5+O8-O7+O10-O9+O12-O11)*O88","FT=24*(P6-P5+P8-P7+P10-P9+P12-P11)*P88","FT=24*(Q6-Q5+Q8-Q7+Q10-Q9+Q12-Q11)*Q88","FT=24*(R6-R5+R8-R7+R10-R9+R12-R11)*R88","FT=24*(S6-S5+S8-S7+S10-S9+S12-S11)*S88","FT=24*(T6-T5+T8-T7+T10-T9+T12-T11)*T88","FT=24*(U6-U5+U8-U7+U10-U9+U12-U11)*U88","FT=24*(V6-V5+V8-V7+V10-V9+V12-V11)*V88","FT=24*(W6-W5+W8-W7+W10-W9+W12-W11)*W88","FT=24*(X6-X5+X8-X7+X10-X9+X12-X11)*X88","FT=24*(Y6-Y5+Y8-Y7+Y10-Y9+Y12-Y11)*Y88","FT=24*(Z6-Z5+Z8-Z7+Z10-Z9+Z12-Z11)*Z88","FT=24*(AA6-AA5+AA8-AA7+AA10-AA9+AA12-AA11)*AA88","FT=24*(AB6-AB5+AB8-AB7+AB10-AB9+AB12-AB11)*AB88","FT=24*(AC6-AC5+AC8-AC7+AC10-AC9+AC12-AC11)*AC88","FT=24*(AD6-AD5+AD8-AD7+AD10-AD9+AD12-AD11)*AD88","FT=24*(AE6-AE5+AE8-AE7+AE10-AE9+AE12-AE11)*AE88","FT=24*(AF6-AF5+AF8-AF7+AF10-AF9+AF12-AF11)*AF88","FT=24*(AG6-AG5+AG8-AG7+AG10-AG9+AG12-AG11)*AG88","FT=24*(AH6-AH5+AH8-AH7+AH10-AH9+AH12-AH11)*AH88"]
[null,null,null,"FT=ODER(D14>0;D21>0)*1","FT=ODER(E14>0;E21>0)*1","FT=ODER(F14>0;F21>0)*1","FT=ODER(G14>0;G21>0)*1","FT=ODER(H14>0;H21>0)*1","FT=ODER(I14>0;I21>0)*1","FT=ODER(J14>0;J21>0)*1","FT=ODER(K14>0;K21>0)*1","FT=ODER(L14>0;L21>0)*1","FT=ODER(M14>0;M21>0)*1","FT=ODER(N14>0;N21>0)*1","FT=ODER(O14>0;O21>0)*1","FT=ODER(P14>0;P21>0)*1","FT=ODER(Q14>0;Q21>0)*1","FT=ODER(R14>0;R21>0)*1","FT=ODER(S14>0;S21>0)*1","FT=ODER(T14>0;T21>0)*1","FT=ODER(U14>0;U21>0)*1","FT=ODER(V14>0;V21>0)*1","FT=ODER(W14>0;W21>0)*1","FT=ODER(X14>0;X21>0)*1","FT=ODER(Y14>0;Y21>0)*1","FT=ODER(Z14>0;Z21>0)*1","FT=ODER(AA14>0;AA21>0)*1","FT=ODER(AB14>0;AB21>0)*1","FT=ODER(AC14>0;AC21>0)*1","FT=ODER(AD14>0;AD21>0)*1","FT=ODER(AE14>0;AE21>0)*1","FT=ODER(AF14>0;AF21>0)*1","FT=ODER(AG14>0;AG21>0)*1","FT=ODER(AH14>0;AH21>0)*1"]
[null,null,null,{"$f":"ABS(\"FT\"&_xlfn.FORMULATEXT(D14)<>D45)","v":0},{"$f":"ABS(\"FT\"&_xlfn.FORMULATEXT(E14)<>E45)","v":0},0,0,0,0,0,0,0,0,0,0,0,0,0,0,0,0,0,0,0,0,0,0,0,0,0,0,0,0,0]
[null,null,null,{"$f":"ABS(\"FT\"&_xlfn.FORMULATEXT(D13)<>D46)","v":0},{"$f":"ABS(\"FT\"&_xlfn.FORMULATEXT(E13)<>E46)","v":0},0,0,0,0,0,0,0,0,0,0,0,0,0,0,0,0,0,0,0,0,0,0,0,0,0,0,0,0,0]
[null,null,null,{"$f":"ABS(\"FT\"&_xlfn.FORMULATEXT(D80)<>D47)","v":0},{"$f":"ABS(\"FT\"&_xlfn.FORMULATEXT(E80)<>E47)","v":0},0,0,0,0,0,0,0,0,0,0,0,0,0,0,0,0,0,0,0,0,0,0,0,0,0,0,0,0,0]
[null,null,null,{"$f":"ABS(ISERROR(D37))","v":0},{"$f":"ABS(ISERROR(E37))","v":0},0,0,0,0,0,0,0,0,0,0,0,0,0,0,0,0,0,0,0,0,0,0,0,0,0,0,0,0,0]
[null,null,null,{"$f":"SUM(D48:D51)","v":0},{"$f":"SUM(E48:E51)","v":0},0,0,0,0,0,0,0,0,0,0,0,0,0,0,0,0,0,0,0,0,0,0,0,0,0,0,0,0,0,null,null,null,null,"Formel defekt",{"$f":"SUM(D52:AH52)","v":0}]
[]
[]
[]
[]
[]
[]
[]
[]
[]
[]
[]
[]
[]
[]
[]
[]
[]
[]
[]
[]
[]
[]
[]
[]
[null,"HT_Naz-Kopie",{"$f":"HT_NAZ","v":8.4}]
[null,"Heute:",{"$f":"SL_BisDatum","v":"2024-02-02"}]
[null,null,"Reguläre Tage ausgefüllt",{"$f":"((D80*D81)=1)*1","v":0},{"$f":"((E80*E81)=1)*1","v":0},0,0,0,0,0,0,0,0,0,0,0,0,0,0,0,0,0,0,0,0,0,0,0,0,0,0,0,0,0]
[null,null,"Arbeitstage ausgefüllt",{"$f":"OR(D14>0,D21>0)*1","v":0},{"$f":"OR(E14>0,E21>0)*1","v":0},0,0,0,0,0,0,0,0,0,0,0,0,0,0,0,0,0,0,0,0,0,0,0,0,0,0,0,0,0]
[null,null,"Arbeitstage wenn BG>0%",{"$f":"IFERROR(VLOOKUP(D3,VSA_Kalender,22),0)","v":0},0,0,0,0,0,0,0,0,0,0,0,0,0,0,0,0,0,0,0,0,0,0,0,0,0,0,0,0,0,0]
[null,null,"Der BG beträgt mehr als 0%",{"$f":"IF(D4=\"\",0,ABS(VLOOKUP(D3,VSA_Kalender,13,FALSE)>0))","v":1},1,1,1,1,1,1,1,1,1,1,1,1,1,1,1,1,1,1,1,1,1,1,1,1,1,1,1,1,1,1]
[null,null,"(Ja: 1, Nein: 0)",{"$f":"SUM(D81:AH81)","v":0},"Total Tage bei BG>0%",null,null,{"$f":"SUM(D80:AH80)","v":0},"Total Tage ausgefüllt",null,null,{"$f":"SUM(D79:AH79)","v":0},"Total reguläre Tage ausgefüllt"]
[]
[null,null,"Tag des Monats",{"$f":"D4","v":1},2,3,4,5,6,7,8,9,10,11,12,13,14,15,16,17,18,19,20,21,22,23,24,25,26,27,28,29,30,31]
[null,null,"Ist Arbeitsbereich",{"$f":"IFERROR(ABS(WEEKDAY(D3,2)<6),0)","v":0},1,1,1,1,1,0,0,1,1,1,1,1,0,0,1,1,1,1,1,0,0,1,1,1,1,1,0,0,1,1]
[null,null,"Maximaler Fehler",{"$f":"MAX(D100:D107,D98,D134)","v":0},{"$f":"MAX(E100:E107,E98,E134)","v":0},0,0,0,0,0,0,0,0,0,0,0,0,0,0,0,0,0,0,0,0,0,0,0,0,0,0,0,0,0]
[null,null,"Wird die Präsenzzeit angezeigt?",{"$f":"IF(D87=0,1,0)","v":1},{"$f":"IF(E87=0,1,0)","v":1},1,1,1,1,1,1,1,1,1,1,1,1,1,1,1,1,1,1,1,1,1,1,1,1,1,1,1,1,1]
[]
[null,null,"Gruppenfehler 1",{"$f":"IF(AND(D6-D5=0,COUNTA(D7:D12)>0),1,0)","v":0},0,0,0,0,0,0,0,0,0,0,0,0,0,0,0,0,0,0,0,0,0,0,0,0,0,0,0,0,0,0]
[null,"Gruppenfehler","(aus)",{"$f":"D90","v":0},0,0,0,0,0,0,0,0,0,0,0,0,0,0,0,0,0,0,0,0,0,0,0,0,0,0,0,0,0,0]
[null,null,"Gruppenfehler 2",{"$f":"IF(AND(D8-D7=0,COUNTA(D9:D12)>0),1,0)","v":0},0,0,0,0,0,0,0,0,0,0,0,0,0,0,0,0,0,0,0,0,0,0,0,0,0,0,0,0,0,0]
[null,null,"(aus)",{"$f":"D92","v":0},0,0,0,0,0,0,0,0,0,0,0,0,0,0,0,0,0,0,0,0,0,0,0,0,0,0,0,0,0,0]
[null,null,"Gruppenfehler 3",{"$f":"IF(AND(D10-D9=0,COUNTA(D11:D12)>0),1,0)","v":0},0,0,0,0,0,0,0,0,0,0,0,0,0,0,0,0,0,0,0,0,0,0,0,0,0,0,0,0,0,0]
[null,null,"(aus)",{"$f":"D94","v":0},0,0,0,0,0,0,0,0,0,0,0,0,0,0,0,0,0,0,0,0,0,0,0,0,0,0,0,0,0,0]
[null,null,"leer"]
[null,null,"leer"]
[null,null,"Genereller Gruppenfehler",{"$f":"MAX(D90:D95)","v":0},0,0,0,0,0,0,0,0,0,0,0,0,0,0,0,0,0,0,0,0,0,0,0,0,0,0,0,0,0,0]
[]
[null,null,"Ein1",{"$f":"IF(AND(D109=0,D110>0),1,0)","v":0},{"$f":"IF(AND(E109=0,E110>0),1,0)","v":0},0,0,0,0,0,0,0,0,0,0,0,0,0,0,0,0,0,0,0,0,0,0,0,0,0,0,0,0,0]
[null,null,"Aus1",{"$f":"IF(AND(D110>0,D110<D109),3,IF(AND(D109>0,D110=0),1,0))*D$86","v":0},{"$f":"IF(AND(E110>0,E110<E109),3,IF(AND(E109>0,E110=0),1,0))*E$86","v":0},0,0,0,0,0,0,0,0,0,0,0,0,0,0,0,0,0,0,0,0,0,0,0,0,0,0,0,0,0]
[null,null,"Ein2",{"$f":"IF(AND(D111>0,D111<D110),3,IF(AND(D111=0,D112>0),1,0))*D$86","v":0},0,0,0,0,0,0,0,0,0,0,0,0,0,0,0,0,0,0,0,0,0,0,0,0,0,0,0,0,0,0]
[null,null,"Aus2",{"$f":"IF(AND(D112>0,D112<D111),3,IF(AND(D111>0,D112=0),1,0))*D$86","v":0},{"$f":"IF(AND(E112>0,E112<E111),3,IF(AND(E111>0,E112=0),1,0))*E$86","v":0},0,0,0,0,0,0,0,0,0,0,0,0,0,0,0,0,0,0,0,0,0,0,0,0,0,0,0,0,0]
[null,"Zellenfehler","Ein3",{"$f":"IF(AND(D113>0,D113<D112),3,IF(AND(D113=0,D114>0),1,0))*D$86","v":0},{"$f":"IF(AND(E113>0,E113<E112),3,IF(AND(E113=0,E114>0),1,0))*E$86","v":0},0,0,0,0,0,0,0,0,0,0,0,0,0,0,0,0,0,0,0,0,0,0,0,0,0,0,0,0,0]
[null,null,"Aus3",{"$f":"IF(AND(D114>0,D114<D113),3,IF(AND(D113>0,D114=0),1,0))*D$86","v":0},{"$f":"IF(AND(E114>0,E114<E113),3,IF(AND(E113>0,E114=0),1,0))*E$86","v":0},0,0,0,0,0,0,0,0,0,0,0,0,0,0,0,0,0,0,0,0,0,0,0,0,0,0,0,0,0]
[null,null,"Ein4",{"$f":"IF(AND(D115>0,D115<D114),3,IF(AND(D115=0,D116>0),1,0))*D$86","v":0},{"$f":"IF(AND(E115>0,E115<E114),3,IF(AND(E115=0,E116>0),1,0))*E$86","v":0},0,0,0,0,0,0,0,0,0,0,0,0,0,0,0,0,0,0,0,0,0,0,0,0,0,0,0,0,0]
[null,null,"Aus4",{"$f":"IF(AND(D116>0,D116<D115),3,IF(AND(D115>0,D116=0),1,0))*D$86","v":0},{"$f":"IF(AND(E116>0,E116<E115),3,IF(AND(E115>0,E116=0),1,0))*E$86","v":0},0,0,0,0,0,0,0,0,0,0,0,0,0,0,0,0,0,0,0,0,0,0,0,0,0,0,0,0,0]
[]
[null,null,"Ein1",{"$f":"ROUND(D5*24,2)","v":0},0,0,0,0,0,0,0,0,0,0,0,0,0,0,0,0,0,0,0,0,0,0,0,0,0,0,0,0,0,0]
[null,null,"Aus1",0,0,0,0,0,0,0,0,0,0,0,0,0,0,0,0,0,0,0,0,0,0,0,0,0,0,0,0,0,0,0]
[null,"Zeiten dezimal gewandelt","Ein2",0,0,0,0,0,0,0,0,0,0,0,0,0,0,0,0,0,0,0,0,0,0,0,0,0,0,0,0,0,0,0]
[null,null,"Aus2",0,0,0,0,0,0,0,0,0,0,0,0,0,0,0,0,0,0,0,0,0,0,0,0,0,0,0,0,0,0,0]
[null,null,"Ein3",0,0,0,0,0,0,0,0,0,0,0,0,0,0,0,0,0,0,0,0,0,0,0,0,0,0,0,0,0,0,0]
[null,null,"Aus3",0,0,0,0,0,0,0,0,0,0,0,0,0,0,0,0,0,0,0,0,0,0,0,0,0,0,0,0,0,0,0]
[null,null,"Ein4",0,0,0,0,0,0,0,0,0,0,0,0,0,0,0,0,0,0,0,0,0,0,0,0,0,0,0,0,0,0,0]
[null,null,"Aus4",0,0,0,0,0,0,0,0,0,0,0,0,0,0,0,0,0,0,0,0,0,0,0,0,0,0,0,0,0,0,0]
[]
[null,"Pausenfehler","Gruppe1",{"$f":"IF(OR(D109=\"\",D110=\"\"),0,D110-D109)","v":0},{"$f":"IF(OR(E109=\"\",E110=\"\"),0,E110-E109)","v":0},0,0,0,0,0,0,0,0,0,0,0,0,0,0,0,{"$f":"IF(OR(U109=\"\",U110=\"\"),0,U110-U109)","v":0},{"$f":"IF(OR(V109=\"\",V110=\"\"),0,V110-V109)","v":0},0,0,0,0,0,0,0,0,0,0,0,0]
[null,null,"Gruppe2",{"$f":"IF(OR(D111=\"\",D112=\"\"),0,D112-D111)","v":0},{"$f":"IF(OR(E111=\"\",E112=\"\"),0,E112-E111)","v":0},0,0,0,0,0,0,0,0,0,0,0,0,0,0,0,{"$f":"IF(OR(U111=\"\",U112=\"\"),0,U112-U111)","v":0},{"$f":"IF(OR(V111=\"\",V112=\"\"),0,V112-V111)","v":0},0,0,0,0,0,0,0,0,0,0,0,0]
[null,null,"Gruppe3",{"$f":"IF(OR(D113=\"\",D114=\"\"),0,D114-D113)","v":0},{"$f":"IF(OR(E113=\"\",E114=\"\"),0,E114-E113)","v":0},0,0,0,0,0,0,0,0,0,0,0,0,0,0,0,{"$f":"IF(OR(U113=\"\",U114=\"\"),0,U114-U113)","v":0},{"$f":"IF(OR(V113=\"\",V114=\"\"),0,V114-V113)","v":0},0,0,0,0,0,0,0,0,0,0,0,0]
[null,null,"Gruppe4",{"$f":"IF(OR(D115=\"\",D116=\"\"),0,D116-D115)","v":0},{"$f":"IF(OR(E115=\"\",E116=\"\"),0,E116-E115)","v":0},0,0,0,0,0,0,0,0,0,0,0,0,0,0,0,{"$f":"IF(OR(U115=\"\",U116=\"\"),0,U116-U115)","v":0},{"$f":"IF(OR(V115=\"\",V116=\"\"),0,V116-V115)","v":0},0,0,0,0,0,0,0,0,0,0,0,0]
[]
[null,null,"Pause12",{"$f":"IF(OR(D110=\"\",D111=\"\"),0,D111-D110)","v":0},{"$f":"IF(OR(E110=\"\",E111=\"\"),0,E111-E110)","v":0},0,0,0,0,0,0,0,0,0,0,0,0,0,0,0,{"$f":"IF(OR(U110=\"\",U111=\"\"),0,U111-U110)","v":0},{"$f":"IF(OR(V110=\"\",V111=\"\"),0,V111-V110)","v":0},0,0,0,0,0,0,0,0,0,0,0,0]
[null,null,"Pause23",{"$f":"IF(OR(D112=\"\",D113=\"\"),0,D113-D112)","v":0},{"$f":"IF(OR(E112=\"\",E113=\"\"),0,E113-E112)","v":0},0,0,0,0,0,0,0,0,0,0,0,0,0,0,0,{"$f":"IF(OR(U112=\"\",U113=\"\"),0,U113-U112)","v":0},{"$f":"IF(OR(V112=\"\",V113=\"\"),0,V113-V112)","v":0},0,0,0,0,0,0,0,0,0,0,0,0]
[null,null,"Pause34",{"$f":"IF(OR(D114=\"\",D115=\"\"),0,D115-D114)","v":0},{"$f":"IF(OR(E114=\"\",E115=\"\"),0,E115-E114)","v":0},0,0,0,0,0,0,0,0,0,0,0,0,0,0,0,{"$f":"IF(OR(U114=\"\",U115=\"\"),0,U115-U114)","v":0},{"$f":"IF(OR(V114=\"\",V115=\"\"),0,V115-V114)","v":0},0,0,0,0,0,0,0,0,0,0,0,0]
[]
[null,null,"Kum12",{"$f":"IF(D123>=0.5,0,D118+D119)","v":0},{"$f":"IF(E123>=0.5,0,E118+E119)","v":0},0,0,0,0,0,0,0,0,0,0,0,0,0,0,0,{"$f":"IF(U123>=0.5,0,U118+U119)","v":0},{"$f":"IF(V123>=0.5,0,V118+V119)","v":0},0,0,0,0,0,0,0,0,0,0,0,0]
[null,null,"Kum123",{"$f":"IF(OR(D123>=0.5,D124>=0.5),0,D118+D119+D120)","v":0},{"$f":"IF(OR(E123>=0.5,E124>=0.5),0,E118+E119+E120)","v":0},0,0,0,0,0,0,0,0,0,0,0,0,0,0,0,{"$f":"IF(OR(U123>=0.5,U124>=0.5),0,U118+U119+U120)","v":0},{"$f":"IF(OR(V123>=0.5,V124>=0.5),0,V118+V119+V120)","v":0},0,0,0,0,0,0,0,0,0,0,0,0]
[null,null,"Kum1234",{"$f":"IF(OR(D123>=0.5,D124>=0.5,D125>=0.5),0,D118+D119+D120+D121)","v":0},{"$f":"IF(OR(E123>=0.5,E124>=0.5,E125>=0.5),0,E118+E119+E120+E121)","v":0},0,0,0,0,0,0,0,0,0,0,0,0,0,0,0,{"$f":"IF(OR(U123>=0.5,U124>=0.5,U125>=0.5),0,U118+U119+U120+U121)","v":0},{"$f":"IF(OR(V123>=0.5,V124>=0.5,V125>=0.5),0,V118+V119+V120+V121)","v":0},0,0,0,0,0,0,0,0,0,0,0,0]
[null,null,"Kum23",{"$f":"IF(D124>=0.5,0,D119+D120)","v":0},{"$f":"IF(E124>=0.5,0,E119+E120)","v":0},0,0,0,0,0,0,0,0,0,0,0,0,0,0,0,{"$f":"IF(U124>=0.5,0,U119+U120)","v":0},{"$f":"IF(V124>=0.5,0,V119+V120)","v":0},0,0,0,0,0,0,0,0,0,0,0,0]
[null,null,"Kum234",{"$f":"IF(OR(D124>=0.5,D125>=0.5),0,D119+D120+D121)","v":0},{"$f":"IF(OR(E124>=0.5,E125>=0.5),0,E119+E120+E121)","v":0},0,0,0,0,0,0,0,0,0,0,0,0,0,0,0,{"$f":"IF(OR(U124>=0.5,U125>=0.5),0,U119+U120+U121)","v":0},{"$f":"IF(OR(V124>=0.5,V125>=0.5),0,V119+V120+V121)","v":0},0,0,0,0,0,0,0,0,0,0,0,0]
[null,null,"Kum34",{"$f":"IF(D125>=0.5,0,D120+D121)","v":0},{"$f":"IF(E125>=0.5,0,E120+E121)","v":0},0,0,0,0,0,0,0,0,0,0,0,0,0,0,0,{"$f":"IF(U125>=0.5,0,U120+U121)","v":0},{"$f":"IF(V125>=0.5,0,V120+V121)","v":0},0,0,0,0,0,0,0,0,0,0,0,0]
[]
[null,null,"Pausenfehler-Code",{"$f":"IF(MAX(D118:D121,D127:D132)>6,2,0)","v":0},{"$f":"IF(MAX(E118:E121,E127:E132)>6,2,0)","v":0},0,0,0,0,0,0,0,0,0,0,0,0,0,0,0,0,0,0,0,0,0,0,0,0,0,0,0,0,0]

{"sheet":"Jahresabrechnung","index":18,"n_rows":102,"n_cols":45,"rows_kept":102,"cut":false,"hidden":false,"merged":[[0,13,0,18],[0,4,0,11],[1,4,1,11],[0,22,0,24]]}
[null,"Jahr:",{"$f":"SL_Jahr","v":2024},"Gde:",{"$f":"SL_Gemeinde","v":0},null,null,null,null,null,null,null,"Schule:",{"$f":"SL_Schule","v":0},null,null,null,null,null,null,null,null,{"$f":"Zerf_Version & \" \" & Zerf_T","v":"Version VSA 1.06 "}]
[null,"BG: % Durchschn.",{"$f":"SL_BG_Durch","v":100},"Name:",{"$f":"SL_Name","v":0},null,null,null,null,null,null,null,null,null,null,null,null,null,null,null,null,null,null,null,null,null,null,null,null,null,null,null,null,null,null,null,null,null,"Abschluss-Teilbedingungen:",null,"Nicht Relevant",false,-1,{"$f":"IF(AP2=TRUE,AQ2,0)","v":0},"Nicht Relevant"]
[null,null,20,21,1,22,23,24,25,26,27,28,29,30,31,32,33,34,35,1,18,15,14,null,null,null,null,null,null,null,null,null,null,null,null,null,null,null,null,null,"Entsperrt",false,1,0,"Entsperrt"]
[null,{"$f":"IF(BEZUGFAILURE=TRUE(),\"VSA-Modus!\",\"\")","v":""},{"$f":"B_Ferien","v":"Ferien"},{"$f":"B_KompAZ","v":"Kompensation Arbeitstage"},null,{"$f":"B_Arzt","v":"Arztbesuch"},{"$f":"B_Krank","v":"Krankheit"},{"$f":"B_BU","v":"Berufsunfall"},{"$f":"B_NBU","v":"Nichtberufsunfall"},{"$f":"B_MilZiv","v":"Militär / Zivilschutz"},{"$f":"B_UUB","v":"Unbezahlter Urlaub"},{"$f":"B_UB","v":"Bezahlter Urlaub"},{"$f":"B_NebenB","v":"Nebenbeschäftigung"},{"$f":"B_DAG","v":"D A G"},{"$f":"B_Divers","v":"Diverses"},{"$f":"B_FamPersErg","v":"Fam./pers. Ereignisse"},{"$f":"B_FZ1","v":"freie Zeile 1"},{"$f":"B_FZ2","v":"freie Zeile 2"},{"$f":"B_WB","v":"Weiterbildung"},null,{"$f":"B_AZSaldo","v":"AZ - Saldo"},{"$f":"B_NettoSollAZ","v":"Netto-SOLL-Arbeitszeit"},{"$f":"B_TotalAZist","v":"Total Arbeitszeit (IST)"},"+/- Soll/Ist","Jahresarbeitszeit kumuliert",null,null,null,null,null,null,null,null,null,null,null,null,null,"Vorherige",{"$f":"INDEX(BlattKontrolle,14,8)=TRUE()","v":false},"Geändert",false,2,0,"Geändert"]
[null,null,null,null,null,null,null,null,null,null,null,null,null,null,null,null,null,null,null,null,null,null,null,null,null,null,null,null,null,null,null,null,null,null,null,null,null,null,null,null,"Sperre",{"$f":"AS11=2","v":true},3,{"$f":"NOT(AN4)*AQ5","v":3},"Warten"]
[null,"Jahresanspruch\ntotal",{"$f":"Basisblatt!H26","v":0},{"$f":"Basisblatt!H30","v":0},null,null,null,null,null,null,{"$f":"Basisblatt!H28","v":0},{"$f":"Basisblatt!H29","v":0},{"$f":"VLOOKUP(M3,VSA_Uebertrag,3)","v":0},{"$f":"Basisblatt!H27","v":0},null,null,null,null,null,null,{"$f":"Basisblatt!H25","v":0},null,null,null,{"$f":"V21","v":-103.8},null,{"$f":"Y6","v":-103.8},null,null,null,null,null,null,null,null,null,null,null,null,null,"Abschliessbar 1",{"$f":"AN4","v":false},4,{"$f":"AP6*AQ6","v":0},"Abschliessbar 1"]
[1,"Januar",{"$f":"VLOOKUP(C$3,VSA_Summen,$A7+2)","v":0},0,null,0,0,0,0,0,0,0,{"$f":"VLOOKUP(M$3,VSA_Summen,$A7+2)","v":0},0,0,0,0,0,0,null,16.8,-16.8,0,{"$f":"IF(W7=0,0,W7-V7)","v":0},{"$f":"IF(AA7=AA6,0,AA7)","v":0},null,{"$f":"$Y$6-SUM($W$7:W7)","v":-103.8},null,null,null,null,null,null,null,null,null,null,null,null,null,"Abgeschlossen",false,5,{"$f":"AND(NOT(OR(AP3,AP4)),AP7)*AQ7","v":0},"Abgeschlossen"]
[2,"Februar",0,0,null,0,0,0,0,0,0,0,0,0,0,0,0,0,0,null,16.8,-8.4,0,0,{"$f":"IF(AA8=AA7,0,AA8)","v":0},null,{"$f":"$Y$6-SUM($W$7:W8)","v":-103.8}]
[3,"März",0,0,null,0,0,0,0,0,0,0,0,0,0,0,0,0,0,null,16.8,-10.8,0,0,{"$f":"IF(AA9=AA8,0,AA9)","v":0},null,{"$f":"$Y$6-SUM($W$7:W9)","v":-103.8}]
[4,"April",0,0,null,0,0,0,0,0,0,0,0,0,0,0,0,0,0,null,16.8,-8.4,0,0,0,null,{"$f":"$Y$6-SUM($W$7:W10)","v":-103.8},null,null,null,null,null,null,null,null,null,null,null,null,null,"Statusnummer:",{"$f":"IF(AR2=AQ2,AQ2,MAX(AR2:AR7))","v":3}]
[5,"Mai",0,0,null,0,0,0,0,0,0,0,0,0,0,0,0,0,0,null,16.8,-27.6,0,0,0,null,{"$f":"$Y$6-SUM($W$7:W11)","v":-103.8},null,null,null,null,null,null,null,null,null,null,null,"HatDaten:",{"$f":"COUNTA(D27:L28)>0","v":false},"Statustext:",{"$f":"IFERROR(VLOOKUP(AP10,AR2:AS7,2,FALSE),\"unbekannt\")","v":"Warten"},null,null,2]
[6,"Juni",0,0,null,0,0,0,0,0,0,0,0,0,0,0,0,0,0,null,16.8,0,0,0,0,null,{"$f":"$Y$6-SUM($W$7:W12)","v":-103.8}]
[7,"Juli",0,0,null,0,0,0,0,0,0,0,0,0,0,0,0,0,0,null,16.8,0,0,0,0,null,{"$f":"$Y$6-SUM($W$7:W13)","v":-103.8}]
[8,"August",0,0,null,0,0,0,0,0,0,0,0,0,0,0,0,0,0,null,16.8,-8.4,0,0,0,null,{"$f":"$Y$6-SUM($W$7:W14)","v":-103.8}]
[9,"September",0,0,null,0,0,0,0,0,0,0,0,0,0,0,0,0,0,null,16.8,0,0,0,0,null,{"$f":"$Y$6-SUM($W$7:W15)","v":-103.8}]
[10,"Oktober",0,0,null,0,0,0,0,0,0,0,0,0,0,0,0,0,0,null,16.8,0,0,0,0,null,{"$f":"$Y$6-SUM($W$7:W16)","v":-103.8}]
[11,"November",0,0,null,0,0,0,0,0,0,0,0,0,0,0,0,0,0,null,16.8,0,0,0,0,null,{"$f":"$Y$6-SUM($W$7:W17)","v":-103.8}]
[12,"Dezember",0,0,null,0,0,0,0,0,0,0,0,0,0,0,0,0,0,null,16.8,-23.4,0,0,0,null,{"$f":"$Y$6-SUM($W$7:W18)","v":-103.8}]
[null,"gerundet auf 1/100",{"$f":"ROUND(SUM(C7:C18),2)","v":0},0,null,0,0,0,0,0,0,0,{"$f":"ROUND(SUM(M7:M18),2)","v":0},0,0,0,0,0,0,null,null,{"$f":"ROUND(SUM(V7:V18),2)","v":-103.8},{"$f":"ROUND(SUM(W7:W18),2)","v":0}]
[null,"Summe",null,null,null,{"$f":"F19","v":0},0,0,0,0,0,0,{"$f":"M19","v":0},{"$f":"N19","v":0},{"$f":"O19","v":0},{"$f":"P19","v":0},{"$f":"Q19","v":0},0,0,null,null,null,null,null,null,null,"Vorjahrüberträge von dieser Zeile!!"]
[null,"Rest",{"$f":"C6-C19","v":0},{"$f":"D6-D19","v":0},null,null,null,null,null,null,null,{"$f":"L6-L19","v":0},{"$f":"M6-M19","v":0},0,null,null,null,null,null,null,{"$f":"U18","v":16.8},{"$f":"V19","v":-103.8},{"$f":"W19","v":0}]
[null,"Plus - Korrektur",null,null,null,"Diese beiden Zeilen sind"]
[null,"Minus - Korrektur",null,null,null,"\"Altlasten\" !!!"]
[null,"ÜBERTRAG AUFS NEUE JAHR",{"$f":"C21","v":0},null,null,null,null,null,null,null,null,{"$f":"L21","v":0},null,{"$f":"N21","v":0},null,null,null,null,null,null,{"$f":"U21","v":16.8}]
[]
[null,null,"Visum","Identität:",null,null,null,null,"Datum:",null,"Status:"]
[null,null,"SL"]
[null,null,"VG"]
[]
[]
[]
[]
[]
[]
[]
[]
[]
[]
[]
[]
[]
[]
[]
[]
[]
[]
[]
[]
[]
[]
[]
[]
[]
[]
[]
[]
[]
[]
[]
[]
[]
[]
[]
[]
[]
[]
[]
[]
[]
[]
[]
[]
[]
[]
[]
[]
[]
[]
[]
[]
[]
[]
[]
[]
[]
[]
[]
[]
[]
[]
[]
[]
[]
[]
[]
[]
[]
[]
[]
[]
[]
[null,"korrigiert"]

{"sheet":"Kalender","index":19,"n_rows":374,"n_cols":26,"rows_kept":374,"cut":false,"hidden":true,"merged":[[0,24,3,24],[0,25,3,27],[3,9,3,10],[0,16,0,18],[0,0,1,0],[3,1,3,2],[0,19,3,23],[2,0,4,0]]}
[null,"Kalender für das Jahr:",null,null,null,{"$f":"SL_Jahr","v":2024},null,null,null,null,null,null,null,null,null,null,{"$f":"Zerf_Version & \" \" & Zerf_T","v":"Version VSA 1.06 "},null,null,"Spalte T:\nBerechnet den Abzug in Std. je nach Bezirk und lokalem Feiertag 1:ZH / 2:ZH ausserhalb",null,null,null,null,null,"<< Testbezirk Code \nMuss leer sein bei der scharfen Datei!"]
[null,"Norm-Arbeitszeit",null,null,8.4,"Std./Tag","Tage ohne Wochenenden:",{"$f":"COUNTIF(D7:D372,\"<6\")","v":262},">> ergibt Stunden:",{"$f":"H2*HT_NAZ","v":2200.8000000000002}]
["Differenz zum 1.1.",1,2,3,4,5,6,7,8,9,10,11,12,13,14,15,16,17,18]
[null,"Summen:",null,null,{"$f":"SUM(E7:E372)","v":2097.0000000000091},null,null,null,null,"Korrekturen",null,{"$f":"SUM(L7:L372)","v":103.80000000000003},null,null,{"$f":"SUM(O7:O372)","v":103.80000000000003}]
[null,"Datum","Tag","Tag (Nr.)","Arbeitszeit 100%","Arbeitszeit an Feiertagen 100%","Bezeichnung",{"$f":"\"Allgemeine Feiertage: \"&COUNTA(H7:H372)","v":"Allgemeine Feiertage: 14"},{"$f":"\"Lokale Feiertage: \"&COUNTA(I7:I372)","v":"Lokale Feiertage: 3"},"Bezeichnung","h","Feiertags-Anspruch bei 100%","Feiertags-Saldo bei 100%","Beschäf-tigungs-grad \nBG (%)","Feiertags-Anspruch nach BG","Saldo nach BG","Regel-arbeitszeit (h)","Regel-arbeitszeit effektiv (h)","Format-Code",{"$f":"IF(ISBLANK(Y1),BezCode,Y1)","v":2},"Gültige Zeile aus Basisblatt-Regel-arbeitszeit","Regel-\narbeits-\nzeit gültig","22:\nIst AT"]
[null,null,null,null,null,null,null,null,null,null,null,null,0,null,null,0]
[0,{"$f":"DATE(SL_Jahr,1,1)","v":"2024-01-01"},{"$f":"B7","v":"2024-01-01"},{"$f":"WEEKDAY(B7,2)","v":1},{"$f":"IF(G7=\"   Wochenende\",0,IF(G7=\"   Arbeitstag\",HT_NAZ,IF(ISBLANK(F7),HT_NAZ-T7,F7)))","v":0},0,{"$f":"IF(ISBLANK(I7),IF(ISBLANK(H7),IF(D7<6,\"   Arbeitstag\",\"   Wochenende\"),H7),I7)","v":"Neujahr"},"Neujahr",null,null,null,{"$f":"(HT_NAZ-E7)*(D7<6)+K7","v":8.4},{"$f":"M6+L7","v":8.4},{"$f":"VLOOKUP(B7,BGhelp,2)/100","v":1},{"$f":"ROUND(L7*N7,2)","v":8.4},{"$f":"IF(L7=0,0,(HT_NAZ-F7)*N7-Q7)","v":8.4},{"$f":"INDEX(Raz,U7,D7+2)","v":0},{"$f":"MIN(Q7,F7)","v":0},{"$f":"OR(E7=0,D7>5)*1","v":1},{"$f":"IF(AND(BezCode2=1,OR(G7=INDEX(LocFT,1,2),G7=INDEX(LocFT,2,2))),HT_NAZ/2,\nIF(AND(BezCode2=2,G7=INDEX(LocFT,3,2)),HT_NAZ,0))","v":0},{"$f":"VLOOKUP(B7,BGhelp,3)","v":1},{"$f":"ABS(Q7<=HT_NAZ)","v":1},{"$f":"((R7-T7)>0)*1","v":0}]
[1,{"$f":"$B$7+A8","v":"2024-01-02"},{"$f":"B8","v":"2024-01-02"},{"$f":"WEEKDAY(B8,2)","v":2},0,0,{"$f":"IF(ISBLANK(I8),IF(ISBLANK(H8),IF(D8<6,\"   Arbeitstag\",\"   Wochenende\"),H8),I8)","v":"Berchtoldstag"},"Berchtoldstag",null,null,null,{"$f":"(HT_NAZ-E8)*(D8<6)+K8","v":8.4},{"$f":"M7+L8","v":16.8},1,{"$f":"ROUND(L8*N8,2)","v":8.4},{"$f":"IF(L8=0,0,(HT_NAZ-F8)*N8-Q8)","v":8.4},0,{"$f":"MIN(Q8,F8)","v":0},{"$f":"OR(E8=0,D8>5)*1","v":1},0,1,1,0]
[2,{"$f":"$B$7+A9","v":"2024-01-03"},"2024-01-03",3,8.4,null,"   Arbeitstag",null,null,null,null,0,{"$f":"M8+L9","v":16.8},1,0,0,0,0,0,0,1,1,0]
[3,"2024-01-04","2024-01-04",4,8.4,null,"   Arbeitstag",null,null,null,null,0,16.8,1,0,0,0,0,0,0,1,1,0]
[4,"2024-01-05","2024-01-05",5,8.4,null,"   Arbeitstag",null,null,null,null,0,16.8,1,0,0,0,0,0,0,1,1,0]
[5,"2024-01-06","2024-01-06",6,0,null,"   Wochenende",null,null,null,null,0,16.8,1,0,0,0,0,1,0,1,1,0]
[6,"2024-01-07","2024-01-07",7,0,null,"   Wochenende",null,null,null,null,0,16.8,1,0,0,0,0,1,0,1,1,0]
[7,"2024-01-08","2024-01-08",1,8.4,null,"   Arbeitstag",null,null,null,null,0,16.8,1,0,0,0,0,0,0,1,1,0]
[8,"2024-01-09","2024-01-09",2,8.4,null,"   Arbeitstag",null,null,null,null,0,16.8,1,0,0,0,0,0,0,1,1,0]
[9,"2024-01-10","2024-01-10",3,8.4,null,"   Arbeitstag",null,null,null,null,0,16.8,1,0,0,0,0,0,0,1,1,0]
[10,"2024-01-11","2024-01-11",4,8.4,null,"   Arbeitstag",null,null,null,null,0,16.8,1,0,0,0,0,0,0,1,1,0]
[11,"2024-01-12","2024-01-12",5,8.4,null,"   Arbeitstag",null,null,null,null,0,16.8,1,0,0,0,0,0,0,1,1,0]
[12,"2024-01-13","2024-01-13",6,0,null,"   Wochenende",null,null,null,null,0,16.8,1,0,0,0,0,1,0,1,1,0]
[13,"2024-01-14","2024-01-14",7,0,null,"   Wochenende",null,null,null,null,0,16.8,1,0,0,0,0,1,0,1,1,0]
[14,"2024-01-15","2024-01-15",1,8.4,null,"   Arbeitstag",null,null,null,null,0,16.8,1,0,0,0,0,0,0,1,1,0]
[15,"2024-01-16","2024-01-16",2,8.4,null,"   Arbeitstag",null,null,null,null,0,16.8,1,0,0,0,0,0,0,1,1,0]
[16,"2024-01-17","2024-01-17",3,8.4,null,"   Arbeitstag",null,null,null,null,0,16.8,1,0,0,0,0,0,0,1,1,0]
[17,"2024-01-18","2024-01-18",4,8.4,null,"   Arbeitstag",null,null,null,null,0,16.8,1,0,0,0,0,0,0,1,1,0]
[18,"2024-01-19","2024-01-19",5,8.4,null,"   Arbeitstag",null,null,null,null,0,16.8,1,0,0,0,0,0,0,1,1,0]
[19,"2024-01-20","2024-01-20",6,0,null,"   Wochenende",null,null,null,null,0,16.8,1,0,0,0,0,1,0,1,1,0]
[20,"2024-01-21","2024-01-21",7,0,null,"   Wochenende",null,null,null,null,0,16.8,1,0,0,0,0,1,0,1,1,0]
[21,"2024-01-22","2024-01-22",1,8.4,null,"   Arbeitstag",null,null,null,null,0,16.8,1,0,0,0,0,0,0,1,1,0]
[22,"2024-01-23","2024-01-23",2,8.4,null,"   Arbeitstag",null,null,null,null,0,16.8,1,0,0,0,0,0,0,1,1,0]
[23,"2024-01-24","2024-01-24",3,8.4,null,"   Arbeitstag",null,null,null,null,0,16.8,1,0,0,0,0,0,0,1,1,0]
[24,"2024-01-25","2024-01-25",4,8.4,null,"   Arbeitstag",null,null,null,null,0,16.8,1,0,0,0,0,0,0,1,1,0]
[25,"2024-01-26","2024-01-26",5,8.4,null,"   Arbeitstag",null,null,null,null,0,16.8,1,0,0,0,0,0,0,1,1,0]
[26,"2024-01-27","2024-01-27",6,0,null,"   Wochenende",null,null,null,null,0,16.8,1,0,0,0,0,1,0,1,1,0]
[27,"2024-01-28","2024-01-28",7,0,null,"   Wochenende",null,null,null,null,0,16.8,1,0,0,0,0,1,0,1,1,0]
[28,"2024-01-29","2024-01-29",1,8.4,null,"   Arbeitstag",null,null,null,null,0,16.8,1,0,0,0,0,0,0,1,1,0]
[29,"2024-01-30","2024-01-30",2,8.4,null,"   Arbeitstag",null,null,null,null,0,16.8,1,0,0,0,0,0,0,1,1,0]
[30,"2024-01-31","2024-01-31",3,8.4,null,"   Arbeitstag",null,null,null,null,0,16.8,1,0,0,0,0,0,0,1,1,0]
[31,"2024-02-01","2024-02-01",4,8.4,null,"   Arbeitstag",null,null,null,null,0,16.8,1,0,0,0,0,0,0,1,1,0]
[32,"2024-02-02","2024-02-02",5,8.4,null,"   Arbeitstag",null,null,null,null,0,16.8,1,0,0,0,0,0,0,1,1,0]
[33,"2024-02-03","2024-02-03",6,0,null,"   Wochenende",null,null,null,null,0,16.8,1,0,0,0,0,1,0,1,1,0]
[34,"2024-02-04","2024-02-04",7,0,null,"   Wochenende",null,null,null,null,0,16.8,1,0,0,0,0,1,0,1,1,0]
[35,"2024-02-05","2024-02-05",1,8.4,null,"   Arbeitstag",null,null,null,null,0,16.8,1,0,0,0,0,0,0,1,1,0]
[36,"2024-02-06","2024-02-06",2,8.4,null,"   Arbeitstag",null,null,null,null,0,16.8,1,0,0,0,0,0,0,1,1,0]
[37,"2024-02-07","2024-02-07",3,8.4,null,"   Arbeitstag",null,null,null,null,0,16.8,1,0,0,0,0,0,0,1,1,0]
[38,"2024-02-08","2024-02-08",4,8.4,null,"   Arbeitstag",null,null,null,null,0,16.8,1,0,0,0,0,0,0,1,1,0]
[39,"2024-02-09","2024-02-09",5,8.4,null,"   Arbeitstag",null,null,null,null,0,16.8,1,0,0,0,0,0,0,1,1,0]
[40,"2024-02-10","2024-02-10",6,0,null,"   Wochenende",null,null,null,null,0,16.8,1,0,0,0,0,1,0,1,1,0]
[41,"2024-02-11","2024-02-11",7,0,null,"   Wochenende",null,null,null,null,0,16.8,1,0,0,0,0,1,0,1,1,0]
[42,"2024-02-12","2024-02-12",1,8.4,null,"   Arbeitstag",null,null,null,null,0,16.8,1,0,0,0,0,0,0,1,1,0]
[43,"2024-02-13","2024-02-13",2,8.4,null,"   Arbeitstag",null,null,null,null,0,16.8,1,0,0,0,0,0,0,1,1,0]
[44,"2024-02-14","2024-02-14",3,8.4,null,"   Arbeitstag",null,null,null,null,0,16.8,1,0,0,0,0,0,0,1,1,{"$f":"((R51-T51)>0)*1","v":0}]
[45,"2024-02-15","2024-02-15",4,8.4,null,"   Arbeitstag",null,null,null,null,0,16.8,1,0,0,0,0,0,0,1,1,{"$f":"((R52-T52)>0)*1","v":0}]
[46,"2024-02-16","2024-02-16",5,8.4,null,"   Arbeitstag",null,null,null,null,0,16.8,1,0,0,0,0,0,0,1,1,0]
[47,"2024-02-17","2024-02-17",6,0,null,"   Wochenende",null,null,null,null,0,16.8,1,0,0,0,0,1,0,1,1,0]
[48,"2024-02-18","2024-02-18",7,0,null,"   Wochenende",null,null,null,null,0,16.8,1,0,0,0,0,1,0,1,1,0]
[49,"2024-02-19","2024-02-19",1,0,null,"Fasnachtsmontag",null,"Fasnachtsmontag",null,null,8.4,25.200000000000003,1,8.4,8.4,0,0,1,8.4,1,1,0]
[50,"2024-02-20","2024-02-20",2,8.4,null,"   Arbeitstag",null,null,null,null,0,25.200000000000003,1,0,0,0,0,0,0,1,1,0]
[51,"2024-02-21","2024-02-21",3,8.4,null,"   Arbeitstag",null,null,null,null,0,25.200000000000003,1,0,0,0,0,0,0,1,1,0]
[52,"2024-02-22","2024-02-22",4,8.4,null,"   Arbeitstag",null,null,null,null,0,25.200000000000003,1,0,0,0,0,0,0,1,1,0]
[53,"2024-02-23","2024-02-23",5,8.4,null,"   Arbeitstag",null,null,null,null,0,25.200000000000003,1,0,0,0,0,0,0,1,1,0]
[54,"2024-02-24","2024-02-24",6,0,null,"   Wochenende",null,null,null,null,0,25.200000000000003,1,0,0,0,0,1,0,1,1,0]
[55,"2024-02-25","2024-02-25",7,0,null,"   Wochenende",null,null,null,null,0,25.200000000000003,1,0,0,0,0,1,0,1,1,0]
[56,"2024-02-26","2024-02-26",1,8.4,null,"   Arbeitstag",null,null,null,null,0,25.200000000000003,1,0,0,0,0,0,0,1,1,0]
[57,"2024-02-27","2024-02-27",2,8.4,null,"   Arbeitstag",null,null,null,null,0,25.200000000000003,1,0,0,0,0,0,0,1,1,0]
[58,"2024-02-28","2024-02-28",3,8.4,null,"   Arbeitstag",null,null,null,null,0,25.200000000000003,1,0,0,0,0,0,0,1,1,0]
[59,"2024-02-29","2024-02-29",4,8.4,null,"   Arbeitstag",null,null,null,null,0,25.200000000000003,1,0,0,0,0,0,0,1,1,0]
[60,"2024-03-01","2024-03-01",5,8.4,null,"   Arbeitstag",null,null,null,null,0,25.200000000000003,1,0,0,0,0,0,0,1,1,0]
[61,"2024-03-02","2024-03-02",6,0,null,"   Wochenende",null,null,null,null,0,25.200000000000003,1,0,0,0,0,1,0,1,1,0]
[62,"2024-03-03","2024-03-03",7,0,null,"   Wochenende",null,null,null,null,0,25.200000000000003,1,0,0,0,0,1,0,1,1,0]
[63,"2024-03-04","2024-03-04",1,8.4,null,"   Arbeitstag",null,null,null,null,0,25.200000000000003,1,0,0,0,0,0,0,1,1,0]
[64,"2024-03-05","2024-03-05",2,{"$f":"IF(G71=\"   Wochenende\",0,IF(G71=\"   Arbeitstag\",HT_NAZ,IF(ISBLANK(F71),HT_NAZ-T71,F71)))","v":8.4},null,"   Arbeitstag",null,null,null,null,{"$f":"(HT_NAZ-E71)*(D71<6)+K71","v":0},25.200000000000003,{"$f":"VLOOKUP(B71,BGhelp,2)/100","v":1},0,{"$f":"IF(L71=0,0,(HT_NAZ-F71)*N71-Q71)","v":0},{"$f":"INDEX(Raz,U71,D71+2)","v":0},0,0,{"$f":"IF(AND(BezCode2=1,OR(G71=INDEX(LocFT,1,2),G71=INDEX(LocFT,2,2))),HT_NAZ/2,\nIF(AND(BezCode2=2,G71=INDEX(LocFT,3,2)),HT_NAZ,0))","v":0},{"$f":"VLOOKUP(B71,BGhelp,3)","v":1},{"$f":"ABS(Q71<=HT_NAZ)","v":1},0]
[65,"2024-03-06",{"$f":"B72","v":"2024-03-06"},{"$f":"WEEKDAY(B72,2)","v":3},8.4,null,{"$f":"IF(ISBLANK(I72),IF(ISBLANK(H72),IF(D72<6,\"   Arbeitstag\",\"   Wochenende\"),H72),I72)","v":"   Arbeitstag"},null,null,null,null,0,{"$f":"M71+L72","v":25.200000000000003},1,{"$f":"ROUND(L72*N72,2)","v":0},0,0,{"$f":"MIN(Q72,F72)","v":0},{"$f":"OR(E72=0,D72>5)*1","v":0},0,1,1,0]
[66,{"$f":"$B$7+A73","v":"2024-03-07"},"2024-03-07",4,8.4,null,"   Arbeitstag",null,null,null,null,0,25.200000000000003,1,0,0,0,0,0,0,1,1,0]
[67,"2024-03-08","2024-03-08",5,8.4,null,"   Arbeitstag",null,null,null,null,0,25.200000000000003,1,0,0,0,0,0,0,1,1,0]
[68,"2024-03-09","2024-03-09",6,0,null,"   Wochenende",null,null,null,null,0,25.200000000000003,1,0,0,0,0,1,0,1,1,0]
[69,"2024-03-10","2024-03-10",7,0,null,"   Wochenende",null,null,null,null,0,25.200000000000003,1,0,0,0,0,1,0,1,1,0]
[70,"2024-03-11","2024-03-11",1,8.4,null,"   Arbeitstag",null,null,null,null,0,25.200000000000003,1,0,0,0,0,0,0,1,1,0]
[71,"2024-03-12","2024-03-12",2,8.4,null,"   Arbeitstag",null,null,null,null,0,25.200000000000003,1,0,0,0,0,0,0,1,1,0]
[72,"2024-03-13","2024-03-13",3,8.4,null,"   Arbeitstag",null,null,null,null,0,25.200000000000003,1,0,0,0,0,0,0,1,1,0]
[73,"2024-03-14","2024-03-14",4,8.4,null,"   Arbeitstag",null,null,null,null,0,25.200000000000003,1,0,0,0,0,0,0,1,1,0]
[74,"2024-03-15","2024-03-15",5,8.4,null,"   Arbeitstag",null,null,null,null,0,25.200000000000003,1,0,0,0,0,0,0,1,1,0]
[75,"2024-03-16","2024-03-16",6,0,null,"   Wochenende",null,null,null,null,0,25.200000000000003,1,0,0,0,0,1,0,1,1,0]
[76,"2024-03-17","2024-03-17",7,0,null,"   Wochenende",null,null,null,null,0,25.200000000000003,1,0,0,0,0,1,0,1,1,0]
[77,"2024-03-18","2024-03-18",1,8.4,null,"   Arbeitstag",null,null,null,null,0,25.200000000000003,1,0,0,0,0,0,0,1,1,0]
[78,"2024-03-19","2024-03-19",2,8.4,null,"   Arbeitstag",null,null,null,null,0,25.200000000000003,1,0,0,0,0,0,0,1,1,0]
[79,"2024-03-20","2024-03-20",3,8.4,null,"   Arbeitstag",null,null,null,null,0,25.200000000000003,1,0,0,0,0,0,0,1,1,0]
[80,"2024-03-21","2024-03-21",4,8.4,null,"   Arbeitstag",null,null,null,null,0,25.200000000000003,1,0,0,0,0,0,0,1,1,0]
[81,"2024-03-22","2024-03-22",5,8.4,null,"   Arbeitstag",null,null,null,null,0,25.200000000000003,1,0,0,0,0,0,0,1,1,0]
[82,"2024-03-23","2024-03-23",6,0,null,"   Wochenende",null,null,null,null,0,25.200000000000003,1,0,0,0,0,1,0,1,1,0]
[83,"2024-03-24","2024-03-24",7,0,null,"   Wochenende",null,null,null,null,0,25.200000000000003,1,0,0,0,0,1,0,1,1,0]
[84,"2024-03-25","2024-03-25",1,8.4,null,"   Arbeitstag",null,null,null,null,0,25.200000000000003,1,0,0,0,0,0,0,1,1,0]
[85,"2024-03-26","2024-03-26",2,8.4,null,"   Arbeitstag",null,null,null,null,0,25.200000000000003,1,0,0,0,0,0,0,1,1,0]
[86,"2024-03-27","2024-03-27",3,8.4,null,"   Arbeitstag",null,null,null,null,0,25.200000000000003,1,0,0,0,0,0,0,1,1,0]
[87,"2024-03-28","2024-03-28",4,6,6,"Gründonnerstag","Gründonnerstag",null,null,null,2.4000000000000004,27.6,1,2.4,2.4000000000000004,0,0,0,0,1,1,0]
[88,"2024-03-29","2024-03-29",5,0,0,"Karfreitag","Karfreitag",null,null,null,8.4,36,1,8.4,8.4,0,0,1,0,1,1,0]
[89,"2024-03-30","2024-03-30",6,0,null,"   Wochenende",null,null,null,null,0,36,1,0,0,0,0,1,0,1,1,0]
[90,"2024-03-31","2024-03-31",7,0,null,"   Wochenende",null,null,null,null,0,36,1,0,0,0,0,1,0,1,1,0]
[91,"2024-04-01","2024-04-01",1,0,0,"Ostermontag","Ostermontag",null,null,null,8.4,44.4,1,8.4,8.4,0,0,1,0,1,1,0]
[92,"2024-04-02","2024-04-02",2,8.4,null,"   Arbeitstag",null,null,null,null,0,44.4,1,0,0,0,0,0,0,1,1,0]
[93,"2024-04-03","2024-04-03",3,8.4,null,"   Arbeitstag",null,null,null,null,0,44.4,1,0,0,0,0,0,0,1,1,0]
[94,"2024-04-04","2024-04-04",4,8.4,null,"   Arbeitstag",null,null,null,null,0,44.4,1,0,0,0,0,0,0,1,1,0]
[95,"2024-04-05","2024-04-05",5,8.4,null,"   Arbeitstag",null,null,null,null,0,44.4,1,0,0,0,0,0,0,1,1,0]
[96,"2024-04-06","2024-04-06",6,0,null,"   Wochenende",null,null,null,null,0,44.4,1,0,0,0,0,1,0,1,1,0]
[97,"2024-04-07","2024-04-07",7,0,null,"   Wochenende",null,null,null,null,0,44.4,1,0,0,0,0,1,0,1,1,0]
[98,"2024-04-08","2024-04-08",1,8.4,null,"   Arbeitstag",null,null,null,null,0,44.4,1,0,0,0,0,0,0,1,1,0]
[99,"2024-04-09","2024-04-09",2,8.4,null,"   Arbeitstag",null,null,null,null,{"$f":"(HT_NAZ-E106)*(D106<6)+K106","v":0},44.4,1,0,0,0,0,0,0,1,1,0]
[100,"2024-04-10","2024-04-10",3,8.4,null,"   Arbeitstag",null,null,null,null,0,44.4,1,0,0,0,0,0,0,1,1,0]
[101,"2024-04-11","2024-04-11",4,8.4,null,"   Arbeitstag",null,null,null,null,0,44.4,1,0,0,0,0,0,0,1,1,0]
[102,"2024-04-12","2024-04-12",5,8.4,null,"   Arbeitstag",null,null,null,null,0,44.4,1,0,0,0,0,0,0,1,1,0]
[103,"2024-04-13","2024-04-13",6,0,null,"   Wochenende",null,null,null,null,0,44.4,1,0,0,0,0,1,0,1,1,0]
[104,"2024-04-14","2024-04-14",7,0,null,"   Wochenende",null,null,null,null,0,44.4,1,0,0,0,0,1,0,1,1,0]
[105,"2024-04-15","2024-04-15",1,8.4,null,"Sechseläuten",null,"Sechseläuten",null,null,0,44.4,1,0,0,0,0,0,0,1,1,0]
[106,"2024-04-16","2024-04-16",2,8.4,null,"   Arbeitstag",null,null,null,null,0,44.4,1,0,0,0,0,0,0,1,1,0]
[107,"2024-04-17","2024-04-17",3,8.4,null,"   Arbeitstag",null,null,null,null,0,44.4,1,0,0,0,0,0,0,1,1,0]
[108,"2024-04-18","2024-04-18",4,8.4,null,"   Arbeitstag",null,null,null,null,0,44.4,1,0,0,0,0,0,0,1,1,0]
[109,"2024-04-19","2024-04-19",5,8.4,null,"   Arbeitstag",null,null,null,null,0,44.4,1,0,0,0,0,0,0,1,1,{"$f":"((R116-T116)>0)*1","v":0}]
[110,"2024-04-20","2024-04-20",6,0,null,"   Wochenende",null,null,null,null,0,44.4,1,0,0,0,0,1,0,1,1,0]
[111,"2024-04-21","2024-04-21",7,0,null,"   Wochenende",null,null,null,null,0,44.4,1,0,0,0,0,1,0,1,1,0]
[112,"2024-04-22","2024-04-22",1,8.4,null,"   Arbeitstag",null,null,null,null,0,44.4,1,0,0,0,0,0,0,1,1,0]
[113,"2024-04-23","2024-04-23",2,8.4,null,"   Arbeitstag",null,null,null,null,0,44.4,1,0,0,0,0,0,0,1,1,0]
[114,"2024-04-24","2024-04-24",3,8.4,null,"   Arbeitstag",null,null,null,null,0,44.4,1,0,0,0,0,0,0,1,1,0]
[115,"2024-04-25","2024-04-25",4,8.4,null,"   Arbeitstag",null,null,null,null,0,44.4,1,0,0,0,0,0,0,1,1,0]
[116,"2024-04-26","2024-04-26",5,8.4,null,"   Arbeitstag",null,null,null,null,0,44.4,1,0,0,0,0,0,0,1,1,0]
[117,"2024-04-27","2024-04-27",6,0,null,"   Wochenende",null,null,null,null,0,44.4,1,0,0,0,0,1,0,1,1,0]
[118,"2024-04-28","2024-04-28",7,0,null,"   Wochenende",null,null,null,null,0,44.4,1,0,0,0,0,1,0,1,1,0]
[119,"2024-04-29","2024-04-29",1,8.4,null,"   Arbeitstag",null,null,null,null,0,44.4,1,0,0,0,0,0,0,1,1,0]
[120,"2024-04-30","2024-04-30",2,8.4,null,"   Arbeitstag",null,null,null,null,0,44.4,1,0,0,0,0,0,0,1,1,0]
[121,"2024-05-01","2024-05-01",3,0,0,"Tag der Arbeit","Tag der Arbeit",null,null,null,8.4,52.8,1,8.4,8.4,0,0,1,0,1,1,0]
[122,"2024-05-02","2024-05-02",4,8.4,null,"   Arbeitstag",null,null,null,null,0,52.8,1,0,0,0,0,0,0,1,1,0]
[123,"2024-05-03","2024-05-03",5,8.4,null,"   Arbeitstag",null,null,null,null,0,52.8,1,0,0,0,0,0,0,1,1,0]
[124,"2024-05-04","2024-05-04",6,0,null,"   Wochenende",null,null,null,null,0,52.8,1,0,0,0,0,1,0,1,1,0]
[125,"2024-05-05","2024-05-05",7,0,null,"   Wochenende",null,null,null,null,0,52.8,1,0,0,0,0,1,0,1,1,0]
[126,"2024-05-06","2024-05-06",1,8.4,null,"   Arbeitstag",null,null,null,null,0,52.8,1,0,0,0,0,0,0,1,1,0]
[127,"2024-05-07","2024-05-07",2,8.4,null,"   Arbeitstag",null,null,null,null,0,52.8,1,0,0,0,0,0,0,1,1,0]
[128,"2024-05-08","2024-05-08",3,{"$f":"IF(G135=\"   Wochenende\",0,IF(G135=\"   Arbeitstag\",HT_NAZ,IF(ISBLANK(F135),HT_NAZ-T135,F135)))","v":6},6,"Mittwoch vor Auffahrt","Mittwoch vor Auffahrt",null,null,null,{"$f":"(HT_NAZ-E135)*(D135<6)+K135","v":2.4000000000000004},55.199999999999996,{"$f":"VLOOKUP(B135,BGhelp,2)/100","v":1},2.4,{"$f":"IF(L135=0,0,(HT_NAZ-F135)*N135-Q135)","v":2.4000000000000004},{"$f":"INDEX(Raz,U135,D135+2)","v":0},0,0,{"$f":"IF(AND(BezCode2=1,OR(G135=INDEX(LocFT,1,2),G135=INDEX(LocFT,2,2))),HT_NAZ/2,\nIF(AND(BezCode2=2,G135=INDEX(LocFT,3,2)),HT_NAZ,0))","v":0},{"$f":"VLOOKUP(B135,BGhelp,3)","v":1},{"$f":"ABS(Q135<=HT_NAZ)","v":1},0]
[129,"2024-05-09",{"$f":"B136","v":"2024-05-09"},{"$f":"WEEKDAY(B136,2)","v":4},0,0,{"$f":"IF(ISBLANK(I136),IF(ISBLANK(H136),IF(D136<6,\"   Arbeitstag\",\"   Wochenende\"),H136),I136)","v":"Auffahrt"},"Auffahrt",null,null,null,8.4,{"$f":"M135+L136","v":63.599999999999994},1,{"$f":"ROUND(L136*N136,2)","v":8.4},8.4,0,{"$f":"MIN(Q136,F136)","v":0},{"$f":"OR(E136=0,D136>5)*1","v":1},0,1,1,0]
[130,{"$f":"$B$7+A137","v":"2024-05-10"},"2024-05-10",5,8.4,null,"   Arbeitstag",null,null,null,null,0,63.599999999999994,1,0,0,0,0,0,0,1,1,0]
[131,"2024-05-11","2024-05-11",6,0,null,"   Wochenende",null,null,null,null,0,63.599999999999994,1,0,0,0,0,1,0,1,1,0]
[132,"2024-05-12","2024-05-12",7,0,null,"   Wochenende",null,null,null,null,0,63.599999999999994,1,0,0,0,0,1,0,1,1,0]
[133,"2024-05-13","2024-05-13",1,8.4,null,"   Arbeitstag",null,null,null,null,0,63.599999999999994,1,0,0,0,0,0,0,1,1,0]
[134,"2024-05-14","2024-05-14",2,8.4,null,"   Arbeitstag",null,null,null,null,0,63.599999999999994,1,0,0,0,0,0,0,1,1,0]
[135,"2024-05-15","2024-05-15",3,8.4,null,"   Arbeitstag",null,null,null,null,0,63.599999999999994,1,0,0,0,0,0,0,1,1,0]
[136,"2024-05-16","2024-05-16",4,8.4,null,"   Arbeitstag",null,null,null,null,0,63.599999999999994,1,0,0,0,0,0,0,1,1,0]
[137,"2024-05-17","2024-05-17",5,8.4,null,"   Arbeitstag",null,null,null,null,0,63.599999999999994,1,0,0,0,0,0,0,1,1,0]
[138,"2024-05-18","2024-05-18",6,0,null,"   Wochenende",null,null,null,null,0,63.599999999999994,1,0,0,0,0,1,0,1,1,0]
[139,"2024-05-19","2024-05-19",7,0,null,"   Wochenende",null,null,null,null,0,63.599999999999994,1,0,0,0,0,1,0,1,1,0]
[140,"2024-05-20","2024-05-20",1,0,0,"Pfingstmontag","Pfingstmontag",null,null,null,8.4,72,1,8.4,8.4,0,0,1,0,1,1,0]
[141,"2024-05-21","2024-05-21",2,8.4,null,"   Arbeitstag",null,null,null,null,0,72,1,0,0,0,0,0,0,1,1,0]
[142,"2024-05-22","2024-05-22",3,8.4,null,"   Arbeitstag",null,null,null,null,0,72,1,0,0,0,0,0,0,1,1,0]
[143,"2024-05-23","2024-05-23",4,8.4,null,"   Arbeitstag",null,null,null,null,0,72,1,0,0,0,0,0,0,1,1,0]
[144,"2024-05-24","2024-05-24",5,8.4,null,"   Arbeitstag",null,null,null,null,0,72,1,0,0,0,0,0,0,1,1,0]
[145,"2024-05-25","2024-05-25",6,0,null,"   Wochenende",null,null,null,null,0,72,1,0,0,0,0,1,0,1,1,0]
[146,"2024-05-26","2024-05-26",7,0,null,"   Wochenende",null,null,null,null,0,72,1,0,0,0,0,1,0,1,1,0]
[147,"2024-05-27","2024-05-27",1,8.4,null,"   Arbeitstag",null,null,null,null,0,72,1,0,0,0,0,0,0,1,1,0]
[148,"2024-05-28","2024-05-28",2,8.4,null,"   Arbeitstag",null,null,null,null,0,72,1,0,0,0,0,0,0,1,1,0]
[149,"2024-05-29","2024-05-29",3,8.4,null,"   Arbeitstag",null,null,null,null,0,72,1,0,0,0,0,0,0,1,1,0]
[150,"2024-05-30","2024-05-30",4,8.4,null,"   Arbeitstag",null,null,null,null,0,72,1,0,0,0,0,0,0,1,1,0]
[151,"2024-05-31","2024-05-31",5,8.4,null,"   Arbeitstag",null,null,null,null,0,72,1,0,0,0,0,0,0,1,1,0]
[152,"2024-06-01","2024-06-01",6,0,null,"   Wochenende",null,null,null,null,0,72,1,0,0,0,0,1,0,1,1,0]
[153,"2024-06-02","2024-06-02",7,0,null,"   Wochenende",null,null,null,null,0,72,1,0,0,0,0,1,0,1,1,0]
[154,"2024-06-03","2024-06-03",1,8.4,null,"   Arbeitstag",null,null,null,null,0,72,1,0,0,0,0,0,0,1,1,0]
[155,"2024-06-04","2024-06-04",2,8.4,null,"   Arbeitstag",null,null,null,null,0,72,1,0,0,0,0,0,0,1,1,0]
[156,"2024-06-05","2024-06-05",3,8.4,null,"   Arbeitstag",null,null,null,null,0,72,1,0,0,0,0,0,0,1,1,0]
[157,"2024-06-06","2024-06-06",4,8.4,null,"   Arbeitstag",null,null,null,null,0,72,1,0,0,0,0,0,0,1,1,0]
[158,"2024-06-07","2024-06-07",5,8.4,null,"   Arbeitstag",null,null,null,null,0,72,1,0,0,0,0,0,0,1,1,0]
[159,"2024-06-08","2024-06-08",6,0,null,"   Wochenende",null,null,null,null,0,72,1,0,0,0,0,1,0,1,1,0]
[160,"2024-06-09","2024-06-09",7,0,null,"   Wochenende",null,null,null,null,0,72,1,0,0,0,0,1,0,1,1,0]
[161,"2024-06-10","2024-06-10",1,8.4,null,"   Arbeitstag",null,null,null,null,0,72,1,0,0,0,0,0,0,1,1,0]
[162,"2024-06-11","2024-06-11",2,8.4,null,"   Arbeitstag",null,null,null,null,0,72,1,0,0,0,0,0,0,1,1,0]
[163,"2024-06-12","2024-06-12",3,8.4,null,"   Arbeitstag",null,null,null,null,0,72,1,0,0,0,0,0,0,1,1,0]
[164,"2024-06-13","2024-06-13",4,8.4,null,"   Arbeitstag",null,null,null,null,0,72,1,0,0,0,0,0,0,1,1,0]
[165,"2024-06-14","2024-06-14",5,8.4,null,"   Arbeitstag",null,null,null,null,0,72,1,0,0,0,0,0,0,1,1,0]
[166,"2024-06-15","2024-06-15",6,0,null,"   Wochenende",null,null,null,null,0,72,1,0,0,0,0,1,0,1,1,0]
[167,"2024-06-16","2024-06-16",7,0,null,"   Wochenende",null,null,null,null,0,72,1,0,0,0,0,1,0,1,1,0]
[168,"2024-06-17","2024-06-17",1,8.4,null,"   Arbeitstag",null,null,null,null,0,72,1,0,0,0,0,0,0,1,1,0]
[169,"2024-06-18","2024-06-18",2,8.4,null,"   Arbeitstag",null,null,null,null,0,72,1,0,0,0,0,0,0,1,1,0]
[170,"2024-06-19","2024-06-19",3,8.4,null,"   Arbeitstag",null,null,null,null,0,72,1,0,0,0,0,0,0,1,1,0]
[171,"2024-06-20","2024-06-20",4,8.4,null,"   Arbeitstag",null,null,null,null,0,72,1,0,0,0,0,0,0,1,1,0]
[172,"2024-06-21","2024-06-21",5,8.4,null,"   Arbeitstag",null,null,null,null,0,72,1,0,0,0,0,0,0,1,1,0]
[173,"2024-06-22","2024-06-22",6,0,null,"   Wochenende",null,null,null,null,0,72,1,0,0,0,0,1,0,1,1,{"$f":"((R180-T180)>0)*1","v":0}]
[174,"2024-06-23","2024-06-23",7,0,null,"   Wochenende",null,null,null,null,0,72,1,0,0,0,0,1,0,1,1,0]
[175,"2024-06-24","2024-06-24",1,8.4,null,"   Arbeitstag",null,null,null,null,0,72,1,0,0,0,0,0,0,1,1,0]
[176,"2024-06-25","2024-06-25",2,8.4,null,"   Arbeitstag",null,null,null,null,0,72,1,0,0,0,0,0,0,1,1,0]
[177,"2024-06-26","2024-06-26",3,8.4,null,"   Arbeitstag",null,null,null,null,0,72,1,0,0,0,0,0,0,1,1,0]
[178,"2024-06-27","2024-06-27",4,8.4,null,"   Arbeitstag",null,null,null,null,0,72,1,0,0,0,0,0,0,1,1,0]
[179,"2024-06-28","2024-06-28",5,8.4,null,"   Arbeitstag",null,null,null,null,0,72,1,0,0,0,0,0,0,1,1,0]
[180,"2024-06-29","2024-06-29",6,0,null,"   Wochenende",null,null,null,null,0,72,1,0,0,0,0,1,0,1,1,0]
[181,"2024-06-30","2024-06-30",7,0,null,"   Wochenende",null,null,null,null,0,72,1,0,0,0,0,1,0,1,1,0]
[182,"2024-07-01","2024-07-01",1,8.4,null,"   Arbeitstag",null,null,null,null,0,72,1,0,0,0,0,0,0,1,1,0]
[183,"2024-07-02","2024-07-02",2,8.4,null,"   Arbeitstag",null,null,null,null,0,72,1,0,0,0,0,0,0,1,1,0]
[184,"2024-07-03","2024-07-03",3,8.4,null,"   Arbeitstag",null,null,null,null,0,72,1,0,0,0,0,0,0,1,1,0]
[185,"2024-07-04","2024-07-04",4,8.4,null,"   Arbeitstag",null,null,null,null,0,72,1,0,0,0,0,0,0,1,1,0]
[186,"2024-07-05","2024-07-05",5,8.4,null,"   Arbeitstag",null,null,null,null,0,72,1,0,0,0,0,0,0,1,1,0]
[187,"2024-07-06","2024-07-06",6,0,null,"   Wochenende",null,null,null,null,0,72,1,0,0,0,0,1,0,1,1,0]
[188,"2024-07-07","2024-07-07",7,0,null,"   Wochenende",null,null,null,null,0,72,1,0,0,0,0,1,0,1,1,0]
[189,"2024-07-08","2024-07-08",1,8.4,null,"   Arbeitstag",null,null,null,null,0,72,1,0,0,0,0,0,0,1,1,0]
[190,"2024-07-09","2024-07-09",2,8.4,null,"   Arbeitstag",null,null,null,null,0,72,1,0,0,0,0,0,0,1,1,0]
[191,"2024-07-10","2024-07-10",3,8.4,null,"   Arbeitstag",null,null,null,null,0,72,1,0,0,0,0,0,0,1,1,0]
[192,"2024-07-11","2024-07-11",4,{"$f":"IF(G199=\"   Wochenende\",0,IF(G199=\"   Arbeitstag\",HT_NAZ,IF(ISBLANK(F199),HT_NAZ-T199,F199)))","v":8.4},null,"   Arbeitstag",null,null,null,null,{"$f":"(HT_NAZ-E199)*(D199<6)+K199","v":0},72,{"$f":"VLOOKUP(B199,BGhelp,2)/100","v":1},0,{"$f":"IF(L199=0,0,(HT_NAZ-F199)*N199-Q199)","v":0},{"$f":"INDEX(Raz,U199,D199+2)","v":0},0,0,{"$f":"IF(AND(BezCode2=1,OR(G199=INDEX(LocFT,1,2),G199=INDEX(LocFT,2,2))),HT_NAZ/2,\nIF(AND(BezCode2=2,G199=INDEX(LocFT,3,2)),HT_NAZ,0))","v":0},{"$f":"VLOOKUP(B199,BGhelp,3)","v":1},{"$f":"ABS(Q199<=HT_NAZ)","v":1},0]
[193,"2024-07-12",{"$f":"B200","v":"2024-07-12"},{"$f":"WEEKDAY(B200,2)","v":5},8.4,null,{"$f":"IF(ISBLANK(I200),IF(ISBLANK(H200),IF(D200<6,\"   Arbeitstag\",\"   Wochenende\"),H200),I200)","v":"   Arbeitstag"},null,null,null,null,0,{"$f":"M199+L200","v":72},1,{"$f":"ROUND(L200*N200,2)","v":0},0,0,{"$f":"MIN(Q200,F200)","v":0},{"$f":"OR(E200=0,D200>5)*1","v":0},0,1,1,0]
[194,{"$f":"$B$7+A201","v":"2024-07-13"},"2024-07-13",6,0,null,"   Wochenende",null,null,null,null,0,72,1,0,0,0,0,1,0,1,1,0]
[195,"2024-07-14","2024-07-14",7,0,null,"   Wochenende",null,null,null,null,0,72,1,0,0,0,0,1,0,1,1,0]
[196,"2024-07-15","2024-07-15",1,8.4,null,"   Arbeitstag",null,null,null,null,0,72,1,0,0,0,0,0,0,1,1,0]
[197,"2024-07-16","2024-07-16",2,8.4,null,"   Arbeitstag",null,null,null,null,0,72,1,0,0,0,0,0,0,1,1,0]
[198,"2024-07-17","2024-07-17",3,8.4,null,"   Arbeitstag",null,null,null,null,0,72,1,0,0,0,0,0,0,1,1,0]
[199,"2024-07-18","2024-07-18",4,8.4,null,"   Arbeitstag",null,null,null,null,0,72,1,0,0,0,0,0,0,1,1,0]
[200,"2024-07-19","2024-07-19",5,8.4,null,"   Arbeitstag",null,null,null,null,0,72,1,0,0,0,0,0,0,1,1,0]
[201,"2024-07-20","2024-07-20",6,0,null,"   Wochenende",null,null,null,null,0,72,1,0,0,0,0,1,0,1,1,0]
[202,"2024-07-21","2024-07-21",7,0,null,"   Wochenende",null,null,null,null,0,72,1,0,0,0,0,1,0,1,1,0]
[203,"2024-07-22","2024-07-22",1,8.4,null,"   Arbeitstag",null,null,null,null,0,72,1,0,0,0,0,0,0,1,1,0]
[204,"2024-07-23","2024-07-23",2,8.4,null,"   Arbeitstag",null,null,null,null,0,72,1,0,0,0,0,0,0,1,1,0]
[205,"2024-07-24","2024-07-24",3,8.4,null,"   Arbeitstag",null,null,null,null,0,72,1,0,0,0,0,0,0,1,1,0]
[206,"2024-07-25","2024-07-25",4,8.4,null,"   Arbeitstag",null,null,null,null,0,72,1,0,0,0,0,0,0,1,1,0]
[207,"2024-07-26","2024-07-26",5,8.4,null,"   Arbeitstag",null,null,null,null,0,72,1,0,0,0,0,0,0,1,1,0]
[208,"2024-07-27","2024-07-27",6,0,null,"   Wochenende",null,null,null,null,0,72,1,0,0,0,0,1,0,1,1,0]
[209,"2024-07-28","2024-07-28",7,0,null,"   Wochenende",null,null,null,null,0,72,1,0,0,0,0,1,0,1,1,0]
[210,"2024-07-29","2024-07-29",1,8.4,null,"   Arbeitstag",null,null,null,null,0,72,1,0,0,0,0,0,0,1,1,0]
[211,"2024-07-30","2024-07-30",2,8.4,null,"   Arbeitstag",null,null,null,null,0,72,1,0,0,0,0,0,0,1,1,0]
[212,"2024-07-31","2024-07-31",3,8.4,null,"   Arbeitstag",null,null,null,null,0,72,1,0,0,0,0,0,0,1,1,0]
[213,"2024-08-01","2024-08-01",4,0,0,"1. August","1. August",null,null,null,8.4,80.400000000000006,1,8.4,8.4,0,0,1,0,1,1,0]
[214,"2024-08-02","2024-08-02",5,8.4,null,"   Arbeitstag",null,null,null,null,0,80.400000000000006,1,0,0,0,0,0,0,1,1,0]
[215,"2024-08-03","2024-08-03",6,0,null,"   Wochenende",null,null,null,null,0,80.400000000000006,1,0,0,0,0,1,0,1,1,0]
[216,"2024-08-04","2024-08-04",7,0,null,"   Wochenende",null,null,null,null,0,80.400000000000006,1,0,0,0,0,1,0,1,1,0]
[217,"2024-08-05","2024-08-05",1,8.4,null,"   Arbeitstag",null,null,null,null,0,80.400000000000006,1,0,0,0,0,0,0,1,1,0]
[218,"2024-08-06","2024-08-06",2,8.4,null,"   Arbeitstag",null,null,null,null,0,80.400000000000006,1,0,0,0,0,0,0,1,1,0]
[219,"2024-08-07","2024-08-07",3,8.4,null,"   Arbeitstag",null,null,null,null,0,80.400000000000006,1,0,0,0,0,0,0,1,1,0]
[220,"2024-08-08","2024-08-08",4,8.4,null,"   Arbeitstag",null,null,null,null,0,80.400000000000006,1,0,0,0,0,0,0,1,1,0]
[221,"2024-08-09","2024-08-09",5,8.4,null,"   Arbeitstag",null,null,null,null,0,80.400000000000006,1,0,0,0,0,0,0,1,1,0]
[222,"2024-08-10","2024-08-10",6,0,null,"   Wochenende",null,null,null,null,0,80.400000000000006,1,0,0,0,0,1,0,1,1,0]
[223,"2024-08-11","2024-08-11",7,0,null,"   Wochenende",null,null,null,null,0,80.400000000000006,1,0,0,0,0,1,0,1,1,0]
[224,"2024-08-12","2024-08-12",1,8.4,null,"   Arbeitstag",null,null,null,null,0,80.400000000000006,1,0,0,0,0,0,0,1,1,0]
[225,"2024-08-13","2024-08-13",2,8.4,null,"   Arbeitstag",null,null,null,null,0,80.400000000000006,1,0,0,0,0,0,0,1,1,0]
[226,"2024-08-14","2024-08-14",3,8.4,null,"   Arbeitstag",null,null,null,null,0,80.400000000000006,1,0,0,0,0,0,0,1,1,0]
[227,"2024-08-15","2024-08-15",4,8.4,null,"   Arbeitstag",null,null,null,null,0,80.400000000000006,1,0,0,0,0,0,0,1,1,0]
[228,"2024-08-16","2024-08-16",5,8.4,null,"   Arbeitstag",null,null,null,null,0,80.400000000000006,1,0,0,0,0,0,0,1,1,0]
[229,"2024-08-17","2024-08-17",6,0,null,"   Wochenende",null,null,null,null,0,80.400000000000006,1,0,0,0,0,1,0,1,1,0]
[230,"2024-08-18","2024-08-18",7,0,null,"   Wochenende",null,null,null,null,0,80.400000000000006,1,0,0,0,0,1,0,1,1,0]
[231,"2024-08-19","2024-08-19",1,8.4,null,"   Arbeitstag",null,null,null,null,0,80.400000000000006,1,0,0,0,0,0,0,1,1,0]
[232,"2024-08-20","2024-08-20",2,8.4,null,"   Arbeitstag",null,null,null,null,0,80.400000000000006,1,0,0,0,0,0,0,1,1,0]
[233,"2024-08-21","2024-08-21",3,8.4,null,"   Arbeitstag",null,null,null,null,0,80.400000000000006,1,0,0,0,0,0,0,1,1,0]
[234,"2024-08-22","2024-08-22",4,8.4,null,"   Arbeitstag",null,null,null,null,0,80.400000000000006,1,0,0,0,0,0,0,1,1,0]
[235,"2024-08-23","2024-08-23",5,8.4,null,"   Arbeitstag",null,null,null,null,0,80.400000000000006,1,0,0,0,0,0,0,1,1,0]
[236,"2024-08-24","2024-08-24",6,0,null,"   Wochenende",null,null,null,null,0,80.400000000000006,1,0,0,0,0,1,0,1,1,0]
[237,"2024-08-25","2024-08-25",7,0,null,"   Wochenende",null,null,null,null,0,80.400000000000006,1,0,0,0,0,1,0,1,1,{"$f":"((R244-T244)>0)*1","v":0}]
[238,"2024-08-26","2024-08-26",1,8.4,null,"   Arbeitstag",null,null,null,null,0,80.400000000000006,1,0,0,0,0,0,0,1,1,0]
[239,"2024-08-27","2024-08-27",2,8.4,null,"   Arbeitstag",null,null,null,null,0,80.400000000000006,1,0,0,0,0,0,0,1,1,0]
[240,"2024-08-28","2024-08-28",3,8.4,null,"   Arbeitstag",null,null,null,null,0,80.400000000000006,1,0,0,0,0,0,0,1,1,0]
[241,"2024-08-29","2024-08-29",4,8.4,null,"   Arbeitstag",null,null,null,null,0,80.400000000000006,1,0,0,0,0,0,0,1,1,0]
[242,"2024-08-30","2024-08-30",5,8.4,null,"   Arbeitstag",null,null,null,null,0,80.400000000000006,1,0,0,0,0,0,0,1,1,0]
[243,"2024-08-31","2024-08-31",6,0,null,"   Wochenende",null,null,null,null,0,80.400000000000006,1,0,0,0,0,1,0,1,1,0]
[244,"2024-09-01","2024-09-01",7,0,null,"   Wochenende",null,null,null,null,0,80.400000000000006,1,0,0,0,0,1,0,1,1,0]
[245,"2024-09-02","2024-09-02",1,8.4,null,"   Arbeitstag",null,null,null,null,0,80.400000000000006,1,0,0,0,0,0,0,1,1,0]
[246,"2024-09-03","2024-09-03",2,8.4,null,"   Arbeitstag",null,null,null,null,0,80.400000000000006,1,0,0,0,0,0,0,1,1,0]
[247,"2024-09-04","2024-09-04",3,8.4,null,"   Arbeitstag",null,null,null,null,0,80.400000000000006,1,0,0,0,0,0,0,1,1,0]
[248,"2024-09-05","2024-09-05",4,8.4,null,"   Arbeitstag",null,null,null,null,0,80.400000000000006,1,0,0,0,0,0,0,1,1,0]
[249,"2024-09-06","2024-09-06",5,8.4,null,"   Arbeitstag",null,null,null,null,0,80.400000000000006,1,0,0,0,0,0,0,1,1,0]
[250,"2024-09-07","2024-09-07",6,0,null,"   Wochenende",null,null,null,null,0,80.400000000000006,1,0,0,0,0,1,0,1,1,0]
[251,"2024-09-08","2024-09-08",7,0,null,"   Wochenende",null,null,null,null,0,80.400000000000006,1,0,0,0,0,1,0,1,1,0]
[252,"2024-09-09","2024-09-09",1,8.4,null,"Knabenschiessen",null,"Knabenschiessen",null,null,0,80.400000000000006,1,0,0,0,0,0,0,1,1,0]
[253,"2024-09-10","2024-09-10",2,8.4,null,"   Arbeitstag",null,null,null,null,0,80.400000000000006,1,0,0,0,0,0,0,1,1,0]
[254,"2024-09-11","2024-09-11",3,8.4,null,"   Arbeitstag",null,null,null,null,0,80.400000000000006,1,0,0,0,0,0,0,1,1,0]
[255,"2024-09-12","2024-09-12",4,8.4,null,"   Arbeitstag",null,null,null,null,0,80.400000000000006,1,0,0,0,0,0,0,1,1,0]
[256,"2024-09-13","2024-09-13",5,{"$f":"IF(G263=\"   Wochenende\",0,IF(G263=\"   Arbeitstag\",HT_NAZ,IF(ISBLANK(F263),HT_NAZ-T263,F263)))","v":8.4},null,"   Arbeitstag",null,null,null,null,{"$f":"(HT_NAZ-E263)*(D263<6)+K263","v":0},80.400000000000006,{"$f":"VLOOKUP(B263,BGhelp,2)/100","v":1},0,{"$f":"IF(L263=0,0,(HT_NAZ-F263)*N263-Q263)","v":0},{"$f":"INDEX(Raz,U263,D263+2)","v":0},0,0,{"$f":"IF(AND(BezCode2=1,OR(G263=INDEX(LocFT,1,2),G263=INDEX(LocFT,2,2))),HT_NAZ/2,\nIF(AND(BezCode2=2,G263=INDEX(LocFT,3,2)),HT_NAZ,0))","v":0},{"$f":"VLOOKUP(B263,BGhelp,3)","v":1},{"$f":"ABS(Q263<=HT_NAZ)","v":1},0]
[257,"2024-09-14",{"$f":"B264","v":"2024-09-14"},{"$f":"WEEKDAY(B264,2)","v":6},0,null,{"$f":"IF(ISBLANK(I264),IF(ISBLANK(H264),IF(D264<6,\"   Arbeitstag\",\"   Wochenende\"),H264),I264)","v":"   Wochenende"},null,null,null,null,0,{"$f":"M263+L264","v":80.400000000000006},1,{"$f":"ROUND(L264*N264,2)","v":0},0,0,{"$f":"MIN(Q264,F264)","v":0},{"$f":"OR(E264=0,D264>5)*1","v":1},0,1,1,0]
[258,{"$f":"$B$7+A265","v":"2024-09-15"},"2024-09-15",7,0,null,"   Wochenende",null,null,null,null,0,80.400000000000006,1,0,0,0,0,1,0,1,1,0]
[259,"2024-09-16","2024-09-16",1,8.4,null,"   Arbeitstag",null,null,null,null,0,80.400000000000006,1,0,0,0,0,0,0,1,1,0]
[260,"2024-09-17","2024-09-17",2,8.4,null,"   Arbeitstag",null,null,null,null,0,80.400000000000006,1,0,0,0,0,0,0,1,1,0]
[261,"2024-09-18","2024-09-18",3,8.4,null,"   Arbeitstag",null,null,null,null,0,80.400000000000006,1,0,0,0,0,0,0,1,1,0]
[262,"2024-09-19","2024-09-19",4,8.4,null,"   Arbeitstag",null,null,null,null,0,80.400000000000006,1,0,0,0,0,0,0,1,1,0]
[263,"2024-09-20","2024-09-20",5,8.4,null,"   Arbeitstag",null,null,null,null,0,80.400000000000006,1,0,0,0,0,0,0,1,1,0]
[264,"2024-09-21","2024-09-21",6,0,null,"   Wochenende",null,null,null,null,0,80.400000000000006,1,0,0,0,0,1,0,1,1,0]
[265,"2024-09-22","2024-09-22",7,0,null,"   Wochenende",null,null,null,null,0,80.400000000000006,1,0,0,0,0,1,0,1,1,0]
[266,"2024-09-23","2024-09-23",1,8.4,null,"   Arbeitstag",null,null,null,null,0,80.400000000000006,1,0,0,0,0,0,0,1,1,0]
[267,"2024-09-24","2024-09-24",2,8.4,null,"   Arbeitstag",null,null,null,null,0,80.400000000000006,1,0,0,0,0,0,0,1,1,0]
[268,"2024-09-25","2024-09-25",3,8.4,null,"   Arbeitstag",null,null,null,null,0,80.400000000000006,1,0,0,0,0,0,0,1,1,0]
[269,"2024-09-26","2024-09-26",4,8.4,null,"   Arbeitstag",null,null,null,null,0,80.400000000000006,1,0,0,0,0,0,0,1,1,0]
[270,"2024-09-27","2024-09-27",5,8.4,null,"   Arbeitstag",null,null,null,null,0,80.400000000000006,1,0,0,0,0,0,0,1,1,0]
[271,"2024-09-28","2024-09-28",6,0,null,"   Wochenende",null,null,null,null,0,80.400000000000006,1,0,0,0,0,1,0,1,1,0]
[272,"2024-09-29","2024-09-29",7,0,null,"   Wochenende",null,null,null,null,0,80.400000000000006,1,0,0,0,0,1,0,1,1,0]
[273,"2024-09-30","2024-09-30",1,8.4,null,"   Arbeitstag",null,null,null,null,0,80.400000000000006,1,0,0,0,0,0,0,1,1,0]
[274,"2024-10-01","2024-10-01",2,8.4,null,"   Arbeitstag",null,null,null,null,0,80.400000000000006,1,0,0,0,0,0,0,1,1,0]
[275,"2024-10-02","2024-10-02",3,8.4,null,"   Arbeitstag",null,null,null,null,0,80.400000000000006,1,0,0,0,0,0,0,1,1,0]
[276,"2024-10-03","2024-10-03",4,8.4,null,"   Arbeitstag",null,null,null,null,0,80.400000000000006,1,0,0,0,0,0,0,1,1,0]
[277,"2024-10-04","2024-10-04",5,8.4,null,"   Arbeitstag",null,null,null,null,0,80.400000000000006,1,0,0,0,0,0,0,1,1,0]
[278,"2024-10-05","2024-10-05",6,0,null,"   Wochenende",null,null,null,null,0,80.400000000000006,1,0,0,0,0,1,0,1,1,0]
[279,"2024-10-06","2024-10-06",7,0,null,"   Wochenende",null,null,null,null,0,80.400000000000006,1,0,0,0,0,1,0,1,1,0]
[280,"2024-10-07","2024-10-07",1,8.4,null,"   Arbeitstag",null,null,null,null,0,80.400000000000006,1,0,0,0,0,0,0,1,1,0]
[281,"2024-10-08","2024-10-08",2,8.4,null,"   Arbeitstag",null,null,null,null,0,80.400000000000006,1,0,0,0,0,0,0,1,1,0]
[282,"2024-10-09","2024-10-09",3,8.4,null,"   Arbeitstag",null,null,null,null,0,80.400000000000006,1,0,0,0,0,0,0,1,1,0]
[283,"2024-10-10","2024-10-10",4,8.4,null,"   Arbeitstag",null,null,null,null,0,80.400000000000006,1,0,0,0,0,0,0,1,1,0]
[284,"2024-10-11","2024-10-11",5,8.4,null,"   Arbeitstag",null,null,null,null,0,80.400000000000006,1,0,0,0,0,0,0,1,1,0]
[285,"2024-10-12","2024-10-12",6,0,null,"   Wochenende",null,null,null,null,0,80.400000000000006,1,0,0,0,0,1,0,1,1,0]
[286,"2024-10-13","2024-10-13",7,0,null,"   Wochenende",null,null,null,null,0,80.400000000000006,1,0,0,0,0,1,0,1,1,0]
[287,"2024-10-14","2024-10-14",1,8.4,null,"   Arbeitstag",null,null,null,null,0,80.400000000000006,1,0,0,0,0,0,0,1,1,0]
[288,"2024-10-15","2024-10-15",2,8.4,null,"   Arbeitstag",null,null,null,null,0,80.400000000000006,1,0,0,0,0,0,0,1,1,0]
[289,"2024-10-16","2024-10-16",3,8.4,null,"   Arbeitstag",null,null,null,null,0,80.400000000000006,1,0,0,0,0,0,0,1,1,0]
[290,"2024-10-17","2024-10-17",4,8.4,null,"   Arbeitstag",null,null,null,null,0,80.400000000000006,1,0,0,0,0,0,0,1,1,0]
[291,"2024-10-18","2024-10-18",5,8.4,null,"   Arbeitstag",null,null,null,null,0,80.400000000000006,1,0,0,0,0,0,0,1,1,0]
[292,"2024-10-19","2024-10-19",6,0,null,"   Wochenende",null,null,null,null,0,80.400000000000006,1,0,0,0,0,1,0,1,1,0]
[293,"2024-10-20","2024-10-20",7,0,null,"   Wochenende",null,null,null,null,0,80.400000000000006,1,0,0,0,0,1,0,1,1,0]
[294,"2024-10-21","2024-10-21",1,8.4,null,"   Arbeitstag",null,null,null,null,0,80.400000000000006,1,0,0,0,0,0,0,1,1,0]
[295,"2024-10-22","2024-10-22",2,8.4,null,"   Arbeitstag",null,null,null,null,0,80.400000000000006,1,0,0,0,0,0,0,1,1,0]
[296,"2024-10-23","2024-10-23",3,8.4,null,"   Arbeitstag",null,null,null,null,0,80.400000000000006,1,0,0,0,0,0,0,1,1,0]
[297,"2024-10-24","2024-10-24",4,8.4,null,"   Arbeitstag",null,null,null,null,0,80.400000000000006,1,0,0,0,0,0,0,1,1,0]
[298,"2024-10-25","2024-10-25",5,8.4,null,"   Arbeitstag",null,null,null,null,0,80.400000000000006,1,0,0,0,0,0,0,1,1,0]
[299,"2024-10-26","2024-10-26",6,0,null,"   Wochenende",null,null,null,null,0,80.400000000000006,1,0,0,0,0,1,0,1,1,0]
[300,"2024-10-27","2024-10-27",7,0,null,"   Wochenende",null,null,null,null,0,80.400000000000006,1,0,0,0,0,1,0,1,1,0]
[301,"2024-10-28","2024-10-28",1,8.4,null,"   Arbeitstag",null,null,null,null,0,80.400000000000006,1,0,0,0,0,0,0,1,1,{"$f":"((R308-T308)>0)*1","v":0}]
[302,"2024-10-29","2024-10-29",2,8.4,null,"   Arbeitstag",null,null,null,null,0,80.400000000000006,1,0,0,0,0,0,0,1,1,0]
[303,"2024-10-30","2024-10-30",3,8.4,null,"   Arbeitstag",null,null,null,null,0,80.400000000000006,1,0,0,0,0,0,0,1,1,0]
[304,"2024-10-31","2024-10-31",4,8.4,null,"   Arbeitstag",null,null,null,null,0,80.400000000000006,1,0,0,0,0,0,0,1,1,0]
[305,"2024-11-01","2024-11-01",5,8.4,null,"   Arbeitstag",null,null,null,null,0,80.400000000000006,1,0,0,0,0,0,0,1,1,0]
[306,"2024-11-02","2024-11-02",6,0,null,"   Wochenende",null,null,null,null,0,80.400000000000006,1,0,0,0,0,1,0,1,1,0]
[307,"2024-11-03","2024-11-03",7,0,null,"   Wochenende",null,null,null,null,0,80.400000000000006,1,0,0,0,0,1,0,1,1,0]
[308,"2024-11-04","2024-11-04",1,8.4,null,"   Arbeitstag",null,null,null,null,0,80.400000000000006,1,0,0,0,0,0,0,1,1,0]
[309,"2024-11-05","2024-11-05",2,8.4,null,"   Arbeitstag",null,null,null,null,0,80.400000000000006,1,0,0,0,0,0,0,1,1,0]
[310,"2024-11-06","2024-11-06",3,8.4,null,"   Arbeitstag",null,null,null,null,0,80.400000000000006,1,0,0,0,0,0,0,1,1,0]
[311,"2024-11-07","2024-11-07",4,8.4,null,"   Arbeitstag",null,null,null,null,0,80.400000000000006,1,0,0,0,0,0,0,1,1,0]
[312,"2024-11-08","2024-11-08",5,8.4,null,"   Arbeitstag",null,null,null,null,0,80.400000000000006,1,0,0,0,0,0,0,1,1,0]
[313,"2024-11-09","2024-11-09",6,0,null,"   Wochenende",null,null,null,null,0,80.400000000000006,1,0,0,0,0,1,0,1,1,0]
[314,"2024-11-10","2024-11-10",7,0,null,"   Wochenende",null,null,null,null,0,80.400000000000006,1,0,0,0,0,1,0,1,1,0]
[315,"2024-11-11","2024-11-11",1,8.4,null,"   Arbeitstag",null,null,null,null,0,80.400000000000006,1,0,0,0,0,0,0,1,1,0]
[316,"2024-11-12","2024-11-12",2,8.4,null,"   Arbeitstag",null,null,null,null,0,80.400000000000006,1,0,0,0,0,0,0,1,1,0]
[317,"2024-11-13","2024-11-13",3,8.4,null,"   Arbeitstag",null,null,null,null,0,80.400000000000006,1,0,0,0,0,0,0,1,1,0]
[318,"2024-11-14","2024-11-14",4,8.4,null,"   Arbeitstag",null,null,null,null,0,80.400000000000006,1,0,0,0,0,0,0,1,1,0]
[319,"2024-11-15","2024-11-15",5,8.4,null,"   Arbeitstag",null,null,null,null,0,80.400000000000006,1,0,0,0,0,0,0,1,1,0]
[320,"2024-11-16","2024-11-16",6,{"$f":"IF(G327=\"   Wochenende\",0,IF(G327=\"   Arbeitstag\",HT_NAZ,IF(ISBLANK(F327),HT_NAZ-T327,F327)))","v":0},null,"   Wochenende",null,null,null,null,{"$f":"(HT_NAZ-E327)*(D327<6)+K327","v":0},80.400000000000006,{"$f":"VLOOKUP(B327,BGhelp,2)/100","v":1},0,{"$f":"IF(L327=0,0,(HT_NAZ-F327)*N327-Q327)","v":0},{"$f":"INDEX(Raz,U327,D327+2)","v":0},0,1,{"$f":"IF(AND(BezCode2=1,OR(G327=INDEX(LocFT,1,2),G327=INDEX(LocFT,2,2))),HT_NAZ/2,\nIF(AND(BezCode2=2,G327=INDEX(LocFT,3,2)),HT_NAZ,0))","v":0},{"$f":"VLOOKUP(B327,BGhelp,3)","v":1},{"$f":"ABS(Q327<=HT_NAZ)","v":1},0]
[321,"2024-11-17",{"$f":"B328","v":"2024-11-17"},{"$f":"WEEKDAY(B328,2)","v":7},0,null,{"$f":"IF(ISBLANK(I328),IF(ISBLANK(H328),IF(D328<6,\"   Arbeitstag\",\"   Wochenende\"),H328),I328)","v":"   Wochenende"},null,null,null,null,0,{"$f":"M327+L328","v":80.400000000000006},1,{"$f":"ROUND(L328*N328,2)","v":0},0,0,{"$f":"MIN(Q328,F328)","v":0},{"$f":"OR(E328=0,D328>5)*1","v":1},0,1,1,0]
[322,{"$f":"$B$7+A329","v":"2024-11-18"},"2024-11-18",1,8.4,null,"   Arbeitstag",null,null,null,null,0,80.400000000000006,1,0,0,0,0,0,0,1,1,0]
[323,"2024-11-19","2024-11-19",2,8.4,null,"   Arbeitstag",null,null,null,null,0,80.400000000000006,1,0,0,0,0,0,0,1,1,0]
[324,"2024-11-20","2024-11-20",3,8.4,null,"   Arbeitstag",null,null,null,null,0,80.400000000000006,1,0,0,0,0,0,0,1,1,0]
[325,"2024-11-21","2024-11-21",4,8.4,null,"   Arbeitstag",null,null,null,null,0,80.400000000000006,1,0,0,0,0,0,0,1,1,0]
[326,"2024-11-22","2024-11-22",5,8.4,null,"   Arbeitstag",null,null,null,null,0,80.400000000000006,1,0,0,0,0,0,0,1,1,0]
[327,"2024-11-23","2024-11-23",6,0,null,"   Wochenende",null,null,null,null,0,80.400000000000006,1,0,0,0,0,1,0,1,1,0]
[328,"2024-11-24","2024-11-24",7,0,null,"   Wochenende",null,null,null,null,0,80.400000000000006,1,0,0,0,0,1,0,1,1,0]
[329,"2024-11-25","2024-11-25",1,8.4,null,"   Arbeitstag",null,null,null,null,0,80.400000000000006,1,0,0,0,0,0,0,1,1,0]
[330,"2024-11-26","2024-11-26",2,8.4,null,"   Arbeitstag",null,null,null,null,0,80.400000000000006,1,0,0,0,0,0,0,1,1,0]
[331,"2024-11-27","2024-11-27",3,8.4,null,"   Arbeitstag",null,null,null,null,0,80.400000000000006,1,0,0,0,0,0,0,1,1,0]
[332,"2024-11-28","2024-11-28",4,8.4,null,"   Arbeitstag",null,null,null,null,0,80.400000000000006,1,0,0,0,0,0,0,1,1,0]
[333,"2024-11-29","2024-11-29",5,8.4,null,"   Arbeitstag",null,null,null,null,0,80.400000000000006,1,0,0,0,0,0,0,1,1,0]
[334,"2024-11-30","2024-11-30",6,0,null,"   Wochenende",null,null,null,null,0,80.400000000000006,1,0,0,0,0,1,0,1,1,0]
[335,"2024-12-01","2024-12-01",7,0,null,"   Wochenende",null,null,null,null,0,80.400000000000006,1,0,0,0,0,1,0,1,1,0]
[336,"2024-12-02","2024-12-02",1,8.4,null,"   Arbeitstag",null,null,null,null,0,80.400000000000006,1,0,0,0,0,0,0,1,1,0]
[337,"2024-12-03","2024-12-03",2,8.4,null,"   Arbeitstag",null,null,null,null,0,80.400000000000006,1,0,0,0,0,0,0,1,1,0]
[338,"2024-12-04","2024-12-04",3,8.4,null,"   Arbeitstag",null,null,null,null,0,80.400000000000006,1,0,0,0,0,0,0,1,1,0]
[339,"2024-12-05","2024-12-05",4,8.4,null,"   Arbeitstag",null,null,null,null,0,80.400000000000006,1,0,0,0,0,0,0,1,1,0]
[340,"2024-12-06","2024-12-06",5,8.4,null,"   Arbeitstag",null,null,null,null,0,80.400000000000006,1,0,0,0,0,0,0,1,1,0]
[341,"2024-12-07","2024-12-07",6,0,null,"   Wochenende",null,null,null,null,0,80.400000000000006,1,0,0,0,0,1,0,1,1,0]
[342,"2024-12-08","2024-12-08",7,0,null,"   Wochenende",null,null,null,null,0,80.400000000000006,1,0,0,0,0,1,0,1,1,0]
[343,"2024-12-09","2024-12-09",1,8.4,null,"   Arbeitstag",null,null,null,null,0,80.400000000000006,1,0,0,0,0,0,0,1,1,0]
[344,"2024-12-10","2024-12-10",2,8.4,null,"   Arbeitstag",null,null,null,null,0,80.400000000000006,1,0,0,0,0,0,0,1,1,0]
[345,"2024-12-11","2024-12-11",3,8.4,null,"   Arbeitstag",null,null,null,null,0,80.400000000000006,1,0,0,0,0,0,0,1,1,0]
[346,"2024-12-12","2024-12-12",4,8.4,null,"   Arbeitstag",null,null,null,null,0,80.400000000000006,1,0,0,0,0,0,0,1,1,0]
[347,"2024-12-13","2024-12-13",5,8.4,null,"   Arbeitstag",null,null,null,null,0,80.400000000000006,1,0,0,0,0,0,0,1,1,0]
[348,"2024-12-14","2024-12-14",6,0,null,"   Wochenende",null,null,null,null,0,80.400000000000006,1,0,0,0,0,1,0,1,1,0]
[349,"2024-12-15","2024-12-15",7,0,null,"   Wochenende",null,null,null,null,0,80.400000000000006,1,0,0,0,0,1,0,1,1,0]
[350,"2024-12-16","2024-12-16",1,8.4,null,"   Arbeitstag",null,null,null,null,0,80.400000000000006,1,0,0,0,0,0,0,1,1,0]
[351,"2024-12-17","2024-12-17",2,8.4,null,"   Arbeitstag",null,null,null,null,0,80.400000000000006,1,0,0,0,0,0,0,1,1,0]
[352,"2024-12-18","2024-12-18",3,8.4,null,"   Arbeitstag",null,null,null,null,0,80.400000000000006,1,0,0,0,0,0,0,1,1,0]
[353,"2024-12-19","2024-12-19",4,8.4,null,"   Arbeitstag",null,null,null,null,0,80.400000000000006,1,0,0,0,0,0,0,1,1,0]
[354,"2024-12-20","2024-12-20",5,8.4,null,"   Arbeitstag",null,null,null,null,0,80.400000000000006,1,0,0,0,0,0,0,1,1,0]
[355,"2024-12-21","2024-12-21",6,0,null,"   Wochenende",null,null,null,null,0,80.400000000000006,1,0,0,0,0,1,0,1,1,0]
[356,"2024-12-22","2024-12-22",7,0,null,"   Wochenende",null,null,null,null,0,80.400000000000006,1,0,0,0,0,1,0,1,1,0]
[357,"2024-12-23","2024-12-23",1,8.4,null,"   Arbeitstag",null,null,null,null,0,80.400000000000006,1,0,0,0,0,0,0,1,1,0]
[358,"2024-12-24","2024-12-24",2,4.2,4.2,"Heiligabend","Heiligabend",null,null,null,4.2,84.600000000000009,1,4.2,4.2,0,0,0,0,1,1,0]
[359,"2024-12-25","2024-12-25",3,0,0,"Weihnachten","Weihnachten",null,null,null,8.4,93.000000000000014,1,8.4,8.4,0,0,1,0,1,1,0]
[360,"2024-12-26","2024-12-26",4,0,0,"Stephanstag","Stephanstag",null,null,null,8.4,101.40000000000002,1,8.4,8.4,0,0,1,0,1,1,0]
[361,"2024-12-27","2024-12-27",5,8.4,null,"   Arbeitstag",null,null,null,null,0,101.40000000000002,1,0,0,0,0,0,0,1,1,0]
[362,"2024-12-28","2024-12-28",6,0,null,"   Wochenende",null,null,null,null,0,101.40000000000002,1,0,0,0,0,1,0,1,1,0]
[363,"2024-12-29","2024-12-29",7,0,null,"   Wochenende",null,null,null,null,0,101.40000000000002,1,0,0,0,0,1,0,1,1,0]
[364,"2024-12-30","2024-12-30",1,8.4,null,"   Arbeitstag",null,null,null,null,0,101.40000000000002,1,0,0,0,0,0,0,1,1,0]
[365,"2024-12-31",{"$f":"B372","v":"2024-12-31"},{"$f":"WEEKDAY(B372,2)","v":2},{"$f":"IF(YEAR(B372)=F1,IF(G372=\"   Wochenende\",0,IF(G372=\"   Arbeitstag\",HT_NAZ,IF(ISBLANK(F372),HT_NAZ-T372,F372)))*(YEAR(B372)=F1),0)","v":6},6,{"$f":"IF(ISBLANK(I372),IF(ISBLANK(H372),IF(D372<6,\"   Arbeitstag\",\"   Wochenende\"),H372),I372)","v":"Silvester"},"Silvester",null,null,null,{"$f":"((HT_NAZ-E372)*(D372<6)+K372)*(YEAR(B372)=F1)","v":2.4000000000000004},{"$f":"(M371+L372)*(YEAR(B372)=F1)","v":103.80000000000003},{"$f":"IF(YEAR(B372)=F1,VLOOKUP(B372,BGhelp,2)/100,0)","v":1},{"$f":"ROUND(L372*N372,2)*(YEAR(B372)=F1)","v":2.4},{"$f":"(P371+O372)*(YEAR(B372)=F1)","v":2.4},{"$f":"IF((YEAR(B372)=F1),INDEX(Raz,U372,D372+2),0)","v":0},{"$f":"IF((YEAR(B372)=F1),MIN(Q372,F372),0)","v":0},{"$f":"IF((YEAR(B372)=F1),OR(E372=0,D372>5)*1,0)","v":0},{"$f":"IF((YEAR(B372)=F1),IF(AND(BezCode2=1,OR(G372=INDEX(LocFT,1,2),G372=INDEX(LocFT,2,2))),HT_NAZ/2,\nIF(AND(BezCode2=2,G372=INDEX(LocFT,3,2)),HT_NAZ,0)),0)","v":0},{"$f":"IF((YEAR(B372)=F1),VLOOKUP(B372,BGhelp,3),0)","v":1},1,{"$f":"((R372-T372)>0)*1","v":0}]
[]
[null,"Die letzte Zeile 372 hat erweiterte Formeln, um die Verschiebung ohne den 29. Februar abzufangen. Dieses Datum ist ohne Schalttag immer der 1.1. des nächsten Jahres, sonst der 31.12."]

{"sheet":"Verweise","index":20,"n_rows":139,"n_cols":22,"rows_kept":139,"cut":false,"hidden":true,"merged":[[3,3,3,4],[1,3,1,4],[51,13,51,15],[2,3,2,17],[127,4,138,9],[127,13,138,18]]}
[null,{"$f":"Zerf_Version & \" \" & Zerf_T","v":"Version VSA 1.06 "}]
[null,null,null,"Jahresanspruch",null,"Total","Januar","Februar","März","April","Mai","Juni","Juli","August","September","Oktober","November","Dezember"]
[null,"Vortrag",null,"Überträge für"]
[null,"Überträge Spalten AJ",null,"Januar",null,"Januar","Februar","März","April","Mai","Juni","Juli","August","September","Oktober","November","Dezember","Jan. Neu"]
[null,null,"Verweisspalte / Zeile",2,3,4,5,6,7,8,9,10,11,12,13,14,15,16]
[{"$f":"C6","v":14},"Total Arbeitszeit (IST)",14]
[{"$f":"C7","v":15},"Netto-SOLL-Arbeitszeit",15]
[18,"AZ-Saldo",18,0,{"$f":"Basisblatt!H25","v":0},{"$f":"SUM(D8:E8)","v":0},{"$f":"Januar!AJ18","v":16.8},{"$f":"Februar!AJ18","v":16.8},{"$f":"März!AJ18","v":16.8},{"$f":"April!AJ18","v":16.8},{"$f":"Mai!AJ18","v":16.8},{"$f":"Juni!AJ18","v":16.8},{"$f":"Juli!AJ18","v":16.8},{"$f":"August!AJ18","v":16.8},{"$f":"September!AJ18","v":16.8},{"$f":"Oktober!AJ18","v":16.8},{"$f":"November!AJ18","v":16.8},{"$f":"Dezember!AJ18","v":16.8}]
[19,"Feiertagsanspruch",19,0,0,{"$f":"SUM(D9:E9)","v":0},{"$f":"Januar!AJ19","v":0},{"$f":"Februar!AJ19","v":0},{"$f":"März!AJ19","v":0},{"$f":"April!AJ19","v":0},{"$f":"Mai!AJ19","v":0},{"$f":"Juni!AJ19","v":0},{"$f":"Juli!AJ19","v":0},{"$f":"August!AJ19","v":0},{"$f":"September!AJ19","v":0},{"$f":"Oktober!AJ19","v":0},{"$f":"November!AJ19","v":0},{"$f":"Dezember!AJ19","v":0},null,null,null,1]
[20,"Ferien",20,0,{"$f":"Basisblatt!H26","v":0},0,{"$f":"Januar!AJ20","v":0},{"$f":"Februar!AJ20","v":0},{"$f":"März!AJ20","v":0},{"$f":"April!AJ20","v":0},{"$f":"Mai!AJ20","v":0},{"$f":"Juni!AJ20","v":0},{"$f":"Juli!AJ20","v":0},{"$f":"August!AJ20","v":0},{"$f":"September!AJ20","v":0},{"$f":"Oktober!AJ20","v":0},{"$f":"November!AJ20","v":0},{"$f":"Dezember!AJ20","v":0}]
[21,{"$f":"B_KompAZ","v":"Kompensation Arbeitstage"},21,0,{"$f":"Basisblatt!H30","v":0},0,{"$f":"Januar!AJ21","v":0},{"$f":"Februar!AJ21","v":0},{"$f":"März!AJ21","v":0},{"$f":"April!AJ21","v":0},{"$f":"Mai!AJ21","v":0},{"$f":"Juni!AJ21","v":0},{"$f":"Juli!AJ21","v":0},{"$f":"August!AJ21","v":0},{"$f":"September!AJ21","v":0},{"$f":"Oktober!AJ21","v":0},{"$f":"November!AJ21","v":0},{"$f":"Dezember!AJ21","v":0}]
[22,"Arztbesuch",22,0,0,0,{"$f":"Januar!AJ22","v":0},{"$f":"Februar!AJ22","v":0},{"$f":"März!AJ22","v":0},{"$f":"April!AJ22","v":0},{"$f":"Mai!AJ22","v":0},{"$f":"Juni!AJ22","v":0},{"$f":"Juli!AJ22","v":0},{"$f":"August!AJ22","v":0},{"$f":"September!AJ22","v":0},{"$f":"Oktober!AJ22","v":0},{"$f":"November!AJ22","v":0},{"$f":"Dezember!AJ22","v":0}]
[23,"Krankheit",23,0,0,0,{"$f":"Januar!AJ23","v":0},{"$f":"Februar!AJ23","v":0},{"$f":"März!AJ23","v":0},{"$f":"April!AJ23","v":0},{"$f":"Mai!AJ23","v":0},{"$f":"Juni!AJ23","v":0},{"$f":"Juli!AJ23","v":0},{"$f":"August!AJ23","v":0},{"$f":"September!AJ23","v":0},{"$f":"Oktober!AJ23","v":0},{"$f":"November!AJ23","v":0},{"$f":"Dezember!AJ23","v":0}]
[24,"Berufsunfall",24,0,0,0,{"$f":"Januar!AJ24","v":0},{"$f":"Februar!AJ24","v":0},{"$f":"März!AJ24","v":0},{"$f":"April!AJ24","v":0},{"$f":"Mai!AJ24","v":0},{"$f":"Juni!AJ24","v":0},{"$f":"Juli!AJ24","v":0},{"$f":"August!AJ24","v":0},{"$f":"September!AJ24","v":0},{"$f":"Oktober!AJ24","v":0},{"$f":"November!AJ24","v":0},{"$f":"Dezember!AJ24","v":0}]
[25,"Nichtberufsunfall",25,0,0,0,{"$f":"Januar!AJ25","v":0},{"$f":"Februar!AJ25","v":0},{"$f":"März!AJ25","v":0},{"$f":"April!AJ25","v":0},{"$f":"Mai!AJ25","v":0},{"$f":"Juni!AJ25","v":0},{"$f":"Juli!AJ25","v":0},{"$f":"August!AJ25","v":0},{"$f":"September!AJ25","v":0},{"$f":"Oktober!AJ25","v":0},{"$f":"November!AJ25","v":0},{"$f":"Dezember!AJ25","v":0}]
[26,"Militär / Zivilschutz",26,0,0,0,{"$f":"Januar!AJ26","v":0},{"$f":"Februar!AJ26","v":0},{"$f":"März!AJ26","v":0},{"$f":"April!AJ26","v":0},{"$f":"Mai!AJ26","v":0},{"$f":"Juni!AJ26","v":0},{"$f":"Juli!AJ26","v":0},{"$f":"August!AJ26","v":0},{"$f":"September!AJ26","v":0},{"$f":"Oktober!AJ26","v":0},{"$f":"November!AJ26","v":0},{"$f":"Dezember!AJ26","v":0}]
[27,"Unbezahlter Urlaub",27,0,{"$f":"Basisblatt!H28","v":0},0,{"$f":"Januar!AJ27","v":0},{"$f":"Februar!AJ27","v":0},{"$f":"März!AJ27","v":0},{"$f":"April!AJ27","v":0},{"$f":"Mai!AJ27","v":0},{"$f":"Juni!AJ27","v":0},{"$f":"Juli!AJ27","v":0},{"$f":"August!AJ27","v":0},{"$f":"September!AJ27","v":0},{"$f":"Oktober!AJ27","v":0},{"$f":"November!AJ27","v":0},{"$f":"Dezember!AJ27","v":0}]
[28,"Bezahlter Urlaub",28,0,{"$f":"Basisblatt!H29","v":0},0,{"$f":"Januar!AJ28","v":0},{"$f":"Februar!AJ28","v":0},{"$f":"März!AJ28","v":0},{"$f":"April!AJ28","v":0},{"$f":"Mai!AJ28","v":0},{"$f":"Juni!AJ28","v":0},{"$f":"Juli!AJ28","v":0},{"$f":"August!AJ28","v":0},{"$f":"September!AJ28","v":0},{"$f":"Oktober!AJ28","v":0},{"$f":"November!AJ28","v":0},{"$f":"Dezember!AJ28","v":0}]
[29,"Nebenbeschäftigung",29,0,{"$f":"Basisblatt!H31","v":0},0,{"$f":"Januar!AJ29","v":0},{"$f":"Februar!AJ29","v":0},{"$f":"März!AJ29","v":0},{"$f":"April!AJ29","v":0},{"$f":"Mai!AJ29","v":0},{"$f":"Juni!AJ29","v":0},{"$f":"Juli!AJ29","v":0},{"$f":"August!AJ29","v":0},{"$f":"September!AJ29","v":0},{"$f":"Oktober!AJ29","v":0},{"$f":"November!AJ29","v":0},{"$f":"Dezember!AJ29","v":0}]
[30,"D A G",30,0,{"$f":"Basisblatt!H27","v":0},0,{"$f":"Januar!AJ30","v":0},{"$f":"Februar!AJ30","v":0},{"$f":"März!AJ30","v":0},{"$f":"April!AJ30","v":0},{"$f":"Mai!AJ30","v":0},{"$f":"Juni!AJ30","v":0},{"$f":"Juli!AJ30","v":0},{"$f":"August!AJ30","v":0},{"$f":"September!AJ30","v":0},{"$f":"Oktober!AJ30","v":0},{"$f":"November!AJ30","v":0},{"$f":"Dezember!AJ30","v":0}]
[31,"Diverses",31,0,0,0,{"$f":"Januar!AJ31","v":0},{"$f":"Februar!AJ31","v":0},{"$f":"März!AJ31","v":0},{"$f":"April!AJ31","v":0},{"$f":"Mai!AJ31","v":0},{"$f":"Juni!AJ31","v":0},{"$f":"Juli!AJ31","v":0},{"$f":"August!AJ31","v":0},{"$f":"September!AJ31","v":0},{"$f":"Oktober!AJ31","v":0},{"$f":"November!AJ31","v":0},{"$f":"Dezember!AJ31","v":0}]
[32,"Fam./pers. Ereignisse",32,0,0,0,{"$f":"Januar!AJ32","v":0},{"$f":"Februar!AJ32","v":0},{"$f":"März!AJ32","v":0},{"$f":"April!AJ32","v":0},{"$f":"Mai!AJ32","v":0},{"$f":"Juni!AJ32","v":0},{"$f":"Juli!AJ32","v":0},{"$f":"August!AJ32","v":0},{"$f":"September!AJ32","v":0},{"$f":"Oktober!AJ32","v":0},{"$f":"November!AJ32","v":0},{"$f":"Dezember!AJ32","v":0}]
[33,"freie Zeile 1",33,0,0,0,{"$f":"Januar!AJ33","v":0},{"$f":"Februar!AJ33","v":0},{"$f":"März!AJ33","v":0},{"$f":"April!AJ33","v":0},{"$f":"Mai!AJ33","v":0},{"$f":"Juni!AJ33","v":0},{"$f":"Juli!AJ33","v":0},{"$f":"August!AJ33","v":0},{"$f":"September!AJ33","v":0},{"$f":"Oktober!AJ33","v":0},{"$f":"November!AJ33","v":0},{"$f":"Dezember!AJ33","v":0}]
[34,"freie Zeile 2",34,0,0,0,{"$f":"Januar!AJ34","v":0},{"$f":"Februar!AJ34","v":0},{"$f":"März!AJ34","v":0},{"$f":"April!AJ34","v":0},{"$f":"Mai!AJ34","v":0},{"$f":"Juni!AJ34","v":0},{"$f":"Juli!AJ34","v":0},{"$f":"August!AJ34","v":0},{"$f":"September!AJ34","v":0},{"$f":"Oktober!AJ34","v":0},{"$f":"November!AJ34","v":0},{"$f":"Dezember!AJ34","v":0}]
[null,"Weiterbildung",35,0,0,0,{"$f":"Januar!AJ35","v":0},{"$f":"Februar!AJ35","v":0},{"$f":"März!AJ35","v":0},{"$f":"April!AJ35","v":0},{"$f":"Mai!AJ35","v":0},{"$f":"Juni!AJ35","v":0},{"$f":"Juli!AJ35","v":0},{"$f":"August!AJ35","v":0},{"$f":"September!AJ35","v":0},{"$f":"Oktober!AJ35","v":0},{"$f":"November!AJ35","v":0},{"$f":"Dezember!AJ35","v":0}]
[36,"frei einsetzbare Lekt.",36,0,0,0,{"$f":"Januar!AJ36","v":0},{"$f":"Februar!AJ36","v":0},{"$f":"März!AJ36","v":0},{"$f":"April!AJ36","v":0},{"$f":"Mai!AJ36","v":0},{"$f":"Juni!AJ36","v":0},{"$f":"Juli!AJ36+Basisblatt!E33","v":0},{"$f":"August!AJ36","v":0},{"$f":"September!AJ36","v":0},{"$f":"Oktober!AJ36","v":0},{"$f":"November!AJ36","v":0},{"$f":"Dezember!AJ36","v":0}]
[]
[null,"Total"]
[null,"Summen Spalten AI",null,null,"Januar","Februar","März","April","Mai","Juni","Juli","August","September","Oktober","November","Dezember"]
[null,null,"Verweisspalte / Zeile",null,3,4,5,6,7,8,9,10,11,12,13,14]
[{"$f":"C31","v":14},{"$f":"B_TotalAZist","v":"Total Arbeitszeit (IST)"},14,null,{"$f":"Januar!AI14","v":0},{"$f":"Februar!AI14","v":0},{"$f":"März!AI14","v":0},{"$f":"April!AI14","v":0},{"$f":"Mai!AI14","v":0},{"$f":"Juni!AI14","v":0},{"$f":"Juli!AI14","v":0},{"$f":"August!AI14","v":0},{"$f":"September!AI14","v":0},{"$f":"Oktober!AI14","v":0},{"$f":"November!AI14","v":0},{"$f":"Dezember!AI14","v":0}]
[{"$f":"C32","v":15},{"$f":"B_NettoSollAZ","v":"Netto-SOLL-Arbeitszeit"},15,null,{"$f":"Januar!AI15","v":-16.8},{"$f":"Februar!AI15","v":-8.4},{"$f":"März!AI15","v":-10.8},{"$f":"April!AI15","v":-8.4},{"$f":"Mai!AI15","v":-27.6},{"$f":"Juni!AI15","v":0},{"$f":"Juli!AI15","v":0},{"$f":"August!AI15","v":-8.4},{"$f":"September!AI15","v":0},{"$f":"Oktober!AI15","v":0},{"$f":"November!AI15","v":0},{"$f":"Dezember!AI15","v":-23.4}]
[18,{"$f":"B_AZSaldo","v":"AZ - Saldo"},18,null,{"$f":"Januar!AJ18","v":16.8},{"$f":"Februar!AJ18","v":16.8},{"$f":"März!AJ18","v":16.8},{"$f":"April!AJ18","v":16.8},{"$f":"Mai!AJ18","v":16.8},{"$f":"Juni!AJ18","v":16.8},{"$f":"Juli!AJ18","v":16.8},{"$f":"August!AJ18","v":16.8},{"$f":"September!AJ18","v":16.8},{"$f":"Oktober!AJ18","v":16.8},{"$f":"November!AJ18","v":16.8},{"$f":"Dezember!AJ18","v":16.8}]
[19,"Feiertagsanspruch",19,null,{"$f":"Januar!AI19","v":16.8},{"$f":"Februar!AI19","v":8.4},{"$f":"März!AI19","v":10.8},{"$f":"April!AI19","v":8.4},{"$f":"Mai!AI19","v":27.6},{"$f":"Juni!AI19","v":0},{"$f":"Juli!AI19","v":0},{"$f":"August!AI19","v":8.4},{"$f":"September!AI19","v":0},{"$f":"Oktober!AI19","v":0},{"$f":"November!AI19","v":0},{"$f":"Dezember!AI19","v":23.4}]
[20,"Ferien",20,null,{"$f":"Januar!AI20","v":0},{"$f":"Februar!AI20","v":0},{"$f":"März!AI20","v":0},{"$f":"April!AI20","v":0},{"$f":"Mai!AI20","v":0},{"$f":"Juni!AI20","v":0},{"$f":"Juli!AI20","v":0},{"$f":"August!AI20","v":0},{"$f":"September!AI20","v":0},{"$f":"Oktober!AI20","v":0},{"$f":"November!AI20","v":0},{"$f":"Dezember!AI20","v":0}]
[21,{"$f":"B_KompAZ","v":"Kompensation Arbeitstage"},21,null,{"$f":"Januar!AI21","v":0},{"$f":"Februar!AI21","v":0},{"$f":"März!AI21","v":0},{"$f":"April!AI21","v":0},{"$f":"Mai!AI21","v":0},{"$f":"Juni!AI21","v":0},{"$f":"Juli!AI21","v":0},{"$f":"August!AI21","v":0},{"$f":"September!AI21","v":0},{"$f":"Oktober!AI21","v":0},{"$f":"November!AI21","v":0},{"$f":"Dezember!AI21","v":0}]
[22,"Arztbesuch",22,null,{"$f":"Januar!AI22","v":0},{"$f":"Februar!AI22","v":0},{"$f":"März!AI22","v":0},{"$f":"April!AI22","v":0},{"$f":"Mai!AI22","v":0},{"$f":"Juni!AI22","v":0},{"$f":"Juli!AI22","v":0},{"$f":"August!AI22","v":0},{"$f":"September!AI22","v":0},{"$f":"Oktober!AI22","v":0},{"$f":"November!AI22","v":0},{"$f":"Dezember!AI22","v":0}]
[23,"Krankheit",23,null,{"$f":"Januar!AI23","v":0},{"$f":"Februar!AI23","v":0},{"$f":"März!AI23","v":0},{"$f":"April!AI23","v":0},{"$f":"Mai!AI23","v":0},{"$f":"Juni!AI23","v":0},{"$f":"Juli!AI23","v":0},{"$f":"August!AI23","v":0},{"$f":"September!AI23","v":0},{"$f":"Oktober!AI23","v":0},{"$f":"November!AI23","v":0},{"$f":"Dezember!AI23","v":0}]
[24,"Berufsunfall",24,null,{"$f":"Januar!AI24","v":0},{"$f":"Februar!AI24","v":0},{"$f":"März!AI24","v":0},{"$f":"April!AI24","v":0},{"$f":"Mai!AI24","v":0},{"$f":"Juni!AI24","v":0},{"$f":"Juli!AI24","v":0},{"$f":"August!AI24","v":0},{"$f":"September!AI24","v":0},{"$f":"Oktober!AI24","v":0},{"$f":"November!AI24","v":0},{"$f":"Dezember!AI24","v":0}]
[25,"Nichtberufsunfall",25,null,{"$f":"Januar!AI25","v":0},{"$f":"Februar!AI25","v":0},{"$f":"März!AI25","v":0},{"$f":"April!AI25","v":0},{"$f":"Mai!AI25","v":0},{"$f":"Juni!AI25","v":0},{"$f":"Juli!AI25","v":0},{"$f":"August!AI25","v":0},{"$f":"September!AI25","v":0},{"$f":"Oktober!AI25","v":0},{"$f":"November!AI25","v":0},{"$f":"Dezember!AI25","v":0}]
[26,"Militär / Zivilschutz",26,null,{"$f":"Januar!AI26","v":0},{"$f":"Februar!AI26","v":0},{"$f":"März!AI26","v":0},{"$f":"April!AI26","v":0},{"$f":"Mai!AI26","v":0},{"$f":"Juni!AI26","v":0},{"$f":"Juli!AI26","v":0},{"$f":"August!AI26","v":0},{"$f":"September!AI26","v":0},{"$f":"Oktober!AI26","v":0},{"$f":"November!AI26","v":0},{"$f":"Dezember!AI26","v":0}]
[27,"Unbezahlter Urlaub",27,null,{"$f":"Januar!AI27","v":0},{"$f":"Februar!AI27","v":0},{"$f":"März!AI27","v":0},{"$f":"April!AI27","v":0},{"$f":"Mai!AI27","v":0},{"$f":"Juni!AI27","v":0},{"$f":"Juli!AI27","v":0},{"$f":"August!AI27","v":0},{"$f":"September!AI27","v":0},{"$f":"Oktober!AI27","v":0},{"$f":"November!AI27","v":0},{"$f":"Dezember!AI27","v":0}]
[28,"Bezahlter Urlaub",28,null,{"$f":"Januar!AI28","v":0},{"$f":"Februar!AI28","v":0},{"$f":"März!AI28","v":0},{"$f":"April!AI28","v":0},{"$f":"Mai!AI28","v":0},{"$f":"Juni!AI28","v":0},{"$f":"Juli!AI28","v":0},{"$f":"August!AI28","v":0},{"$f":"September!AI28","v":0},{"$f":"Oktober!AI28","v":0},{"$f":"November!AI28","v":0},{"$f":"Dezember!AI28","v":0}]
[29,"Nebenbeschäftigung",29,null,{"$f":"Januar!AI29","v":0},{"$f":"Februar!AI29","v":0},{"$f":"März!AI29","v":0},{"$f":"April!AI29","v":0},{"$f":"Mai!AI29","v":0},{"$f":"Juni!AI29","v":0},{"$f":"Juli!AI29","v":0},{"$f":"August!AI29","v":0},{"$f":"September!AI29","v":0},{"$f":"Oktober!AI29","v":0},{"$f":"November!AI29","v":0},{"$f":"Dezember!AI29","v":0}]
[30,"D A G",30,null,{"$f":"Januar!AI30","v":0},{"$f":"Februar!AI30","v":0},{"$f":"März!AI30","v":0},{"$f":"April!AI30","v":0},{"$f":"Mai!AI30","v":0},{"$f":"Juni!AI30","v":0},{"$f":"Juli!AI30","v":0},{"$f":"August!AI30","v":0},{"$f":"September!AI30","v":0},{"$f":"Oktober!AI30","v":0},{"$f":"November!AI30","v":0},{"$f":"Dezember!AI30","v":0}]
[31,"Diverses",31,null,{"$f":"Januar!AI31","v":0},{"$f":"Februar!AI31","v":0},{"$f":"März!AI31","v":0},{"$f":"April!AI31","v":0},{"$f":"Mai!AI31","v":0},{"$f":"Juni!AI31","v":0},{"$f":"Juli!AI31","v":0},{"$f":"August!AI31","v":0},{"$f":"September!AI31","v":0},{"$f":"Oktober!AI31","v":0},{"$f":"November!AI31","v":0},{"$f":"Dezember!AI31","v":0}]
[32,"Fam./pers. Ereignisse",32,null,{"$f":"Januar!AI32","v":0},{"$f":"Februar!AI32","v":0},{"$f":"März!AI32","v":0},{"$f":"April!AI32","v":0},{"$f":"Mai!AI32","v":0},{"$f":"Juni!AI32","v":0},{"$f":"Juli!AI32","v":0},{"$f":"August!AI32","v":0},{"$f":"September!AI32","v":0},{"$f":"Oktober!AI32","v":0},{"$f":"November!AI32","v":0},{"$f":"Dezember!AI32","v":0}]
[33,"freie Zeile 1",33,null,{"$f":"Januar!AI33","v":0},{"$f":"Februar!AI33","v":0},{"$f":"März!AI33","v":0},{"$f":"April!AI33","v":0},{"$f":"Mai!AI33","v":0},{"$f":"Juni!AI33","v":0},{"$f":"Juli!AI33","v":0},{"$f":"August!AI33","v":0},{"$f":"September!AI33","v":0},{"$f":"Oktober!AI33","v":0},{"$f":"November!AI33","v":0},{"$f":"Dezember!AI33","v":0}]
[34,"freie Zeile 2",34,null,{"$f":"Januar!AI34","v":0},{"$f":"Februar!AI34","v":0},{"$f":"März!AI34","v":0},{"$f":"April!AI34","v":0},{"$f":"Mai!AI34","v":0},{"$f":"Juni!AI34","v":0},{"$f":"Juli!AI34","v":0},{"$f":"August!AI34","v":0},{"$f":"September!AI34","v":0},{"$f":"Oktober!AI34","v":0},{"$f":"November!AI34","v":0},{"$f":"Dezember!AI34","v":0}]
[null,"Weiterbildung",35,null,{"$f":"Januar!AI35","v":0},{"$f":"Februar!AI35","v":0},{"$f":"März!AI35","v":0},{"$f":"April!AI35","v":0},{"$f":"Mai!AI35","v":0},{"$f":"Juni!AI35","v":0},{"$f":"Juli!AI35","v":0},{"$f":"August!AI35","v":0},{"$f":"September!AI35","v":0},{"$f":"Oktober!AI35","v":0},{"$f":"November!AI35","v":0},{"$f":"Dezember!AI35","v":0}]
[36,"frei einsetzbare Lekt.",36,null,{"$f":"Januar!AI36","v":0},{"$f":"Februar!AI36","v":0},{"$f":"März!AI36","v":0},{"$f":"April!AI36","v":0},{"$f":"Mai!AI36","v":0},{"$f":"Juni!AI36","v":0},{"$f":"Juli!AI36","v":0},{"$f":"August!AI36","v":0},{"$f":"September!AI36","v":0},{"$f":"Oktober!AI36","v":0},{"$f":"November!AI36","v":0},{"$f":"Dezember!AI36","v":0}]
[null,null,null,null,null,null,null,null,null,null,null,null,null,{"$f":"Zerf_Version","v":"Version VSA 1.06"}]
[null,"Ferienanspruch",null,null,null,null,null,"Verif. Bezeichnung Lokale Feiertage"]
[null,null,"Alter (Sprung)","Stunden","( in Tagen)",null,"(Index)","LocFT"]
[null,"Zu Jung",-10000,0,{"$f":"D55/8.4","v":0},null,1,1,"Sechseläuten"]
[null,"Alter <=20",14,226.8,{"$f":"D56/8.4","v":27},null,2,1,"Knabenschiessen"]
[null,"Alter 21…49",21,210,25,null,3,2,"Fasnachtsmontag"]
[null,"Alter 50…59",50,226.8,27,null,4]
[null,"Alter 60+",60,268.8,32]
[null,"Zu alt",90,0,0]
[]
[]
[null,null,null,"Begriffe auf den Monatsblättern"]
[null,"Benannte Felder","Anzeige",null,null,null,"Erklärendes"]
[null,"B_Gde","Gde:",null,null,null,"Gemeinde"]
[null,"B_Schule","Schule:",null,null,null,"Bezeichnung der Schule"]
[null,"B_Name","Name:",null,null,null,"Name des Benutzers der Zeiterfassung"]
[null,"B_Bg","BG:",null,null,null,"Beschäftigungsgrad"]
[null,"B_L1","1 Personalführung"]
[null,"B_L2","2 Schüler/innen & Eltern"]
[null,"B_L3","3 Päd. Führung, Q-Arbeit"]
[null,"B_L4","4 Organisation, Administration",null,null,null,"Leistungs-Nummern und Bezeichnungen"]
[null,"B_L5","5 Kommunikation intern / extern"]
[null,"B_L6","6 Koordination SL, GSP"]
[null,"B_L7","7 Weiterbildung"]
[null,"B_PrZeit","Präsenzzeit"]
[null,"B_TotalAZist","Total Arbeitszeit (IST)"]
[null,"B_NettoSollAZ","Netto-SOLL-Arbeitszeit"]
[null,"B_BruttoSollAZ","Brutto-SOLL-Arb.zeit"]
[null,"B_MehrMinder","Mehr-/Minderleistung"]
[null,"B_AZSaldo","AZ - Saldo"]
[null,"B_FTA","Feiertagsanspruch"]
[null,"B_FTS","Feiertagssaldo"]
[null,"B_KompFTTZ","Komp.Feiertg.f.Teilzeiter"]
[null,"B_Ferien","Ferien"]
[null,"B_KompAZ","Kompensation Arbeitstage"]
[null,"B_Arzt","Arztbesuch"]
[null,"B_Krank","Krankheit"]
[null,"B_BU","Berufsunfall"]
[null,"B_NBU","Nichtberufsunfall"]
[null,"B_MilZiv","Militär / Zivilschutz"]
[null,"B_WB","Weiterbildung"]
[null,"B_UUB","Unbezahlter Urlaub"]
[null,"B_UB","Bezahlter Urlaub"]
[null,"B_NebenB","Nebenbeschäftigung"]
[null,"B_DAG","D A G",null,null,null,"Dienstaltersgeschenk"]
[null,"B_Divers","Diverses"]
[null,"B_FamPersErg","Fam./pers. Ereignisse"]
[null,"B_FZ1",{"$f":"IF(fZeile1=\"\",\"freie Zeile 1\",fZeile1)","v":"freie Zeile 1"},null,null,null,"Wird neu im Basisblatt bestimmt"]
[null,"B_FZ2",{"$f":"IF(fZeile2=\"\",\"freie Zeile 2\",fZeile2)","v":"freie Zeile 2"},null,null,null,"Wird neu im Basisblatt bestimmt"]
[null,"B_FEL","frei einsetzbare Lekt."]
[null,"B_TotalAZist","Total"]
[null,"B_Vortrag","Vortrag"]
[null,"B_Utraege","<<<  Überträge\n& Jahresanspruch"]
[]
[]
[]
[]
[]
[]
[]
[]
[]
[]
[]
[]
[]
[]
[]
[]
[]
[]
[]
[]
[]
[null,null,"Monatsenden",null,"Hyperlinkadresse Benutzerhilfe"]
[]
[null,null,1,{"$f":"DATE(SL_Jahr,C129,1)-1","v":"2024-01-31"},"http://www.vsa.zh.ch"]
[null,null,2,"2024-02-29"]
[null,null,3,"2024-03-31"]
[null,null,4,"2024-04-30"]
[null,null,5,"2024-05-31"]
[null,null,6,"2024-06-30"]
[null,null,7,"2024-07-31"]
[null,null,8,"2024-08-31"]
[null,null,9,"2024-09-30"]
[null,null,10,"2024-10-31"]
[null,null,11,"2024-11-30"]
[null,null,12,{"$f":"DATE(SL_Jahr,12,31)","v":"2024-12-31"}]