{"text_format":"3","workbook":"xlsx","n_sheets":4,"sheets":["Einstufung","Tabelle","Einreihung","Lohntabelle"],"not_rendered":{"images":2,"comments":1},"read":"whole","date_system":"1900"}

{"sheet":"Einstufung","index":0,"n_rows":50,"n_cols":27,"rows_kept":50,"merged":[[7,0,7,7],[7,10,7,19],[8,0,8,7],[8,8,9,8],[8,9,9,9],[8,12,8,19],[28,5,29,5],[31,5,32,5],[34,5,35,5],[37,3,38,5],[40,3,41,5],[43,0,43,23],[45,3,46,5],[47,0,47,7],[49,0,49,7]]}
["Berechnung nach Abschluss des Basisstudiums bzw. während des berufsintegrierten Studiums",{"$nulls":23},2022]
[]
["Geburtsjahr",{"$nulls":17},"KG","SHP","KGst","IF"]
["Schulstufe",{"$nulls":17},"PL",null,"Gst","EK"]
["SHP-Diplom",{"$nulls":17},"SL",null,"Pst","KK"]
["Stufenfremde Tätigkeit",{"$nulls":17},"S2",null,"Sst","AK"]
["Sonderpädagogische Tätigkeit",null,{"$f":"IF(CONCATENATE(B4,B5,B6,B7)=\"\",1,CONCATENATE(B4,B5,B6,B7))","v":1}]
["Berechnung Jahre Unterrrichts- und Berufstätigkeiten",{"$nulls":7},"Einstufungstabelle",null,"Tabelle für Kategorienwechsel"]
["Einreihung in die Lohnstufe",{"$nulls":7},"Anrechen-bare Jahre","Lohnstufe","Lohnstufe",null,"Stufenfremde Tätgkeit"]
[{"$nulls":10},"bisher","SHP","I, II -> III","III -> I, II","III -> IV","IV -> III","I, II -> IV","IV -> I, II","S2 -> IV","S2 -> III"]
["Alter",{"$f":"IF(B3=\"\",\"\",Y1-B3)","v":""},{"$nulls":6},"39-40",20,27,26,25,26,25,26,23,25,25,24]
[{"$nulls":8},38,19,26,25,24,25,24,25,22,24,24,23]
["Ausbildungsjahre",{"$f":"IF(B4=\"\",\"\",IF(B4=\"KG\",22,IF(B4=\"PL\",23,IF(B4=\"SL\",24,FALSE))))","v":""},null,"Kiga 22; Primar 23; Sekundar 24",{"$nulls":4},"33-37",17,25,24,23,24,23,24,21,23,23,22,{"$nulls":3},"B",null,null,"F"]
[{"$nulls":8},32,16,24,23,22,23,22,23,20,22,22,21]
["max. zu berechnen",{"$f":"IF(B11-B13<0,0,B11-B13)","v":{"$error":"#VALUE!"}},{"$nulls":6},31,14,23,22,21,22,21,22,19,21,21,20,{"$nulls":3},{"$f":"B15*12","v":{"$error":"#VALUE!"}}]
[{"$nulls":8},"26-30",13,22,21,20,21,20,21,18,20,20,19]
["davon:",{"$nulls":7},25,13,21,20,19,20,19,20,17,19,19,18]
["Unterrichtstätigkeit zu 100 %",0,"/",0,null,{"$f":"INT(AA18/12)","v":{"$error":"#VALUE!"}},"/",{"$f":"AA18-F18*12","v":{"$error":"#VALUE!"}},24,12,{"$nulls":13},{"$f":"B18*12+D18","v":0},null,null,{"$f":"IF(X18>X15,X15,X18)","v":{"$error":"#VALUE!"}}]
["gemäss LPVO § 16 Abs. 2 lit a.",{"$nulls":7},23,12,20,19,18,19,18,19,16,18,18,17]
[{"$nulls":8},22,12,19,18,17,18,17,18,15,17,17,16]
["Unterrichtstätigkeit zu 75 %",1,"/",0,null,{"$f":"INT(AA21/12)","v":{"$error":"#VALUE!"}},"/",{"$f":"AA21-F21*12","v":{"$error":"#VALUE!"}},21,12,18,17,16,17,16,17,14,16,16,15,{"$nulls":3},{"$f":"IF(X15>X18,X15-X18,IF(OR(X18>X15,X15=X18),0))","v":{"$error":"#VALUE!"}},{"$f":"B21*12+D21","v":12},null,{"$f":"IF(Y21<X21,INT(Y21/4*3),INT(X21/4*3))","v":{"$error":"#VALUE!"}}]
["gemäss LPVO § 16 Abs. 2 lit b.",{"$nulls":7},20,12,17,16,15,16,15,16,13,15,15,14]
[{"$nulls":8},19,10,16,15,14,15,14,15,12,14,14,13]
["andere Tätigkeiten zu 50 %",{"$f":"INT(X24/12)","v":{"$error":"#VALUE!"}},"/",{"$f":"X24-B24*12","v":{"$error":"#VALUE!"}},null,{"$f":"INT(AA24/12)","v":{"$error":"#VALUE!"}},"/",{"$f":"AA24-F24*12","v":{"$error":"#VALUE!"}},18,10,{"$nulls":13},{"$f":"IF(X18>X15, 0,IF(Y21>X21,X15-X18-X21,X15-X18-Y21))","v":{"$error":"#VALUE!"}},null,null,{"$f":"INT(X24/2)","v":{"$error":"#VALUE!"}}]
["gemäss LPVO § 16 Abs. 2 lit c.",{"$nulls":7},17,9,15,14,13,14,13,14,11,13,13,12]
[{"$nulls":8},16,9,14,13,12,13,12,13,10,12,12,11]
["Total angerechnet",{"$nulls":4},{"$f":"INT(AA27/12)","v":{"$error":"#VALUE!"}},"/",{"$f":"AA27-F27*12","v":{"$error":"#VALUE!"}},15,9,13,12,11,12,11,12,9,11,11,10,{"$nulls":6},{"$f":"AA18+AA21+AA24","v":{"$error":"#VALUE!"}}]
[{"$nulls":8},14,8,12,12,10,11,11,11,8,10,10,9]
["Anrechenbare Jahre",{"$nulls":4},{"$f":"IF(F27>0,IF(F27>B15,B15,F27),0)","v":{"$error":"#VALUE!"}},null,null,13,8,11,11,6,10,10,10,7,9,9,8]
["Unterrichs- und Berufstätigkeit",{"$nulls":7},12,8]
[{"$nulls":8},11,7,10,10,8,9,9,9,6,8,8,7]
["Lohnstufe",{"$nulls":4},{"$f":"IF(B4=\"\",\"\",IF(AND(OR(B4=\"SL\",B4=\"S2\"),VLOOKUP(F29,Tabelle!A:B,2)=-1),1,VLOOKUP(F29,Tabelle!A:B,2)))","v":""},null,null,10,7,9,9,7,8,8,8,5,7,7,6]
["gemäss Einstufungs-Tabelle",{"$nulls":7},9,6,8,8,6,7,7,7,4,6,6,5]
[{"$nulls":8},8,5,7,7,5,6,6,6,3,5,5,4]
["Kategorienwechsel",{"$nulls":4},{"$f":"IF(OR(VLOOKUP(C7,Einreihung!A:C,2,FALSE)=0,VLOOKUP(C7,Einreihung!A:C,2,FALSE)=16),\"\",IF(AND(AND(OR(B4=\"PL\",B4=\"SL\"),B6<>\"KGst\"),VLOOKUP(F32,#REF!,VLOOKUP(C7,Einreihung!A:C,2,FALSE),FALSE)=-1),1,VLOOKUP(F32,#REF!,VLOOKUP(C7,Einreihung!A:C,2,FALSE),FALSE)))","v":{"$error":"#REF!"}},null,null,7,4,6,6,4,5,5,5,2,4,4,3]
["Lohnstufe",{"$nulls":7},6,4]
["gemäss Tabelle für Kategorienwechsel",{"$nulls":7},5,4,5,5,3,4,4,4,1,3,3,2]
[{"$nulls":3},{"$f":"IF(VLOOKUP(C7,Einreihung!A:C,2,FALSE)=15,\"\",IF(VLOOKUP(C7,Einreihung!A:C,2,FALSE)=16,\"\",CONCATENATE(VLOOKUP(C7,Einreihung!A:C,3,FALSE),IF(F29=\"\",\"\",\".\"),IF(F35=\"\",F32,F35))))","v":""},{"$nulls":4},4,4,4,4,2,3,3,3,1,2,2,1]
["Lohneinreihung",{"$nulls":7},3,4,3,3,1,2,2,2,2,1,1,1]
[{"$nulls":8},2,3,2,2,1,1,1,1,1,1,1,1]
["Jahresgrundlohn in Franken",null,null,{"$f":"IF(OR(D38=\"\",D38=\"falsch\"),\"\",VLOOKUP(IF(F35=\"\",F32,F35),Lohntabelle!A:G,VLOOKUP(C7,Einreihung!A:D,4,FALSE),FALSE)*0.9)","v":""},{"$nulls":4},1,2,1,1,1,1,1,1,1,1,1,1]
["bei 100 % Beschäftigungsgrad inkl. 13. Monatslohn",{"$nulls":7},0,1,1,1,1,1,1,1,1,1,1,1]
[]
["Dies ist der Minimallohn. \nBei Studierenden, welche bereits als Lehrperson unterrichtet haben, kann der Lohn auch höher ausfallen."]
[]
["Bruttomonatslohn in Franken (13 Teile)",null,null,{"$f":"IF(D41=\"\",\"\",D41/13)","v":""}]
["bei 100 % Beschäftigungsgrad, ca. "]
[]
[]
["Vorbehalt: Diese Berechnung der Lohneinstufung ist nicht rechtsverbindlich."]

{"sheet":"Tabelle","index":1,"n_rows":47,"n_cols":2,"rows_kept":47}
[0,1]
[1,2]
[2,3]
[3,4]
[4,4]
[5,5]
[6,6]
[7,6]
[8,7]
[9,8]
[10,8]
[11,8]
[12,8]
[13,8]
[14,9]
[15,10]
[16,11]
[17,11]
[18,12]
[19,12]
[20,12]
[21,13]
[22,13]
[23,13]
[24,14]
[25,14]
[26,14]
[27,14]
[28,14]
[29,14]
[30,14]
[31,16]
[32,16]
[33,16]
[34,16]
[35,16]
[36,16]
[37,16]
[38,18]
[39,19]
[40,19]
[41,19]
[42,19]
[43,19]
[44,22]
[45,23]
[46,23]

{"sheet":"Einreihung","index":2,"n_rows":181,"n_cols":5,"rows_kept":181}
["KG",null,"09.03",6]
["KGSHP",null,"09.03",6]
["KGKGst",14,"nicht möglich"]
["KGPst",4,"10.01",2,12]
["KGSst",5,"12.01",4]
["KGSHPKGst",14,"nicht möglich"]
["KGSHPPst",4,"10.01",2,12]
["KGSHPSst",5,"12.01",4]
["KGIF",3,"09.03",6]
["KGEK",14,"nicht möglich"]
["KGKK",14,"nicht möglich"]
["KGAK",14,"nicht möglich"]
["KGSHPIF",2,"09.04",7,12]
["KGSHPEK",14,"nicht möglich"]
["KGSHPKK",14,"nicht möglich"]
["KGSHPAK",14,"nicht möglich"]
["KGKGstIF",14,"nicht möglich"]
["KGKGstEK",14,"nicht möglich"]
["KGKGstKK",14,"nicht möglich"]
["KGKGstAK",14,"nicht möglich"]
["KGPstIF",4,"10.01",2]
["KGPstEK",4,"10.01",2]
["KGPstKK",4,"10.01",2]
["KGPstAK",4,"10.01",2]
["KGSstIF",5,"12.01",4]
["KGSstEK",14,"nicht möglich"]
["KGSstKK",5,"12.01",4]
["KGSstAK",5,"12.01",4]
["KGSHPKGstIF",14,"nicht möglich"]
["KGSHPKGstEK",14,"nicht möglich"]
["KGSHPKGstKK",14,"nicht möglich"]
["KGSHPKGstAK",14,"nicht möglich"]
["KGSHPPstIF",2,"11.01",3,14]
["KGSHPPstEK",2,"11.01",3,14]
["KGSHPPstKK",2,"11.01",3,14]
["KGSHPPstAK",4,"10.01",2]
["KGSHPSstIF",2,"12.02",5,16]
["KGSHPSstEK",14,"nicht möglich"]
["KGSHPSstKK",2,"12.02",5,16]
["KGSHPSstAK",5,"12.01",4]
["PL",null,"10.01",2]
["PLSHP",null,"10.01",2]
["PLKGst",6,"09.03",6]
["PLPst",14,"nicht möglich"]
["PLSst",8,"12.01",4,14]
["PLSHPKGst",6,"09.03",6]
["PLSHPPst",14,"nicht möglich"]
["PLSHPSst",9,"12.01",4]
["PLIF",null,"10.01",2]
["PLEK",null,"10.01",2]
["PLKK",null,"10.01",2]
["PLAK",null,"10.01",2]
["PLSHPIF",2,"11.01",3,14]
["PLSHPEK",2,"11.01",3,14]
["PLSHPKK",2,"11.01",3,14]
["PLSHPAK",null,"10.01",2]
["PLKGstIF",7,"09.03",6]
["PLKGstEK",14,"nicht möglich"]
["PLKGstKK",14,"nicht möglich"]
["PLKGstAK",14,"nicht möglich"]
["PLPstIF",14,"nicht möglich"]
["PLPstEK",14,"nicht möglich"]
["PLPstKK",14,"nicht möglich"]
["PLPstAK",14,"nicht möglich"]
["PLSstIF",8,"12.01",4]
["PLSstEK",14,"nicht möglich"]
["PLSstKK",8,"12.01",4]
["PLSstAK",8,"12.01",4,14]
["PLSHPKGstIF",2,"09.04",7,12]
["PLSHPKGstEK",14,"nicht möglich"]
["PLSHPKGstKK",14,"nicht möglich"]
["PLSHPKGstAK",14,"nicht möglich"]
["PLSHPPstIF",14,"nicht möglich"]
["PLSHPPstEK",14,"nicht möglich"]
["PLSHPPstKK",14,"nicht möglich"]
["PLSHPPstAK",14,"nicht möglich"]
["PLSHPSstIF",2,"12.02",5,15]
["PLSHPSstEK",14,"nicht möglich"]
["PLSHPSstKK",2,"12.02",5,15]
["PLSHPSstAK",8,"12.01",4]
["SL",null,"12.01",4]
["SLSHP",null,"12.01",4]
["SLKGst",9,"09.03",6]
["SLPst",11,"10.01",2,17]
["SLSst",14,"nicht möglich"]
["SLSHPKGst",9,"09.03",6]
["SLSHPPst",11,"10.01",2,17]
["SLSHPSst",14,"nicht möglich"]
["SLIF",null,"12.01",4]
["SLEK",14,"nicht möglich"]
["SLKK",null,"12.01",4]
["SLAK",null,"12.01",4]
["SLSHPIF",2,"12.02",5,16]
["SLSHPEK",14,"nicht möglich"]
["SLSHPKK",2,"12.02",5,16]
["SLSHPAK",null,"12.01",4]
["SLKGstIF",10,"09.03",6]
["SLKGstEK",15,"nicht möglich"]
["SLKGstKK",15,"nicht möglich"]
["SLKGstAK",15,"nicht möglich"]
["SLPstIF",11,"10.01",2]
["SLPstEK",11,"10.01",2]
["SLPstKK",11,"10.01",2]
["SLPstAK",11,"10.01",2,17]
["SLSstIF",14,"nicht möglich"]
["SLSstEK",14,"nicht möglich"]
["SLSstKK",14,"nicht möglich"]
["SLSstAK",14,"nicht möglich"]
["SLSHPKGstIF",2,"09.04",7,12]
["SLSHPKGstEK",14,"nicht möglich"]
["SLSHPKGstKK",14,"nicht möglich"]
["SLSHPKGstAK",14,"nicht möglich"]
["SLSHPPstIF",2,"11.01",3,14]
["SLSHPPstEK",2,"11.01",3,14]
["SLSHPPstKK",2,"11.01",3,14]
["SLSHPPstAK",11,"10.01",2]
["SLSHPSstIF",14,"nicht möglich"]
["SLSHPSstEK",14,"nicht möglich"]
["SLSHPSstKK",14,"nicht möglich"]
["SLSHPSstAK",14,"nicht möglich"]
["S2",14,"nicht möglich"]
["S2SHP",14,"nicht möglich"]
["S2KGst",14,"nicht möglich"]
["S2Pst",12,"10.01",2,17]
["S2Sst",13,"12.01",4]
["S2SHPKGst",14,"nicht möglich"]
["S2SHPPst",12,"10.01",2,17]
["S2SHPSst",13,"12.01",4]
["S2IF",14,"nicht möglich"]
["S2EK",14,"nicht möglich"]
["S2KK",14,"nicht möglich"]
["S2AK",14,"nicht möglich"]
["S2SHPIF",14,"nicht möglich",null,16]
["S2SHPEK",14,"nicht möglich"]
["S2SHPKK",14,"nicht möglich",null,16]
["S2SHPAK",14,"nicht möglich"]
["S2KGstIF",14,"nicht möglich"]
["S2KGstEK",14,"nicht möglich"]
["S2KGstKK",14,"nicht möglich"]
["S2KGstAK",14,"nicht möglich"]
["S2PstIF",12,"10.01",2]
["S2PstEK",12,"10.01",2]
["S2PstKK",12,"10.01",2]
["S2PstAK",12,"10.01",2,17]
["S2SstIF",13,"12.01",4]
["S2SstEK",14,"nicht möglich"]
["S2SstKK",13,"12.01",4]
["S2SstAK",13,"12.01",4]
["S2SHPKGstIF",2,"09.04",7,12]
["S2SHPKGstEK",14,"nicht möglich"]
["S2SHPKGstKK",14,"nicht möglich"]
["S2SHPKGstAK",14,"nicht möglich"]
["S2SHPPstIF",2,"11.01",3,14]
["S2SHPPstEK",2,"11.01",3,14]
["S2SHPPstKK",2,"11.01",3,14]
["S2SHPPstAK",12,"10.01",2]
["S2SHPSstIF",2,"12.02",5]
["S2SHPSstEK",14,"nicht möglich"]
["S2SHPSstKK",2,"12.02",5]
["S2SHPSstAK",13,"12.01",4]
["SHP",14,"nicht möglich"]
["SHPKGst",14,"nicht möglich"]
["SHPPst",14,"nicht möglich"]
["SHPSst",14,"nicht möglich"]
["SHPIF",14,"nicht möglich"]
["SHPEK",14,"nicht möglich"]
["SHPKK",14,"nicht möglich"]
["SHPAK",14,"nicht möglich"]
["SHPKGstIF",2,"09.04",7]
["SHPPstIF",2,"11.01",3]
["SHPSstIF",2,"12.02",5]
["SHPKGstEK",2,"11.01",3]
["SHPKGstKK",14,"nicht möglich"]
["SHPKGstAK",14,"nicht möglich"]
["SHPPstEK",2,"11.01",3]
["SHPPstKK",2,"11.01",3]
["SHPPstAK",14,"nicht möglich"]
["SHPSstEK",14,"nicht möglich"]
["SHPSstKK",2,"12.02",5]
["SHPSstAK",14,"nicht möglich"]
[1,15,"nicht möglich"]

{"sheet":"Lohntabelle","index":3,"n_rows":28,"n_cols":7,"rows_kept":28}
["Stufe","LR 10.01","LR 11.01","LR 12.01","LR 12.02","LR 09.03","LR 09.04"]
[1,{"v":93042,"d":"93,042"},{"v":98592,"d":"98,592"},{"v":98592,"d":"98,592"},{"v":105499,"d":"105,499"},{"v":87191,"d":"87,191"},{"v":93042,"d":"93,042"}]
[2,{"v":96483,"d":"96,483"},{"v":102273,"d":"102,273"},{"v":102273,"d":"102,273"},{"v":109440,"d":"109,440"},{"v":90408,"d":"90,408"},{"v":96483,"d":"96,483"}]
[3,{"v":99109,"d":"99,109"},{"v":105956,"d":"105,956"},{"v":105956,"d":"105,956"},{"v":113377,"d":"113,377"},{"v":93630,"d":"93,630"},{"v":99109,"d":"99,109"}]
[4,{"v":102550,"d":"102,550"},{"v":109633,"d":"109,633"},{"v":109633,"d":"109,633"},{"v":116505,"d":"116,505"},{"v":96850,"d":"96,850"},{"v":102550,"d":"102,550"}]
[5,{"v":105988,"d":"105,988"},{"v":113314,"d":"113,314"},{"v":113314,"d":"113,314"},{"v":120443,"d":"120,443"},{"v":99258,"d":"99,258"},{"v":105988,"d":"105,988"}]
[6,{"v":109430,"d":"109,430"},{"v":116179,"d":"116,179"},{"v":116179,"d":"116,179"},{"v":124383,"d":"124,383"},{"v":102476,"d":"102,476"},{"v":109430,"d":"109,430"}]
[7,{"v":112870,"d":"112,870"},{"v":119859,"d":"119,859"},{"v":119859,"d":"119,859"},{"v":128325,"d":"128,325"},{"v":105696,"d":"105,696"},{"v":112870,"d":"112,870"}]
[8,{"v":115494,"d":"115,494"},{"v":123537,"d":"123,537"},{"v":123537,"d":"123,537"},{"v":132264,"d":"132,264"},{"v":108919,"d":"108,919"},{"v":115494,"d":"115,494"}]
[9,{"v":118935,"d":"118,935"},{"v":127217,"d":"127,217"},{"v":127217,"d":"127,217"},{"v":136201,"d":"136,201"},{"v":112137,"d":"112,137"},{"v":118935,"d":"118,935"}]
[10,{"v":122376,"d":"122,376"},{"v":130899,"d":"130,899"},{"v":130899,"d":"130,899"},{"v":140143,"d":"140,143"},{"v":115359,"d":"115,359"},{"v":122376,"d":"122,376"}]
[11,{"v":125817,"d":"125,817"},{"v":134578,"d":"134,578"},{"v":134578,"d":"134,578"},{"v":144081,"d":"144,081"},{"v":117763,"d":"117,763"},{"v":125817,"d":"125,817"}]
[12,{"v":127292,"d":"127,292"},{"v":136156,"d":"136,156"},{"v":136156,"d":"136,156"},{"v":145770,"d":"145,770"},{"v":119144,"d":"119,144"},{"v":127292,"d":"127,292"}]
[13,{"v":128766,"d":"128,766"},{"v":137733,"d":"137,733"},{"v":137733,"d":"137,733"},{"v":147460,"d":"147,460"},{"v":120522,"d":"120,522"},{"v":128766,"d":"128,766"}]
[14,{"v":130242,"d":"130,242"},{"v":139309,"d":"139,309"},{"v":139309,"d":"139,309"},{"v":149149,"d":"149,149"},{"v":121905,"d":"121,905"},{"v":130242,"d":"130,242"}]
[15,{"v":131712,"d":"131,712"},{"v":140886,"d":"140,886"},{"v":140886,"d":"140,886"},{"v":150836,"d":"150,836"},{"v":123284,"d":"123,284"},{"v":131712,"d":"131,712"}]
[16,{"v":133189,"d":"133,189"},{"v":142464,"d":"142,464"},{"v":142464,"d":"142,464"},{"v":152524,"d":"152,524"},{"v":124663,"d":"124,663"},{"v":133189,"d":"133,189"}]
[17,{"v":134662,"d":"134,662"},{"v":144040,"d":"144,040"},{"v":144040,"d":"144,040"},{"v":154214,"d":"154,214"},{"v":126046,"d":"126,046"},{"v":134662,"d":"134,662"}]
[18,{"v":136139,"d":"136,139"},{"v":145616,"d":"145,616"},{"v":145616,"d":"145,616"},{"v":155901,"d":"155,901"},{"v":127424,"d":"127,424"},{"v":136139,"d":"136,139"}]
[19,{"v":137611,"d":"137,611"},{"v":147193,"d":"147,193"},{"v":147193,"d":"147,193"},{"v":157590,"d":"157,590"},{"v":128803,"d":"128,803"},{"v":137611,"d":"137,611"}]
[20,{"v":139087,"d":"139,087"},{"v":148772,"d":"148,772"},{"v":148772,"d":"148,772"},{"v":159279,"d":"159,279"},{"v":130184,"d":"130,184"},{"v":139087,"d":"139,087"}]
[21,{"v":140563,"d":"140,563"},{"v":150349,"d":"150,349"},{"v":150349,"d":"150,349"},{"v":160968,"d":"160,968"},{"v":131565,"d":"131,565"},{"v":140563,"d":"140,563"}]
[22,{"v":142035,"d":"142,035"},{"v":151925,"d":"151,925"},{"v":151925,"d":"151,925"},{"v":162657,"d":"162,657"},{"v":132944,"d":"132,944"},{"v":142035,"d":"142,035"}]
[23,{"v":143509,"d":"143,509"},{"v":153505,"d":"153,505"},{"v":153505,"d":"153,505"},{"v":164344,"d":"164,344"},{"v":134325,"d":"134,325"},{"v":143509,"d":"143,509"}]
[24,{"v":144985,"d":"144,985"},{"v":155081,"d":"155,081"},{"v":155081,"d":"155,081"},{"v":166032,"d":"166,032"},{"v":135703,"d":"135,703"},{"v":144985,"d":"144,985"}]
[25,{"v":146459,"d":"146,459"},{"v":156658,"d":"156,658"},{"v":156658,"d":"156,658"},{"v":167720,"d":"167,720"},{"v":137083,"d":"137,083"},{"v":146459,"d":"146,459"}]
[26,{"v":147933,"d":"147,933"},{"v":158234,"d":"158,234"},{"v":158234,"d":"158,234"},{"v":169410,"d":"169,410"},{"v":138461,"d":"138,461"},{"v":147933,"d":"147,933"}]
[27,{"v":149410,"d":"149,410"},{"v":159810,"d":"159,810"},{"v":159810,"d":"159,810"},{"v":171098,"d":"171,098"},{"v":139840,"d":"139,840"},{"v":149410,"d":"149,410"}]