{"text_format":"3","workbook":"xlsx","n_sheets":5,"sheets":["Einstufung","Tabelle","Kategorienwechsel","Einreihung","Lohntabelle"],"not_rendered":{"images":2,"defined_names":1,"comments":1},"read":"whole","date_system":"1900"}

{"sheet":"Einstufung","index":0,"n_rows":41,"n_cols":23,"rows_kept":41,"merged":[[0,1,0,7],[6,0,6,7],[6,10,6,15],[7,0,7,7],[7,8,8,8],[7,9,8,9],[7,12,7,15],[27,5,28,5],[30,5,31,5],[33,5,34,5],[36,3,37,5],[39,3,40,5]]}
["Name, Vorname",{"$nulls":14},2024]
["Geburtsjahr",{"$nulls":13},"KG","SHP","KGst","IF"]
["Grundausbildung",{"$nulls":13},"PL",null,"Gst","EK"]
["SHP-Diplom",{"$nulls":13},"SL",null,"Pst","KK"]
["Stufenfremde Tätigkeit",{"$nulls":13},"S2",null,"Sst","AK"]
["Sonderpädagogische Tätigkeit",null,{"$f":"IF(CONCATENATE(B3,B4,B5,B6)=\"\",1,CONCATENATE(B3,B4,B5,B6))","v":1}]
["Berechnung Jahre Unterrrichts- und Berufstätigkeiten",{"$nulls":7},"Einstufungstabelle",null,"Tabelle für Kategorienwechsel"]
["Einreihung in die Lohnstufe",{"$nulls":7},"Anrechen-bare Jahre","Lohnstufe","Lohnstufe"]
[{"$nulls":10},"bisher","SHP","III -> IV","IV -> III","S2 -> IV","S2 -> III"]
["Alter",{"$f":"P1-B2","v":2024},{"$nulls":6},46,22,27,26,25,26,25,24]
[{"$nulls":8},"41-45",20,26,25,24,25,24,23]
["Ausbildungsjahre",{"$f":"IF(B3=\"KG\",23,IF(B3=\"PL\",23,IF(B3=\"SL\",24,IF(B4=\"SHP\",24,IF(B3=\"S2\",24,FALSE)))))","v":false},null,"Kiga 23; Primar 23; Sekundar 24",{"$nulls":4},40,18,25,24,23,24,23,22,{"$nulls":3},"B",null,null,"F"]
[{"$nulls":8},39,16,24,23,22,23,22,21]
["max. zu berechnen",{"$f":"IF(B10-B12<0,0,B10-B12)","v":2024},{"$nulls":6},"33-38",16,23,22,21,22,21,20,{"$nulls":3},{"$f":"B14*12","v":24288}]
[{"$nulls":8},"26-32",15,22,21,20,21,20,19]
["davon:",{"$nulls":7},25,13,21,20,19,20,19,18]
["Unterrichtstätigkeit zu 100 %",0,"/",null,null,{"$f":"INT(W17/12)","v":0},"/",{"$f":"W17-F17*12","v":0},24,13,{"$nulls":9},{"$f":"B17*12+D17","v":0},null,null,{"$f":"IF(T17>T14,T14,T17)","v":0}]
["gemäss LPVO § 16 Abs. 2 lit a.",{"$nulls":7},23,13,20,19,18,19,18,17]
[{"$nulls":8},22,13,19,18,17,18,17,16]
["Unterrichtstätigkeit zu 75 %",null,"/",null,null,{"$f":"INT(W20/12)","v":0},"/",{"$f":"W20-F20*12","v":0},21,13,18,17,16,17,16,15,{"$nulls":3},{"$f":"IF(T14>T17,T14-T17,IF(OR(T17>T14,T14=T17),0))","v":24288},{"$f":"B20*12+D20","v":0},null,{"$f":"IF(U20<T20,INT(U20/4*3),INT(T20/4*3))","v":0}]
["gemäss LPVO § 16 Abs. 2 lit b.",{"$nulls":7},20,13,17,16,15,16,15,14]
[{"$nulls":8},19,13,16,15,14,15,14,13]
["andere Tätigkeiten zu 50 %",{"$f":"INT(T23/12)","v":2024},"/",{"$f":"T23-B23*12","v":0},null,{"$f":"INT(W23/12)","v":1012},"/",{"$f":"W23-F23*12","v":0},18,13,{"$nulls":9},{"$f":"IF(T17>T14, 0,IF(U20>T20,T14-T17-T20,T14-T17-U20))","v":24288},null,null,{"$f":"INT(T23/2)","v":12144}]
["gemäss LPVO § 16 Abs. 2 lit c.",{"$nulls":7},17,11,15,14,13,14,13,12]
[{"$nulls":8},16,10,14,13,12,13,12,11]
["Total angerechnet",{"$nulls":4},{"$f":"INT(W26/12)","v":1012},"/",{"$f":"W26-F26*12","v":0},15,9,13,12,11,12,11,10,{"$nulls":6},{"$f":"W17+W20+W23","v":12144}]
[{"$nulls":8},14,9,12,12,11,11,10,9]
["Anrechenbare Jahre",{"$nulls":4},{"$f":"IF(F26>0,IF(F26>B14,B14,F26),0)","v":1012},null,null,13,9,11,11,10,10,9,8]
["Unterrichs- und Berufstätigkeit",{"$nulls":7},12,9]
[{"$nulls":8},11,9,10,10,9,9,8,7]
["Lohnstufe",{"$nulls":4},{"$f":"IF(AND(OR(B2=\"SL\",B2=\"S2\"),VLOOKUP(F28,Tabelle!A:B,2)=-1),1,VLOOKUP(F28,Tabelle!A:B,2))","v":22},null,null,10,8,9,9,8,8,7,6]
["gemäss Einstufungs-Tabelle",{"$nulls":7},9,8,8,8,7,7,6,5]
[{"$nulls":8},8,6,7,7,6,6,5,4]
["Kategorienwechsel",{"$nulls":4},{"$f":"IF(OR(VLOOKUP(C6,Einreihung!A:C,2,FALSE)=0,VLOOKUP(C6,Einreihung!A:C,2,FALSE)=16),\"\",IF(AND(AND(OR(B3=\"PL\",B3=\"SL\"),B5<>\"KGst\"),VLOOKUP(F31,Kategorienwechsel!A:N,VLOOKUP(C6,Einreihung!A:C,2,FALSE),FALSE)=-1),1,VLOOKUP(F31,Kategorienwechsel!A:N,VLOOKUP(C6,Einreihung!A:C,2,FALSE),FALSE)))","v":{"$error":"#REF!"}},null,null,7,6,6,6,5,5,4,3]
["Lohnstufe",{"$nulls":7},6,6]
["gemäss Tabelle für Kategorienwechsel",{"$nulls":7},5,4,5,5,4,4,3,2]
[{"$nulls":3},{"$f":"IF(VLOOKUP(C6,Einreihung!A:C,2,FALSE)=15,\"falsch\",IF(VLOOKUP(C6,Einreihung!A:C,2,FALSE)=16,\"\",CONCATENATE(VLOOKUP(C6,Einreihung!A:C,3,FALSE),IF(F28=\"\",\"\",\".\"),IF(F34=\"\",F31,F34))))","v":"falsch"},{"$nulls":4},4,4,4,4,3,3,2,1]
["Lohneinreihung",{"$nulls":7},3,4,3,3,2,2,1,1]
[{"$nulls":8},2,3,2,2,1,1,1,1]
["Jahresgrundlohn in Franken",null,null,{"$f":"IF(OR(D37=\"\",D37=\"falsch\"),\"\",VLOOKUP(IF(F34=\"\",F31,F34),Lohntabelle!A:E,VLOOKUP(C6,Einreihung!A:D,4,FALSE),FALSE))","v":""},{"$nulls":4},1,2,1,1,1,1,1,1]
["bei 100 % Beschäftigungsgrad inkl. 13. Monatslohn",{"$nulls":7},0,1,1,1,1,1,1,1]

{"sheet":"Tabelle","index":1,"n_rows":47,"n_cols":2,"rows_kept":47}
[0,1]
[1,2]
[2,3]
[3,4]
[4,4]
[5,4]
[6,6]
[7,6]
[8,6]
[9,8]
[10,8]
[11,9]
[12,9]
[13,9]
[14,9]
[15,9]
[16,10]
[17,11]
[18,13]
[19,13]
[20,13]
[21,13]
[22,13]
[23,13]
[24,13]
[25,13]
[26,15]
[27,15]
[28,15]
[29,15]
[30,15]
[31,15]
[32,15]
[33,16]
[34,16]
[35,16]
[36,16]
[37,16]
[38,16]
[39,16]
[40,18]
[41,20]
[42,20]
[43,20]
[44,20]
[45,20]
[46,22]

{"sheet":"Kategorienwechsel","index":2,"n_rows":45,"n_cols":14,"rows_kept":45,"merged":[[0,5,0,7],[0,8,0,10],[0,11,0,12]]}
["Ausgangsstufe","SHP","Kindergarten-LP",null,null,"Primar-LP (10.01)",null,null,"Sekundar-LP (12.01)",null,null,"S2-LP"]
[null,null,"IF","Pst","Sst","KGst","IF KGst","Sst","KGst","IF KGst","Pst","Pst","Sst"]
[null,null,10.01,10.01,12.01,10.01,10.01,12.01,10.01,10.01,10.01,10.01,12.01]
[1,1,1,1,1,1,1,1,1,1,1,1,1,"falsch"]
[2,2,2,2,1,2,2,1,1,1,1,1,1,"falsch"]
[3,3,3,3,2,3,3,2,2,2,2,1,1,"falsch"]
[4,4,4,4,3,4,4,3,3,3,3,1,2,"falsch"]
[5,5,5,5,4,5,5,4,4,4,4,2,3,"falsch"]
[6,6,6,6,5,6,6,5,5,5,5,3,4,"falsch"]
[7,7,7,8,6,7,7,6,6,6,6,4,5,"falsch"]
[8,8,8,8,7,8,8,7,7,7,7,5,6,"falsch"]
[9,9,9,9,8,9,9,8,8,8,8,6,7,"falsch"]
[10,10,10,10,9,10,10,9,9,9,9,7,8,"falsch"]
[11,11,11,11,10,11,11,10,10,10,10,8,9,"falsch"]
[12,12,12,12,11,12,12,11,11,11,11,9,10,"falsch"]
[13,12,13,13,11,13,13,11,12,12,12,10,11,"falsch"]
[14,13,14,14,12,14,14,12,13,13,13,11,12,"falsch"]
[15,14,15,15,13,15,15,13,14,14,14,12,13,"falsch"]
[16,15,16,16,14,16,16,14,15,15,15,13,14,"falsch"]
[17,16,17,17,15,17,17,15,16,16,16,14,15,"falsch"]
[18,17,18,18,16,18,18,16,17,17,17,15,16,"falsch"]
[19,18,19,19,18,19,19,17,18,18,18,16,17,"falsch"]
[20,19,20,20,18,20,20,18,19,19,19,17,18,"falsch"]
[21,20,21,21,19,21,21,19,20,20,20,18,19,"falsch"]
[22,21,22,22,20,22,22,20,21,21,21,19,20,"falsch"]
[23,22,23,23,21,23,23,21,22,22,22,20,21,"falsch"]
[24,23,24,24,22,24,24,22,23,23,23,21,22,"falsch"]
[25,24,25,25,23,25,25,23,24,24,24,22,23,"falsch"]
[26,25,26,26,24,26,26,24,25,25,25,23,24,"falsch"]
[27,26,27,27,25,27,27,25,26,26,26,24,25,"falsch"]
[]
[null,2,3,4,5,6,7,8,9,10,11,12,13,14]
[]
[]
[]
[null,null,2,5]
[null,null,3,4,20]
[null,null,6,14,22]
[null,null,7,8]
[null,null,9,16]
[null,null,10]
[null,null,11,12]
[null,null,17]
[null,null,18,19]
[null,null,23]

{"sheet":"Einreihung","index":3,"n_rows":181,"n_cols":5,"rows_kept":181}
["KG",null,"10.01",2]
["KGSHP",null,"10.01",2]
["KGKGst",14,"nicht möglich"]
["KGPst",null,"10.01",2,12]
["KGSst",5,"12.01",4]
["KGSHPKGst",14,"nicht möglich"]
["KGSHPPst",null,"10.01",2,12]
["KGSHPSst",5,"12.01",4]
["KGIF",null,"10.01",2]
["KGEK",14,"nicht möglich"]
["KGKK",14,"nicht möglich"]
["KGAK",14,"nicht möglich"]
["KGSHPIF",2,"11.01",3,12]
["KGSHPEK",14,"nicht möglich"]
["KGSHPKK",14,"nicht möglich"]
["KGSHPAK",14,"nicht möglich"]
["KGKGstIF",14,"nicht möglich"]
["KGKGstEK",14,"nicht möglich"]
["KGKGstKK",14,"nicht möglich"]
["KGKGstAK",14,"nicht möglich"]
["KGPstIF",null,"10.01",2]
["KGPstEK",null,"10.01",2]
["KGPstKK",null,"10.01",2]
["KGPstAK",null,"10.01",2]
["KGSstIF",5,"12.01",4]
["KGSstEK",14,"nicht möglich"]
["KGSstKK",5,"12.01",4]
["KGSstAK",5,"12.01",4]
["KGSHPKGstIF",14,"nicht möglich"]
["KGSHPKGstEK",14,"nicht möglich"]
["KGSHPKGstKK",14,"nicht möglich"]
["KGSHPKGstAK",14,"nicht möglich"]
["KGSHPPstIF",2,"11.01",3,14]
["KGSHPPstEK",2,"11.01",3,14]
["KGSHPPstKK",2,"11.01",3,14]
["KGSHPPstAK",4,"10.01",2]
["KGSHPSstIF",2,"12.02",5,16]
["KGSHPSstEK",14,"nicht möglich"]
["KGSHPSstKK",2,"12.02",5,16]
["KGSHPSstAK",5,"12.01",4]
["PL",null,"10.01",2]
["PLSHP",null,"10.01",2]
["PLKGst",null,"10.01",2]
["PLPst",14,"nicht möglich"]
["PLSst",8,"12.01",4,14]
["PLSHPKGst",null,"10.01",2]
["PLSHPPst",14,"nicht möglich"]
["PLSHPSst",9,"12.01",4]
["PLIF",null,"10.01",2]
["PLEK",null,"10.01",2]
["PLKK",null,"10.01",2]
["PLAK",null,"10.01",2]
["PLSHPIF",2,"11.01",3,14]
["PLSHPEK",2,"11.01",3,14]
["PLSHPKK",2,"11.01",3,14]
["PLSHPAK",null,"10.01",2]
["PLKGstIF",null,"10.01",2]
["PLKGstEK",14,"nicht möglich"]
["PLKGstKK",14,"nicht möglich"]
["PLKGstAK",14,"nicht möglich"]
["PLPstIF",14,"nicht möglich"]
["PLPstEK",14,"nicht möglich"]
["PLPstKK",14,"nicht möglich"]
["PLPstAK",14,"nicht möglich"]
["PLSstIF",8,"12.01",4]
["PLSstEK",14,"nicht möglich"]
["PLSstKK",8,"12.01",4]
["PLSstAK",8,"12.01",4,14]
["PLSHPKGstIF",2,"11.01",3,12]
["PLSHPKGstEK",14,"nicht möglich"]
["PLSHPKGstKK",14,"nicht möglich"]
["PLSHPKGstAK",14,"nicht möglich"]
["PLSHPPstIF",14,"nicht möglich"]
["PLSHPPstEK",14,"nicht möglich"]
["PLSHPPstKK",14,"nicht möglich"]
["PLSHPPstAK",14,"nicht möglich"]
["PLSHPSstIF",2,"12.02",5,15]
["PLSHPSstEK",14,"nicht möglich"]
["PLSHPSstKK",2,"12.02",5,15]
["PLSHPSstAK",8,"12.01",4]
["SL",null,"12.01",4]
["SLSHP",null,"12.01",4]
["SLKGst",11,"10.01",2]
["SLPst",11,"10.01",2,17]
["SLSst",14,"nicht möglich"]
["SLSHPKGst",22,"10.01",2]
["SLSHPPst",11,"10.01",2,17]
["SLSHPSst",14,"nicht möglich"]
["SLIF",null,"12.01",4]
["SLEK",14,"nicht möglich"]
["SLKK",null,"12.01",4]
["SLAK",null,"12.01",4]
["SLSHPIF",2,"12.02",5,16]
["SLSHPEK",14,"nicht möglich"]
["SLSHPKK",2,"12.02",5,16]
["SLSHPAK",null,"12.01",4]
["SLKGstIF",11,"10.01",2]
["SLKGstEK",15,"nicht möglich"]
["SLKGstKK",15,"nicht möglich"]
["SLKGstAK",15,"nicht möglich"]
["SLPstIF",11,"10.01",2]
["SLPstEK",11,"10.01",2]
["SLPstKK",11,"10.01",2]
["SLPstAK",11,"10.01",2,17]
["SLSstIF",14,"nicht möglich"]
["SLSstEK",14,"nicht möglich"]
["SLSstKK",14,"nicht möglich"]
["SLSstAK",14,"nicht möglich"]
["SLSHPKGstIF",2,"11.01",3,12]
["SLSHPKGstEK",14,"nicht möglich"]
["SLSHPKGstKK",14,"nicht möglich"]
["SLSHPKGstAK",14,"nicht möglich"]
["SLSHPPstIF",2,"11.01",3,14]
["SLSHPPstEK",2,"11.01",3,14]
["SLSHPPstKK",2,"11.01",3,14]
["SLSHPPstAK",11,"10.01",2]
["SLSHPSstIF",14,"nicht möglich"]
["SLSHPSstEK",14,"nicht möglich"]
["SLSHPSstKK",14,"nicht möglich"]
["SLSHPSstAK",14,"nicht möglich"]
["S2",14,"nicht möglich"]
["S2SHP",14,"nicht möglich"]
["S2KGst",14,"nicht möglich"]
["S2Pst",12,"10.01",2,17]
["S2Sst",13,"12.01",4]
["S2SHPKGst",14,"nicht möglich"]
["S2SHPPst",12,"10.01",2,17]
["S2SHPSst",13,"12.01",4]
["S2IF",14,"nicht möglich"]
["S2EK",14,"nicht möglich"]
["S2KK",14,"nicht möglich"]
["S2AK",14,"nicht möglich"]
["S2SHPIF",14,"nicht möglich",null,16]
["S2SHPEK",14,"nicht möglich"]
["S2SHPKK",14,"nicht möglich",null,16]
["S2SHPAK",14,"nicht möglich"]
["S2KGstIF",14,"nicht möglich"]
["S2KGstEK",14,"nicht möglich"]
["S2KGstKK",14,"nicht möglich"]
["S2KGstAK",14,"nicht möglich"]
["S2PstIF",12,"10.01",2]
["S2PstEK",12,"10.01",2]
["S2PstKK",12,"10.01",2]
["S2PstAK",12,"10.01",2,17]
["S2SstIF",13,"12.01",4]
["S2SstEK",14,"nicht möglich"]
["S2SstKK",13,"12.01",4]
["S2SstAK",13,"12.01",4]
["S2SHPKGstIF",2,"11.01",3,12]
["S2SHPKGstEK",14,"nicht möglich"]
["S2SHPKGstKK",14,"nicht möglich"]
["S2SHPKGstAK",14,"nicht möglich"]
["S2SHPPstIF",2,"11.01",3,14]
["S2SHPPstEK",2,"11.01",3,14]
["S2SHPPstKK",2,"11.01",3,14]
["S2SHPPstAK",12,"10.01",2]
["S2SHPSstIF",2,"12.02",5]
["S2SHPSstEK",14,"nicht möglich"]
["S2SHPSstKK",2,"12.02",5]
["S2SHPSstAK",13,"12.01",4]
["SHP",14,"nicht möglich"]
["SHPKGst",14,"nicht möglich"]
["SHPPst",14,"nicht möglich"]
["SHPSst",14,"nicht möglich"]
["SHPIF",14,"nicht möglich"]
["SHPEK",14,"nicht möglich"]
["SHPKK",14,"nicht möglich"]
["SHPAK",14,"nicht möglich"]
["SHPKGstIF",2,"11.01",3]
["SHPPstIF",2,"11.01",3]
["SHPSstIF",2,"12.02",5]
["SHPKGstEK",2,"11.01",3]
["SHPKGstKK",14,"nicht möglich"]
["SHPKGstAK",14,"nicht möglich"]
["SHPPstEK",2,"11.01",3]
["SHPPstKK",2,"11.01",3]
["SHPPstAK",14,"nicht möglich"]
["SHPSstEK",14,"nicht möglich"]
["SHPSstKK",2,"12.02",5]
["SHPSstAK",14,"nicht möglich"]
[1,15,"nicht möglich"]

{"sheet":"Lohntabelle","index":4,"n_rows":28,"n_cols":5,"rows_kept":28}
["Stufe","LR 10.01","LR 11.01","LR 12.01","LR 12.02"]
[1,{"v":97839,"d":"97,839"},{"v":103676,"d":"103,676"},{"v":103676,"d":"103,676"},{"v":110938,"d":"110,938"}]
[2,{"v":101458,"d":"101,458"},{"v":107547,"d":"107,547"},{"v":107547,"d":"107,547"},{"v":115082,"d":"115,082"}]
[3,{"v":104219,"d":"104,219"},{"v":111419,"d":"111,419"},{"v":111419,"d":"111,419"},{"v":119223,"d":"119,223"}]
[4,{"v":107837,"d":"107,837"},{"v":115286,"d":"115,286"},{"v":115286,"d":"115,286"},{"v":122512,"d":"122,512"}]
[5,{"v":111453,"d":"111,453"},{"v":119156,"d":"119,156"},{"v":119156,"d":"119,156"},{"v":126654,"d":"126,654"}]
[6,{"v":115072,"d":"115,072"},{"v":122169,"d":"122,169"},{"v":122169,"d":"122,169"},{"v":130796,"d":"130,796"}]
[7,{"v":118689,"d":"118,689"},{"v":126039,"d":"126,039"},{"v":126039,"d":"126,039"},{"v":134941,"d":"134,941"}]
[8,{"v":121449,"d":"121,449"},{"v":129907,"d":"129,907"},{"v":129907,"d":"129,907"},{"v":139083,"d":"139,083"}]
[9,{"v":125068,"d":"125,068"},{"v":133777,"d":"133,777"},{"v":133777,"d":"133,777"},{"v":143223,"d":"143,223"}]
[10,{"v":128686,"d":"128,686"},{"v":137648,"d":"137,648"},{"v":137648,"d":"137,648"},{"v":147369,"d":"147,369"}]
[11,{"v":132305,"d":"132,305"},{"v":141517,"d":"141,517"},{"v":141517,"d":"141,517"},{"v":151510,"d":"151,510"}]
[12,{"v":133855,"d":"133,855"},{"v":143176,"d":"143,176"},{"v":143176,"d":"143,176"},{"v":153286,"d":"153,286"}]
[13,{"v":135405,"d":"135,405"},{"v":144835,"d":"144,835"},{"v":144835,"d":"144,835"},{"v":155063,"d":"155,063"}]
[14,{"v":136957,"d":"136,957"},{"v":146492,"d":"146,492"},{"v":146492,"d":"146,492"},{"v":156839,"d":"156,839"}]
[15,{"v":138503,"d":"138,503"},{"v":148150,"d":"148,150"},{"v":148150,"d":"148,150"},{"v":158613,"d":"158,613"}]
[16,{"v":140057,"d":"140,057"},{"v":149809,"d":"149,809"},{"v":149809,"d":"149,809"},{"v":160388,"d":"160,388"}]
[17,{"v":141605,"d":"141,605"},{"v":151466,"d":"151,466"},{"v":151466,"d":"151,466"},{"v":162165,"d":"162,165"}]
[18,{"v":143158,"d":"143,158"},{"v":153124,"d":"153,124"},{"v":153124,"d":"153,124"},{"v":163940,"d":"163,940"}]
[19,{"v":144706,"d":"144,706"},{"v":154783,"d":"154,783"},{"v":154783,"d":"154,783"},{"v":165716,"d":"165,716"}]
[20,{"v":146258,"d":"146,258"},{"v":156443,"d":"156,443"},{"v":156443,"d":"156,443"},{"v":167492,"d":"167,492"}]
[21,{"v":147811,"d":"147,811"},{"v":158101,"d":"158,101"},{"v":158101,"d":"158,101"},{"v":169268,"d":"169,268"}]
[22,{"v":149358,"d":"149,358"},{"v":159758,"d":"159,758"},{"v":159758,"d":"159,758"},{"v":171044,"d":"171,044"}]
[23,{"v":150909,"d":"150,909"},{"v":161420,"d":"161,420"},{"v":161420,"d":"161,420"},{"v":172818,"d":"172,818"}]
[24,{"v":152460,"d":"152,460"},{"v":163077,"d":"163,077"},{"v":163077,"d":"163,077"},{"v":174592,"d":"174,592"}]
[25,{"v":154010,"d":"154,010"},{"v":164735,"d":"164,735"},{"v":164735,"d":"164,735"},{"v":176367,"d":"176,367"}]
[26,{"v":155561,"d":"155,561"},{"v":166392,"d":"166,392"},{"v":166392,"d":"166,392"},{"v":178144,"d":"178,144"}]
[27,{"v":157113,"d":"157,113"},{"v":168049,"d":"168,049"},{"v":168049,"d":"168,049"},{"v":179919,"d":"179,919"}]